Bisexual theology
type: Concept
is replaced by: homoit0001218
issued: 2019-05-14
modified: 2022-08-22
replaces: bisexualTheology
broader: LGBTQ+ theology
change note: Version 4.2.0
has top concept: LGBTQ+ theology
in scheme: v3

Female prostitution
type: Concept
is replaced by: homoit0000433
issued: 2019-05-14
modified: 2025-01-28
replaces: femaleProstitution
broader: Prostitution
change note: Version 4.2.0
has top concept: Sex industry
in scheme: v3

Gay political groups
type: Concept
issued: 2019-05-14
modified: 2025-02-23
replaces: gayPoliticalGroups
comment: Organized groups centered on political change and action for gay rights that may or may not be aligned with major political parties.
comment: Grupos organizados centrados en el cambio y la acción política por los derechos de los hombres gay, que pueden o no estar alineados con los principales partidos políticos.
broader: LGBTQ+ political groups
change note: Version 4.2.0
has top concept: LGBTQ+ political groups
in scheme: v3
preferred label: Grupos políticos gay

Gay theology
type: Concept
is replaced by: homoit0001218
issued: 2019-05-14
modified: 2022-08-22
replaces: gayTheology
broader: LGBTQ+ theology
change note: Version 4.2.0
has top concept: LGBTQ+ theology
in scheme: v3

Lesbian prostitution
type: Concept
is replaced by: homoit0000768
issued: 2019-05-14
modified: 2025-01-28
replaces: lesbianProstitution
broader: Prostitution
change note: Version 4.2.0
has top concept: Sex industry
in scheme: v3
preferred label: Prostitución lesbiana

Lesbian theology
type: Concept
is replaced by: homoit0001218
issued: 2019-05-14
modified: 2022-08-22
replaces: lesbianTheology
broader: LGBTQ+ theology
change note: Version 4.2.0
has top concept: LGBTQ+ theology
in scheme: v3

LGBTQ+ people with physical disabilities
type: Concept
is replaced by: homoit0001854
issued: 2019-05-14
modified: 2022-08-22
replaces: LGBTQPeopleWithPhysicalDisabilities
alternative label: People with physical disabilities (LGBTQ)
alternative label: LGBTQ people with physical disabilities
broader: LGBTQ+ people
change note: Version 4.2.0
has top concept: LGBTQ+ people
in scheme: v3
narrower: LGBTQ+ deaf people
narrower: LGBTQ+ people with visual disabilities

Male prostitution
type: Concept
is replaced by: homoit0000236
issued: 2019-05-14
modified: 2025-01-28
replaces: maleProstitution
broader: Prostitution
change note: Version 4.2.0
has top concept: Sex industry
in scheme: v3

Transgender theology
type: Concept
is replaced by: homoit0001218
issued: 2019-05-14
modified: 2022-08-22
replaces: transgenderTheology
broader: LGBTQ+ theology
change note: Version 4.2.0
has top concept: LGBTQ+ theology
in scheme: v3

Vaginoplasty
type: Concept
is replaced by: homoit0001851
issued: 2019-05-14
modified: 2022-08-15
replaces: vaginoplasty
broader: Gender-affirming surgery
broader: Bottom surgery
change note: Version 4.2.0
has top concept: Medical care
in scheme: v3
related: Vaginal dilation
related: Vaginectomy

Asexual fiction
type: Concept
is replaced by: homoit0001754
issued: 2023-03-23
modified: 2023-10-27
comment: Written works describing imagined events or people; use in reference to fictional works focusing on asexual characters or themes.
broader: LGBTQ+ fiction
change note: Version 4.2.0
has top concept: Subcultures
in scheme: v3
related: Bisexual characters
related: Bisexual literature
related: Bisexual authors
related: Asexual authors
related: Two-Spirit fiction
related: Intersex fiction
related: Aromantic fiction
related: Bisexual people in fandom
related: Greyromantic fiction

Asexual history
type: Concept
is replaced by: homoit0002267
issued: 2023-03-24
modified: 2023-10-27
comment: Past events or accounts of the past concerning asexual people, or people who might be perceived as asexual if they were alive today.
broader: LGBTQ+ history
change note: Version 4.2.0
has top concept: LGBTQ+ history
in scheme: v3

Two-Spirit children
type: Concept
is replaced by: homoit0002688
issued: 2023-06-26
issued: 2024-06-10
modified: 2025-02-23
modified: 2025-01-28
comment: Two-Spirit people who have not yet reached the age of adolescence.
alternative label: 2S children
alternative label: Two Spirit children
alternative label: Two Spirited children
alternative label: Two-Spirited children
broader: Children
change note: Version 4.2.0
has top concept: Family members
in scheme: v3
narrower: Two-Spirit daughters
narrower: Two-Spirit sons
related: LGBTQ+ children

Müllerian duct variations
type: Concept
is replaced by: homoit0002865
issued: 2023-06-28
modified: 2024-01-30
comment: People with XX chromosomes can have a broad range of variations in how their Müllerian ducts (which typically form the uterus, fallopian tubes, cervix, and upper portion of the vagina) develop. They might have a variation that causes their uterus to develop with a different shape than typical, or to be doubled. Others may have vaginal variations such as a “hemivagina” (where one side of the vagina is obstructed, which can sometimes block menstrual blood from exiting), or a band of tissue dividing the vaginal canal (known as a vaginal septum). Müllerian duct variations usually don’t cause someone to have any variations in their ovaries or hormone production.
alternative label: MRKH
alternative label: Müllerian agenesis
alternative label: Müllerian duct anomalies
broader: Intersex variations
change note: Version 4.2.0
has top concept: Sex (Body)
in scheme: v3

5-alpha reductase deficiency
type: Concept
issued: 2019-05-14
modified: 2025-02-23
replaces: 5AlphaReductaseDeficiency
comment: People with 5-alpha reductase deficiency, abbreviated as 5-ARD, have XY chromosomes, testes, and typical levels of testosterone, but their bodies do not have the enzyme responsible for converting testosterone to the more powerful androgen dihydrotestosterone (DHT). This affects how an individual's external sex characteristics develop, and people born with 5-ARD often have genital differences that are noticed at birth. In adolescence, people with 5-ARD typically develop some features associated with testosterone puberty, and they may experience genital growth at this point.
comment: Las personas con deficiencia de 5-alfa reductasa, abreviada como 5-ARD, tienen cromosomas XY, testículos y niveles típicos de testosterona, pero sus cuerpos no tienen la enzima responsable de convertir la testosterona en el andrógeno más potente dihidrotestosterona (DHT). Esto afecta el desarrollo de las características sexuales externas de la persona, y las personas que nacen con 5-ARD suelen presentar diferencias genitales que se notan al nacer. En la adolescencia, las personas con 5-ARD suelen desarrollar algunos rasgos asociados a la pubertad testosterona, y pueden experimentar crecimiento genital en dicho momento.
alternative label: 5-ARD
broader: Intersex variations
change note: Version 4.2.0
has top concept: Sex (Body)
in scheme: v3
preferred label: Deficiencia de 5-alfa reductasa

Acault
type: Concept
issued: 2019-05-14
modified: 2025-02-23
replaces: acault
comment: A commonly mistranslated Burmese term for people assigned male at birth who exhibit feminine behaviors while serving as spiritual mediums; there is some question over the legitimacy of term.
comment: Un término birmano, comúnmente mal traducido, para personas asignadas al sexo masculino al nacer que exhiben comportamientos femeninos mientras sirven como médiums espirituales; existen dudas sobre la legitimidad del término.
broader: Non-Euro-American gender and sexual identities
change note: Version 4.2.0
has top concept: Gender
in scheme: v3

LGBTQ+ Anglicans
type: Concept
issued: 2019-05-14
modified: 2025-02-23
replaces: LGBTQAnglicans
comment: LGBTQ+ people who are Anglican.
comment: Personas LGBTQ+ que son anglicanas.
alternative label: Anglicans (LGBTQ)
alternative label: LGBTQ Church of England
alternative label: LGBTQ Episcopalians
alternative label: LGBTQ Anglicans
broader: LGBTQ+ Protestants
change note: Version 4.2.0
has top concept: LGBTQ+ African religions
in scheme: v3
preferred label: Anglicanos LGBTQ+

Aphallia
type: Concept
issued: 2019-05-14
modified: 2025-02-23
replaces: aphallia
comment: People with aphallia have XY chromosomes, testes, and are born without a penis. They produce typical levels of testosterone, and they develop secondary sex characteristics associated with a typical testosterone puberty during adolescence.
comment: Las personas con afalia tienen cromosomas XY, testículos y nacen sin pene. Producen niveles típicos de testosterona y desarrollan características sexuales secundarias asociadas a una pubertad típica con testosterona durante la adolescencia.
alternative label: Penile agenesis
broader: Intersex variations
change note: Version 4.2.0
has top concept: Sex (Body)
in scheme: v3
preferred label: Afalia

Ashtime
type: Concept
issued: 2019-05-14
modified: 2025-02-23
replaces: ashtime
comment: Term used by the Maale people in Ethiopia for people assigned male at birth who exhibit feminine characteristics; there is some question over the legitimacy of term.
comment: Término utilizado por el pueblo Maale de Etiopía para las personas asignadas al sexo masculino al nacer que presentan características femeninas; hay cuestionamientos sobre la legitimidad del término.
broader: Non-Euro-American gender and sexual identities
change note: Version 4.2.0
has top concept: Gender
in scheme: v3

Aversion therapy
type: Concept
issued: 2019-05-14
modified: 2025-02-23
replaces: aversionTherapy
comment: Behavior modification therapy intended to displace pleasant associations evoked by homosexuality with unpleasant ones (in the form of electric shocks or nausea-inducing drugs) in order to shift the subject's homosexual orientation to a heterosexual one.
comment: Terapia de modificación de comportamiento que busca sustituir asociaciones placenteras evocadas por la homosexualidad con otras desagradables (utilizando descargas eléctricas o fármacos que provocan náuseas) con el fin de cambiar la orientación homosexual del sujeto por una heterosexual.
broader: Behavioral therapy
change note: Version 4.2.0
has top concept: Medical care
in scheme: v3
preferred label: Terapia de aversión
related: Conversion therapy

Aylonit
type: Concept
issued: 2019-05-14
modified: 2025-04-23
replaces: aylonit
comment: A romanized version of the Hebrew term traditionally used in Judaism to describe people assigned female at birth who develop secondary-sex characteristics perceived as "male" as well as fertility issues.
comment: Término hebreo que se refiere a una mujer con desarrollo masculino que suele ser infértil.
broader: Non-Euro-American gender and sexual identities
change note: Version 4.2.0
has top concept: Gender
in scheme: v3
preferred label: Ay'lonit

LGBTQ+ Baptists
type: Concept
issued: 2019-05-14
modified: 2025-02-23
replaces: LGBTQBaptists
comment: LGBTQ+ people who are Baptist.
comment: Personas LGBTQ+ que son bautistas.
alternative label: Baptists (LGBTQ)
alternative label: LGBTQ Baptists
broader: LGBTQ+ Protestants
change note: Version 4.2.0
has top concept: LGBTQ+ African religions
in scheme: v3
preferred label: Bautistas LGBTQ+

Binabae
type: Concept
issued: 2019-05-14
modified: 2025-02-23
replaces: binabae
comment: Tagalog term for individuals who possess both male and female traits.
comment: Término tagalog para designar a una persona con rasgos tanto masculinos como femeninos.
broader: Non-Euro-American gender and sexual identities
change note: Version 4.2.0
has top concept: Gender
in scheme: v3

Bisexual archives
type: Concept
issued: 2019-05-14
modified: 2025-02-23
replaces: bisexualArchives
comment: Collections of records and materials relating to bisexual people or bisexual communities; can include a variety of organizations and institutions from community to government archives.
comment: Colecciones de registros y materiales relacionados con personas bisexuales o comunidades bisexuales; pueden incluir una variedad de organizaciones e instituciones, desde archivos comunitarios hasta gubernamentales.
broader: LGBTQ+ archives
change note: Version 4.2.0
has top concept: LGBTQ+ cultural heritage institutions
in scheme: v3
preferred label: Archivos bisexuales

Bisexual artists
type: Concept
issued: 2019-05-14
modified: 2025-02-23
replaces: bisexualArtists
comment: Bisexual people who practice any of various creative arts.
comment: Artistas conocidos por ser bisexuales.
broader: LGBTQ+ artists
change note: Version 4.2.0
has top concept: LGBTQ+ people
in scheme: v3
preferred label: Artistas bisexuales

Bisexual atheists
type: Concept
issued: 2019-05-14
modified: 2025-02-23
replaces: bisexualAtheists
comment: Bisexual people who are atheists.
comment: Personas bisexuales que son ateas.
broader: LGBTQ+ atheists
change note: Version 4.2.0
has top concept: LGBTQ+ people
in scheme: v3
preferred label: Ateos bisexuales

Bisexual Buddhists
type: Concept
issued: 2019-05-14
modified: 2025-02-23
replaces: bisexualBuddhists
comment: Bisexual people who are Buddhist.
comment: Personas bisexuales que son budistas.
broader: LGBTQ+ Buddhists
change note: Version 4.2.0
has top concept: LGBTQ+ African religions
in scheme: v3
preferred label: Budistas bisexuales

Bisexual Christians
type: Concept
issued: 2019-05-14
modified: 2025-02-23
replaces: bisexualChristians
comment: Bisexual people who are Christian.
comment: Personas bisexuales que son cristianas.
alternative label: Cristianas bisexuales
alternative label: Cristianxs bisexuales
broader: LGBTQ+ Christians
change note: Version 4.2.0
has top concept: LGBTQ+ African religions
in scheme: v3
preferred label: Cristianos bisexuales

Bisexual daughters
type: Concept
issued: 2019-05-14
modified: 2025-02-23
replaces: bisexualDaughters
comment: Daughters who identify as bisexual.
comment: Hijas que se autoidentifican como bisexuales.
broader: LGBTQ+ daughters
change note: Version 4.2.0
has top concept: LGBTQ+ people
in scheme: v3
preferred label: Hijas bisexuales

Jewish bisexual people
type: Concept
issued: 2019-05-14
modified: 2025-02-23
replaces: bisexualJews
comment: Bisexual people who are Jewish.
comment: Personas bisexuales que son judías.
alternative label: Bisexual Jews
alternative label: Jewish bisexuals
alternative label: Judíos bisexuales
alternative label: Bisexuales judíos
broader: Jewish LGBTQ+ people
change note: Version 4.2.0
has top concept: LGBTQ+ people
in scheme: v3
preferred label: Personas bisexuales judías

Latino/a/x bisexual people
type: Concept
issued: 2019-05-14
modified: 2025-02-23
replaces: bisexualLatinx
comment: Latin American people who are bisexual; only use to describe individuals who self-identify as Latino, Latina, or Latinx. Do not conflate with Chicano/a/x or Hispanic.
comment: Personas latinoamericanas que son bisexuales; utilícese únicamente para describir a personas que se autoidentifican como latinos, latinas o latinxs. No debe confundirse con chicano/a/x o hispano/a/x.
alternative label: Bisexual Latinas
alternative label: Bisexual Latine people
alternative label: Bisexual Latinos
alternative label: Bisexual Latinx people
alternative label: Latina bisexual people
alternative label: Latine bisexual people
alternative label: Latino bisexual people
alternative label: Latinx bisexual people
broader: Latino/a/x LGBTQ+ people
change note: Version 4.2.0
has top concept: LGBTQ+ people
in scheme: v3
preferred label: Personas bisexuales Latinx

Bisexual libraries
type: Concept
issued: 2019-05-14
modified: 2025-02-23
replaces: bisexualLibraries
comment: Libraries that hold materials primarily pertaining to bisexual people or intended for use by bisexual people.
comment: Instituciones que brindan educación, apoyo e información sobre la bisexualidad y comunidades bisexuales a personas bisexuales.
broader: LGBTQ+ libraries
change note: Version 4.2.0
has top concept: LGBTQ+ cultural heritage institutions
in scheme: v3
preferred label: Centros de información bisexual

Bisexual dominants
type: Concept
issued: 2019-05-14
modified: 2025-02-23
replaces: bisexualMasters
comment: Bisexual people who are part of the BDSM scene and assume the dominant role in sexual relationships with a dominant/submissive dynamic.
comment: Obras literarias escritas sobre la bisexualidad, personajes bisexuales o temas bisexuales.
alternative label: Bisexual masters
broader: LGBTQ+ dominants
change note: Version 4.2.0
has top concept: Sexual identity
in scheme: v3
preferred label: Literatura bisexual

Bisexual museums
type: Concept
issued: 2019-05-14
modified: 2025-02-23
replaces: bisexualMuseums
comment: Institutions dedicated to the storage, exhibition, conservation, and preservation of materials relating to bisexuality, bisexual people, or bisexual history.
comment: Término general para el activismo centrado en los derechos de las personas bisexuales y los problemas que enfrentan las comunidades bisexuales.
broader: LGBTQ+ museums
change note: Version 4.2.0
has top concept: LGBTQ+ cultural heritage institutions
in scheme: v3
preferred label: Movimiento bisexual

Bisexual Muslims
type: Concept
issued: 2019-05-14
modified: 2025-02-23
replaces: bisexualMuslims
comment: Bisexual people who are Muslim.
comment: Instituciones dedicadas al almacenamiento, la exposición, la conservación y la preservación de materiales relacionados con las personas bisexuales y la historia bisexual.
broader: LGBTQ+ Muslims
change note: Version 4.2.0
has top concept: LGBTQ+ African religions
in scheme: v3
preferred label: Museos bisexuales

Native American bisexual people
type: Concept
issued: 2019-05-14
modified: 2025-02-23
replaces: bisexualNativeAmericans
comment: People who are part of the Native peoples of the continental United States and Canada (excluding Inuit people) and self-identity as bisexual. Use more specific terms when available.
comment: Personas bisexuales que son nativoamericanas o parte de los pueblos indígenas de Norteamérica; utilícese únicamente para personas que se autoidentifiquen como nativoamericanas y bisexuales.
alternative label: American Indian bisexual people
alternative label: Bisexual American Indians
alternative label: Bisexual Native Americans
alternative label: Personas nativoamericanas bisexuales
broader: Native American LGBTQ+ people
change note: Version 4.2.0
has top concept: LGBTQ+ people
in scheme: v3
preferred label: Personas bisexuales nativoamericanas

Bisexual people in the military
type: Concept
issued: 2019-05-14
modified: 2025-02-23
replaces: bisexualPeopleInTheMilitary
comment: Bisexual individuals serving in state and national armed forces.
comment: Personas que se sienten atraídas romántica y/o sexualmente por más de un género y que se autoidentifican como bisexuales; no se debe utilizar para describir a personas pansexuales o polisexuales a menos que también utilicen el término bisexual.
alternative label: Bisexuales
broader: LGBTQ+ people in the military
change note: Version 4.2.0
has top concept: Legal status
in scheme: v3
preferred label: Personas bisexuales

Bisexual people of color
type: Concept
issued: 2019-05-14
modified: 2025-02-23
replaces: bisexualPeopleOfColour
comment: Primarily used in the United States, this term refers to bisexual people who are not white and who identify as people of color.
comment: Personas bisexuales que sirven en las fuerzas armadas estatales y nacionales.
alternative label: Personas bisexuales en las fuerzas armadas
broader: LGBTQ+ people of color
change note: Version 4.2.0
has top concept: LGBTQ+ people
in scheme: v3
preferred label: Personas bisexuales en el ejército
preferred label: Bisexual people of colour

Bisexual sex workers
type: Concept
issued: 2019-05-14
modified: 2025-02-23
replaces: bisexualProstitutes
comment: Bisexual people who receive money or goods in exchange for sexual services, performances, or companionship. Use to describe bisexual people working across the broad spectrum of sex work.
comment: Películas eróticas o sexualmente explícitas protagonizadas por personas bisexuales.
alternative label: Bisexual prostitutes
alternative label: Bi sex workers
alternative label: Bi prostitutes
alternative label: Bisexual prostitution
alternative label: Bisexual sex work
broader: LGBTQ+ sex workers
change note: Version 4.2.0
has top concept: Sex workers
in scheme: v3
preferred label: Películas pornográficas bisexuales

Bisexual Protestants
type: Concept
issued: 2019-05-14
modified: 2025-02-23
replaces: bisexualProtestants
comment: Bisexual people who are members of the Protestant church.
comment: Periódicos, revistas u otros medios editoriales dirigidos a audiencias bisexuales y/o operados por personas bisexuales.
alternative label: Diarios bisexuales
broader: LGBTQ+ Protestants
change note: Version 4.2.0
has top concept: LGBTQ+ African religions
in scheme: v3
preferred label: Prensa bisexual

Bisexual publishers
type: Concept
issued: 2019-05-14
modified: 2025-02-23
replaces: bisexualPublishers
comment: Companies and organizations that publish materials for bisexual communities or addressing bisexual issues.
comment: Personas bisexuales que reciben dinero o bienes a cambio de servicios o actuaciones sexuales. Se utiliza para describir a las personas bisexuales que trabajan en el amplio espectro del trabajo sexual.
alternative label: Prostitutos bisexuales
alternative label: Trabajadores sexuales bi
alternative label: Prostitutos bi
alternative label: Prostitución bisexual
alternative label: Trabajo sexual bisexual
alternative label: Prostitutas bisexuales
alternative label: Trabajadoras sexuales bi
alternative label: Prostitutas bi
alternative label: Trabajadoras sexuales bisexuales
broader: LGBTQ+ publishers
change note: Version 4.2.0
has top concept: LGBTQ+ publishers
in scheme: v3
preferred label: Trabajadores sexuales bisexuales

Bisexual Roman Catholics
type: Concept
issued: 2019-05-14
modified: 2025-02-23
replaces: bisexualRomanCatholics
comment: Bisexual people who are members of the Roman Catholic Church.
comment: Conexiones continuas (románticas, sexuales o platónicas) entre dos o más personas bisexuales.
broader: LGBTQ+ Roman Catholics
change note: Version 4.2.0
has top concept: LGBTQ+ African religions
in scheme: v3
preferred label: Relaciones bisexuales

Bisexual slang
type: Concept
issued: 2019-05-14
modified: 2025-02-23
replaces: bisexualSlang
comment: Colloquial or informal language related to bisexuality or used by bisexual people.
comment: Obras literarias escritas sobre conceptos imaginativos o futuristas que incorporen la ciencia, la tecnología, el espacio, los viajes en el tiempo y otros elementos especulativos; utilícese en referencia a la ciencia ficción centrada en personajes o temas bisexuales.
broader: LGBTQ+ slang
change note: Version 4.2.0
has top concept: LGBTQ+ slang
in scheme: v3
preferred label: Ciencia ficción bisexual

Bisexual sons
type: Concept
issued: 2019-05-14
modified: 2025-02-23
replaces: bisexualSons
comment: Sons who identify as bisexual.
comment: Obras literarias escritas que son breves y detallan un incidente o concepto autónomo; utilícese en referencia a historias cortas que se centren en personajes o temas bisexuales.
alternative label: Relatos bisexuales
broader: LGBTQ+ sons
change note: Version 4.2.0
has top concept: LGBTQ+ people
in scheme: v3
preferred label: Cuentos cortos bisexuales

Bisexual victims' rights
type: Concept
issued: 2019-05-14
modified: 2025-02-23
replaces: bisexualVictimsRights
comment: Bisexual people's legal rights to be informed, present, and heard within the criminal justice system after having been harmed or injured as the result of of a crime, accident, or other event.
comment: Los derechos legales de las personas bisexuales a estar informadas, estar presentes y ser escuchadas dentro del sistema de justicia penal después de haber sido perjudicadas o lesionadas como resultado de un delito, una accidente u otro evento.
broader: LGBTQ+ victims' rights
change note: Version 4.2.0
has top concept: Law
in scheme: v3
preferred label: Derechos de víctimas bisexuales

White bisexual people
type: Concept
issued: 2019-05-14
modified: 2025-02-23
replaces: bisexualWhitePeople
comment: Bisexual people who are white.
comment: Personas bisexuales que son blancas.
alternative label: Bisexual Caucasian people
alternative label: Bisexual white people
alternative label: Personas caucásicas bisexuales
alternative label: Personas blancas bisexuales
broader: White LGBTQ+ people
change note: Version 4.2.0
has top concept: White LGBTQ+ people
in scheme: v3
preferred label: Personas bisexuales blancas

Bissu
type: Concept
issued: 2019-05-14
modified: 2025-02-23
replaces: bissu
comment: Mentally and physically androgynous shamans in Bugis (Indonesia) culture.
comment: Chamanes mental y físicamente andróginos en la cultura bugis (Indonesia).
broader: Non-Euro-American gender and sexual identities
change note: Version 4.2.0
has top concept: Gender
in scheme: v3

Biting (Erotic)
type: Concept
issued: 2019-05-14
modified: 2025-03-20
replaces: biting
comment: Biting, or applying pressure with one's teeth, for the purposes of sexual arousal.
comment: Morder o aplicar presión con los dientes con el fin de provocar excitación sexual.
change note: Version 4.2.0
in scheme: v3
preferred label: Morder

Biza'ah
type: Concept
issued: 2019-05-14
modified: 2025-02-23
replaces: bizaah
comment: Among the Zapotec in Teotitlán del Valle, Mexico, this term refers to people assigned male at birth who exhibit feminine characteristics.
comment: Entre los zapotecas de Teotitlán del Valle, México, este término se refiere a personas asignadas al sexo masculino al nacer y que exhiben características femeninas.
broader: Non-Euro-American gender and sexual identities
change note: Version 4.2.0
has top concept: Gender
in scheme: v3

Vampirism (Erotic)
type: Concept
issued: 2019-05-14
modified: 2025-03-20
replaces: vampirism
comment: Sexual practices or fetishes centering around the "vampire lifestyle"; can be a subset of BDSM communities and include roleplay, the consumption of blood, etc.
comment: Prácticas sexuales o fetiches centrados en el "estilo de vida vampírico"; puede ser un subconjunto de comunidades BDSM e incluir juegos de roles, consumo de sangre, etc.
alternative label: Blood sports
alternative label: Vampire sex
alternative label: Sexo vampiresco
change note: Version 4.2.0
in scheme: v3
preferred label: Vampirismo (sexo)

Brothels
type: Concept
issued: 2019-05-14
modified: 2025-02-23
replaces: brothels
comment: Establishments where clients pay to engage in sexual activity with sex workers. Brothels may be illegal, decriminalized, or legal operations.
comment: Establecimientos en los que los clientes pagan para tener relaciones sexuales con trabajadoras sexuales. Los burdeles pueden ser operaciones ilegales, despenalizadas o legales.
alternative label: Bordellos
change note: Version 4.2.0
in scheme: v3
preferred label: Burdeles

Burrnesha
type: Concept
issued: 2019-05-14
modified: 2025-02-23
replaces: burrnesha
comment: In the Balkans, people assigned female at birth who take a vow of chastity and live as men.
comment: En los Balcanes, personas asignadas al sexo femenino al nacer que asumen un voto de castidad y viven como hombres.
broader: Non-Euro-American gender and sexual identities
change note: Version 4.2.0
has top concept: Gender
in scheme: v3

Calabai
type: Concept
issued: 2019-05-14
modified: 2025-02-23
replaces: calabai
comment: In Bugis culture, this term refers to people assigned male at birth who assume female roles.
comment: En la cultura bugis, este término se refiere a personas asignadas al sexo masculino al nacer y que asumen roles femeninos.
broader: Non-Euro-American gender and sexual identities
change note: Version 4.2.0
has top concept: Gender
in scheme: v3

Calalai
type: Concept
issued: 2019-05-14
modified: 2025-02-23
replaces: calalai
comment: In Bugis culture, this term refers to people assigned female at birth who assume male roles.
comment: En la cultura bugis, este término se refiere a personas asignadas al sexo femenino al nacer y que asumen roles masculinos.
broader: Non-Euro-American gender and sexual identities
change note: Version 4.2.0
has top concept: Gender
in scheme: v3

Men sex workers
type: Concept
issued: 2019-05-14
modified: 2025-02-23
replaces: maleProstitutes
comment: Men who receive money or goods in exchange for sexual services, performances, or companionship. Use to describe men working across the broad spectrum of sex work.
comment: Hombres que reciben dinero o bienes a cambio de servicios o actuaciones sexuales. Se debe utilizar para describir a los hombres que trabajan en el amplio espectro del trabajo sexual.
alternative label: Call boys
alternative label: Gigolos
alternative label: Rent boys
alternative label: Taxi boys
alternative label: Male sex workers
alternative label: Male prostitutes
alternative label: Men prostitutes
alternative label: Male prostitution
alternative label: Men prostitution
alternative label: Male sex work
alternative label: Men sex work
alternative label: Prostitutos
alternative label: Trabajo sexual masculino
broader: Sex workers
change note: Version 4.2.0
has top concept: Sex workers
in scheme: v3
preferred label: Trabajadores sexuales hombres

LGBTQ+ Calvinists
type: Concept
issued: 2019-05-14
modified: 2025-02-23
replaces: LGBTQCalvinists
comment: LGBTQ+ people who are Calvinists.
comment: Personas LGBTQ+ que son calvinistas.
alternative label: Calvinists (LGBTQ)
alternative label: LGBTQ Calvinists
alternative label: Calvinistas (LGBTQ)
alternative label: Calvinistas LGBTQ
broader: LGBTQ+ Protestants
change note: Version 4.2.0
has top concept: LGBTQ+ African religions
in scheme: v3
preferred label: Calvinistas LGBTQ+

Chosen names
type: Concept
issued: 2019-05-14
modified: 2025-03-20
replaces: chosenName
comment: Names chosen by individuals that differ from their birth or legal names; often used to describe names chosen by LGBTQ+ people to better match their identities.
comment: Un nombre elegido por una persona que difiere de su nombre de nacimiento o legal; a menudo utilizado para describir nombres elegidos por personas LGBTQ+ para que coincidan mejor con sus identidades.
alternative label: Preferred names
change note: Version 4.2.0
in scheme: v3
preferred label: Nombre elegido

Clitoromegaly
type: Concept
issued: 2019-05-14
modified: 2025-02-23
replaces: clitoromegaly
comment: People born with clitoromegaly have a clitoris that is larger than what society considers to be typical. Clitoromegaly is a trait associated with several different intersex variations, including congenital adrenal hyperplasia and progestin-induced virilization.
comment: Las personas que nacen con clitoromegalia tienen un clítoris más grande de lo que la sociedad considera típico. La clitoromegalia es un rasgo asociado con múltiples variaciones intersex diferentes, incluida la hiperplasia suprarrenal congénita y la virilización inducida por progestina.
alternative label: Enlarged clitoris
alternative label: Hipertrofia del clítoris
broader: Intersex variations
change note: Version 4.2.0
has top concept: Sex (Body)
in scheme: v3
preferred label: Clitoromegalia

LGBTQ+ Confucianists
type: Concept
issued: 2019-05-14
modified: 2025-02-23
replaces: LGBTQConfucianists
comment: LGBTQ+ people who are Confucianists.
comment: Personas LGBTQ+ que son confucionistas.
alternative label: Confucianists (LGBTQ)
alternative label: LGBTQ Confucianists
alternative label: Confucionistas LGBTQ
alternative label: Confucionistas (LGBTQ)
broader: LGBTQ+ African religions
change note: Version 4.2.0
has top concept: LGBTQ+ African religions
in scheme: v3
preferred label: Confucionistas LGBTQ+

Dating websites
type: Concept
is replaced by: LGBTQ+ dating websites
issued: 2019-05-14
modified: 2025-07-16
replaces: datingWebsites
comment: Online websites designed to generate connections between people interested in romantic or sexual relationships.
comment: Sitios web en línea diseñados para generar conexiones entre personas interesadas en relaciones románticas o sexuales.
broader: Social media
change note: Version 4.2.0
has top concept: Social media
in scheme: v3
narrower: LGBTQ+ dating websites
preferred label: Sitios web de citas
related: LGBTQ+ online dating

Daughters of bisexual people
type: Concept
issued: 2019-05-14
modified: 2025-02-23
replaces: daughtersOfBisexualPeople
comment: Daughters who have one or more bisexual parent.
comment: Hijas que tienen uno o más padres bisexuales.
broader: Daughters of LGBTQ+ people
change note: Version 4.2.0
has top concept: Family members
in scheme: v3
preferred label: Hijas de personas bisexuales

Daughters of gay men
type: Concept
issued: 2019-05-14
modified: 2025-02-23
replaces: daughtersOfGayMen
comment: Daughters who have one or more gay parent.
comment: Hijas que tienen uno o más padres gay.
broader: Daughters of LGBTQ+ people
change note: Version 4.2.0
has top concept: Family members
in scheme: v3
preferred label: Hijas de hombres gay

Daughters of lesbians
type: Concept
issued: 2019-05-14
modified: 2025-02-23
replaces: daughtersOfLesbians
comment: Daughters who have one or more lesbian parent.
comment: Hijas que tienen uno o más padres lesbianas.
broader: Daughters of LGBTQ+ people
change note: Version 4.2.0
has top concept: Family members
in scheme: v3
preferred label: Hijas de lesbianas

Daughters of transgender people
type: Concept
issued: 2019-05-14
modified: 2025-02-23
replaces: daughtersOfTransgenderPeople
comment: Daughters who have one or more transgender parent.
comment: Hijas que tienen uno o más padres transgénero.
broader: Daughters of LGBTQ+ people
change note: Version 4.2.0
has top concept: Family members
in scheme: v3
preferred label: Hijas de personas transgénero

Daughters of queer people
type: Concept
issued: 2019-05-14
modified: 2025-02-23
replaces: daughtersOfQueerPeople
comment: Daughters who have one or more queer parent.
comment: Hijas que tienen uno o más padres queer.
broader: Daughters of LGBTQ+ people
change note: Version 4.2.0
has top concept: Family members
in scheme: v3
preferred label: Hijas de personas queer

Dhurani
type: Concept
issued: 2019-05-14
modified: 2025-02-23
replaces: dhurani
comment: Bengali term for third sex people, often referring to feminine people who were assigned male at birth.
comment: Término bengalí para personas del tercer sexo, que a menudo se refiere a personas femeninas asignadas al sexo masculino al nacer.
broader: Non-Euro-American gender and sexual identities
change note: Version 4.2.0
has top concept: Gender
in scheme: v3

LGBTQ+ Eastern Orthodox Christians
type: Concept
issued: 2019-05-14
modified: 2025-02-23
replaces: LGBTQEasternOrthodoxChristians
comment: LGBTQ+ people who are members of the Eastern Orthodox Christian Church.
comment: Personas LGBTQ+ que son miembros de la Iglesia cristiana ortodoxa oriental.
alternative label: Eastern Orthodox Christians (LGBTQ)
alternative label: LGBTQ Orthodox Eastern Christians
alternative label: LGBTQ Eastern Orthodox Christians
broader: LGBTQ+ Christians
change note: Version 4.2.0
has top concept: LGBTQ+ African religions
in scheme: v3
preferred label: Personas cristianas ortodoxas LGBTQ+

Etiology
type: Concept
issued: 2019-05-14
modified: 2025-02-23
replaces: etiology
comment: Inquiries and speculations regarding the causes of sexual behaviors or diseases.
comment: Investigaciones y especulaciones sobre las causas de las conductas o enfermedades sexuales.
broader: Theories
change note: Version 4.2.0
has top concept: Theories
in scheme: v3
preferred label: Etiología

Faeries (LGBTQ+ culture)
type: Concept
issued: 2019-05-14
modified: 2025-03-20
replaces: faeries
comment: Queer people who are involved with or identify with the countercultural movement seeking to redefine queer consciousness through secular spirituality. Often but not always associated with the Radical Faeries, a loosely affiliated worldwide network that formed in the 1970s.
comment: Personas queer que están involucradas o se autoidentifican con el movimiento contracultural que busca redefinir la conciencia queer a través de la espiritualidad secular. A menudo, pero no siempre, se asocia con Radical Faeries, una red mundial libremente afiliada que se formó en la década de 1970.
alternative label: Radical Faeries
alternative label: Faes (LGBTQ+ culture)
alternative label: Hadas
alternative label: Hadas radicales
alternative label: Faes
change note: Version 4.2.0
in scheme: v3
preferred label: Faeries

Fat distribution
type: Concept
issued: 2019-05-14
modified: 2025-02-23
replaces: fatDistribution
comment: Location and arrangement of fat on the body, typically increasing during puberty as a secondary sex characteristic.
comment: Ubicación y disposición de la grasa en el cuerpo, que generalmente aumenta durante la pubertad como característica sexual secundaria.
broader: Secondary sex characteristics
change note: Version 4.2.0
has top concept: Sex (Body)
in scheme: v3
preferred label: Distribución de grasa

Fathers of bisexual people
type: Concept
issued: 2019-05-14
modified: 2025-02-23
replaces: fathersOfBisexualPeople
comment: People who assume the role of father to bisexual people. Only use to describe individuals who identify as fathers.
comment: Personas que asumen el rol de padre de personas bisexuales. Utilícese únicamente para describir a personas que se autoidentifiquen como padres.
alternative label: Papás de personas bisexuales
broader: Fathers of LGBTQ+ people
change note: Version 4.2.0
has top concept: Family members
in scheme: v3
preferred label: Padres de personas bisexuales

Fathers of gay men
type: Concept
issued: 2019-05-14
modified: 2025-02-23
replaces: fathersOfGayMen
comment: People who assume the role of father to gay men. Only use to describe individuals who identify as fathers.
comment: Personas que asumen el rol de padre de hombres gay. Utilícese únicamente para describir a personas que se autoidentifiquen como padres.
alternative label: Papás de hombres gay
broader: Fathers of LGBTQ+ people
change note: Version 4.2.0
has top concept: Family members
in scheme: v3
preferred label: Padres de hombres gay

Fathers of lesbians
type: Concept
issued: 2019-05-14
modified: 2025-02-23
replaces: fathersOfLesbians
comment: People who assume the role of father to lesbians. Only use to describe individuals who identify as fathers.
comment: Personas que asumen el rol de padre de lesbianas. Utilícese únicamente para describir a personas que se autoidentifiquen como padres.
alternative label: Papás de lesbianas
broader: Fathers of LGBTQ+ people
change note: Version 4.2.0
has top concept: Family members
in scheme: v3
preferred label: Padres de lesbianas

Fathers of queer people
type: Concept
issued: 2019-05-14
modified: 2025-02-23
replaces: fathersOfQueerPeople
comment: People who assume the role of father to queer people. Only use to describe individuals who identify as fathers.
comment: Personas que asumen el rol de padre de personas queer. Utilícese únicamente para describir a personas que se autoidentifiquen como padres.
alternative label: Papás de personas queer
broader: Fathers of LGBTQ+ people
change note: Version 4.2.0
has top concept: Family members
in scheme: v3
preferred label: Padres de personas queer

Fathers of transgender people
type: Concept
issued: 2019-05-14
modified: 2025-02-23
replaces: fathersOfTransgenderPeople
comment: People who assume the role of father to transgender people. Only use to describe individuals who identify as fathers.
comment: Personas que asumen el rol de padre de personas transgénero. Utilícese únicamente para describir a personas que se autoidentifiquen como padres.
alternative label: Papás de personas transgénero
broader: Fathers of LGBTQ+ people
change note: Version 4.2.0
has top concept: Family members
in scheme: v3
preferred label: Padres de personas transgénero

Women sex workers
type: Concept
issued: 2019-05-14
modified: 2025-02-23
replaces: femaleProstitutes
comment: Women who receive money or goods in exchange for sexual services, performances, or companionship. Use to describe women working across the broad spectrum of sex work.
alternative label: Female prostitutes
alternative label: Female prostitution
alternative label: Women prostitutes
alternative label: Women prostitution
alternative label: Working girls
alternative label: Women sex work
alternative label: Female sex work
alternative label: Female sex workers
alternative label: Prostitutas
alternative label: Prostitución femenina
alternative label: Trabajo sexual femenino
broader: Sex workers
change note: Version 4.2.0
has top concept: Sex workers
in scheme: v3
preferred label: Trabajadoras sexuales mujeres

Femminiello
type: Concept
issued: 2019-05-14
modified: 2025-02-23
replaces: femminiello
comment: In Italy, this is a Neapolitan term for homosexual men with feminine gender expression. Often considered a third gender; associated with good luck.
comment: En Italia, es un término napolitano para referirse a los hombres homosexuales con expresión de género femenina. A menudo, se considera un tercer género, asociado con la buena suerte.
broader: Non-Euro-American gender and sexual identities
change note: Version 4.2.0
has top concept: Gender
in scheme: v3

Floggers
type: Concept
issued: 2019-05-14
modified: 2025-02-23
replaces: floggers
comment: Lightweight whips or scourges with multiple lashes that are used on oneself or a partner to increase sexual arousal.
comment: Látigos o flagelos ligeros con múltiples colas que se utilizan sobre una misma persona o sobre una pareja para aumentar la excitación sexual.
alternative label: Flagelo
broader: Sex accessories
change note: Version 4.2.0
has top concept: Sex accessories
in scheme: v3
preferred label: Azotadores

Freedom rings
type: Concept
issued: 2019-05-14
modified: 2025-02-23
replaces: freedomRings
comment: A symbol designed by David Spada that consists of six aluminum rings in colors based on the rainbow flag; typically worn as jewelry.
comment: Un símbolo diseñado por David Spada que consta de seis anillos de aluminio en colores basados ​​en la bandera arcoíris; normalmente utilizado como joyería.
alternative label: Aros de libertad
broader: LGBTQ+ symbols
change note: Version 4.2.0
has top concept: LGBTQ+ symbols
in scheme: v3
preferred label: Anillos de libertad

Galli
type: Concept
issued: 2019-05-14
modified: 2025-02-23
replaces: galli
comment: A term originating in Ancient Rome that describes eunuch priestesses who were voluntarily castrated as part of an annual celebration.
comment: Término originado en la Antigua Roma que describe a las sacerdotisas eunucos que fueron castradas voluntariamente como parte de una celebración anual.
broader: Non-Euro-American gender and sexual identities
change note: Version 4.2.0
has top concept: Gender
in scheme: v3

Afro-Canadian gay men
type: Concept
issued: 2019-05-14
modified: 2025-02-23
replaces: gayAfroCanadians
comment: Gay men of African descent born in Canada or gay men born in African countries who live in or have a strong connection to Canada. Use for individuals who self-identify as Afro-Canadian.
comment: Hombres gay de ascendencia africana nacidos en Canadá u hombres gay nacidos en países africanos que viven o tienen una conexión fuerte con Canadá. Utilícese para personas que se autoidentifiquen como afrocanadienses.
alternative label: Gay Afro-Canadian people
alternative label: Gay Afro-Canadians
alternative label: Afrocanadienses gay
broader: Afro-Canadian LGBTQ+ people
change note: Version 4.2.0
has top concept: LGBTQ+ people
in scheme: v3
preferred label: Hombres gay afrocanadienses

Afro-Caribbean gay men
type: Concept
issued: 2019-05-14
modified: 2025-02-23
replaces: gayAfroCaribbeans
comment: Gay men of African descent born in the Caribbean or gay men born in African countries who live in or have a strong connection to the Caribbean. Only use for individuals who self-identify as Afro-Caribbean.
comment: Hombres gay de ascendencia africana nacidos en el Caribe u hombres gay nacidos en países africanos que viven o tienen una conexión fuerte con el Caribe. Utilícese únicamente para personas que se a identifiquen como afrocaribeñas.
alternative label: Gay Afro-Caribbean men
alternative label: Gay Afro-Caribbeans
alternative label: Afrocaribeños gay
broader: Afro-Caribbean LGBTQ+ people
change note: Version 4.2.0
has top concept: LGBTQ+ people
in scheme: v3
preferred label: Hombres gay afrocaribeños

Afro-European gay men
type: Concept
issued: 2019-05-14
modified: 2025-02-23
replaces: gayAfroEuropeans
comment: Gay men of African descent born in European countries or gay men born in African countries who live in or have a strong connection to Europe. Only use for individuals who self-identify as Afro-European.
comment: Hombres gay de ascendencia africana nacidos en países europeos u hombres gay nacidos en países africanos que viven o tienen una conexión fuerte con Europa. Utilícese únicamente para personas que se identifiquen como afroeuropeas.
alternative label: Gay Afro-European men
alternative label: Gay Afro-Europeans
alternative label: Afroeuropeos gay
broader: Afro-European LGBTQ+ people
change note: Version 4.2.0
has top concept: LGBTQ+ people
in scheme: v3
preferred label: Hombres gay afroeuropeos

Afro-Latin American gay men
type: Concept
issued: 2019-05-14
modified: 2025-02-23
replaces: gayAfroLatinAmericans
comment: Gay men of African descent born in Latin American countries or gay men born in African countries who live in or have a strong connection to Latin America. Only use for individuals who self-identify as Afro-Latin American.
comment: Hombres gay afrodescendientes nacidos en países latinoamericanos u hombres gay nacidos en países africanos que viven o tienen una fuerte conexión con América Latina. Utilícese únicamente para personas que se identifiquen como afrolatinoamericanas.
alternative label: Gay Afro-Latin American men
alternative label: Gay Afro-Latin Americans
alternative label: Hombres afrolatinoamericanos gay
alternative label: Afrolatinoamericanos gay
broader: Afro-Latin American LGBTQ+ people
change note: Version 4.2.0
has top concept: LGBTQ+ people
in scheme: v3
preferred label: Hombres gay afrolatinoamericanos

Gay archives
type: Concept
issued: 2019-05-14
modified: 2025-02-23
replaces: gayArchives
comment: Collections of records and materials relating to gay men or gay communities; can include a variety of organizations and institutions from community to government archives.
comment: Colecciones de registros y materiales relacionados con hombres gay o comunidades gay; puede incluir una variedad de organizaciones e instituciones, desde archivos comunitarios hasta gubernamentales.
broader: LGBTQ+ archives
change note: Version 4.2.0
has top concept: LGBTQ+ cultural heritage institutions
in scheme: v3
preferred label: Archivos gay

Gay artists
type: Concept
issued: 2019-05-14
modified: 2025-02-23
replaces: gayArtists
comment: Gay men who practice any of various creative arts.
comment: Artistas conocidos por ser hombres gay.
broader: LGBTQ+ artists
change note: Version 4.2.0
has top concept: LGBTQ+ people
in scheme: v3
preferred label: Artistas gay

Gay atheists
type: Concept
issued: 2019-05-14
modified: 2025-02-23
replaces: gayAtheists
comment: Gay men who are atheists.
comment: Hombres gay que son ateos.
broader: LGBTQ+ atheists
change note: Version 4.2.0
has top concept: LGBTQ+ people
in scheme: v3
preferred label: Ateos gay

Gay beaches
type: Concept
issued: 2019-05-14
modified: 2025-02-23
replaces: gayBeaches
comment: Beaches set aside for use by gay men or beaches known to be frequented by gay men.
comment: Playas reservadas para el uso de hombres gay o playas conocidas por ser frecuentadas por hombres gay.
broader: LGBTQ+ beaches
change note: Version 4.2.0
has top concept: LGBTQ+ meeting places
in scheme: v3
preferred label: Playas gay

Black gay men
type: Concept
issued: 2019-05-14
modified: 2025-02-23
replaces: gayBlackPeople
comment: Black men who are gay. Use only for individuals who self-identity as Black. Follow the individual’s preference for African American or Black whenever possible.
comment: Hombres negros que son gay. Utilícese únicamente para personas que seautoidentificancomo negras. Siga la preferencia del individuo para el uso de afroamericanos o negros siempre que sea posible.
alternative label: Gay Black men
alternative label: Hombres negros gay
broader: Black LGBTQ+ people
change note: Version 4.2.0
has top concept: LGBTQ+ people
in scheme: v3
preferred label: Hombres gay negros

Gay bookshops
type: Concept
issued: 2019-05-14
modified: 2025-02-23
replaces: gayBookshops
comment: Bookshops that sell materials intended for use by gay men or addressing topics related to gay men.
comment: Librerías que venden materiales destinados a hombres gay o que abordan temas relacionados con hombres gay.
broader: LGBTQ+ bookshops
change note: Version 4.2.0
has top concept: LGBTQ+ bookshops
in scheme: v3
preferred label: Librerías gay

Gay Buddhists
type: Concept
issued: 2019-05-14
modified: 2025-02-23
replaces: gayBuddhists
comment: Gay men who are Buddhist.
comment: Hombres gay que son budistas.
broader: LGBTQ+ Buddhists
change note: Version 4.2.0
has top concept: LGBTQ+ African religions
in scheme: v3
preferred label: Budistas gay

Gay Christians
type: Concept
issued: 2019-05-14
modified: 2025-02-23
replaces: gayChristians
comment: Gay men who are Christian.
comment: Hombres gay que son cristianos.
broader: LGBTQ+ Christians
change note: Version 4.2.0
has top concept: LGBTQ+ African religions
in scheme: v3
preferred label: Cristianos gay

Jewish gay men
type: Concept
issued: 2019-05-14
modified: 2025-02-23
replaces: gayJews
comment: Gay men who are Jewish.
comment: Hombres gay que son judíos.
alternative label: Gay Jews
alternative label: Jewish gay people
alternative label: Jewish gays
alternative label: Judíos gay
alternative label: Personas judías gay
broader: Jewish LGBTQ+ people
change note: Version 4.2.0
has top concept: LGBTQ+ people
in scheme: v3
preferred label: Hombres gay judíos

Latino/a/x gay men
type: Concept
issued: 2019-05-14
modified: 2025-02-23
replaces: gayLatinos
comment: Latin American men who are gay; only use to describe individuals who self-identify as Latino, Latina, or Latinx. Do not conflate with Chicano/a/x or Hispanic.
comment: Hombres latinoamericanos que son gay; utilícese únicamente para describir a personas que se autoidentifican como latinos, latinas o latinxs. No debe confundirse con chicano/a/x o hispano/a/x.
alternative label: Gay Latine
alternative label: Gay Latinos
alternative label: Gay Latinx
alternative label: Latine gay men
alternative label: Latino gay men
alternative label: Latinx gay men
broader: Latino/a/x LGBTQ+ people
change note: Version 4.2.0
has top concept: LGBTQ+ people
in scheme: v3
preferred label: Hombres gay Latinx

Gay libraries
type: Concept
issued: 2019-05-14
modified: 2025-02-23
replaces: gayLibraries
comment: Libraries that hold materials primarily pertaining to gay men or intended for use by gay men.
comment: Bibliotecas que contienen materiales principalmente relacionados con hombres gay o destinados a ser utilizados por hombres gay.
broader: LGBTQ+ libraries
change note: Version 4.2.0
has top concept: LGBTQ+ cultural heritage institutions
in scheme: v3
preferred label: Bibliotecas gay

Gay couples
type: Concept
issued: 2019-05-14
modified: 2025-02-23
replaces: gayMaleCouples
comment: Partnerships in which both people are gay men.
comment: Parejas en las que ambas personas son hombres gay.
broader: LGBTQ+ couples
change note: Version 4.2.0
has top concept: Relationship satisfaction
in scheme: v3
preferred label: Parejas gay

Gay dominants
type: Concept
issued: 2019-05-14
modified: 2025-02-23
replaces: gayMasters
comment: Gay men who are part of the BDSM scene and assume the dominant role in sexual relationships with a master/slave dynamic.
comment: Hombres gay que forman parte de la escena BDSM y asumen el rol dominante en las relaciones sexuales con una dinámica amo/esclavo.
broader: LGBTQ+ dominants
change note: Version 4.2.0
has top concept: Sexual identity
in scheme: v3
preferred label: Personas gay dominantes

Gay men in the military
type: Concept
issued: 2019-05-14
modified: 2025-02-23
replaces: gayMenInTheMilitary
comment: Gay men serving in state and national armed forces.
comment: La participación e inclusión de hombres gay en las comunidades de fans.
broader: LGBTQ+ people in the military
change note: Version 4.2.0
has top concept: Legal status
in scheme: v3
preferred label: Hombres gay en fandom

Gay men of color
type: Concept
issued: 2019-05-14
modified: 2025-02-23
replaces: gayMenOfColour
comment: Primarily used in the United States, this term refers to gay men who are not white and who identify as people of color.
comment: La presencia de hombres gay en el lugar de trabajo, incluida la aceptación de los trabajadores gay y los problemas a los que se enfrentan.
broader: LGBTQ+ people of color
change note: Version 4.2.0
has top concept: LGBTQ+ people
in scheme: v3
preferred label: Hombres gay en el lugar de trabajo
preferred label: Gay men of colour

Gay museums
type: Concept
issued: 2019-05-14
modified: 2025-02-23
replaces: gayMuseums
comment: Institutions dedicated to the storage, exhibition, conservation, and preservation of materials relating to gay men or gay history.
comment: Término general para el activismo centrado en los derechos de los hombres gay y los problemas que enfrentan las comunidades gay.
alternative label: Organizaciones gay
broader: LGBTQ+ museums
change note: Version 4.2.0
has top concept: LGBTQ+ cultural heritage institutions
in scheme: v3
preferred label: Movimiento gay

Native American gay men
type: Concept
issued: 2019-05-14
modified: 2025-02-23
replaces: gayNativeAmericans
comment: People who are part of the Native peoples of the continental United States and Canada (excluding Inuit people) and self-identity as gay men. Use more specific terms when available.
comment: Hombres gay que son nativoamericanos o parte de los pueblos indígenas de Norteamérica; utilícese únicamente para personas que se autoidentifiquen como nativoamericanas y hombres gay.
alternative label: American Indian gay men
alternative label: Gay American Indians
alternative label: Gay Native Americans
alternative label: Hombres nativoamericanos gay
broader: Native American LGBTQ+ people
change note: Version 4.2.0
has top concept: LGBTQ+ people
in scheme: v3
preferred label: Hombres gay nativoamericanos

Gay Pride Week
type: Concept
issued: 2019-05-14
modified: 2025-02-23
replaces: gayPrideWeek
comment: A period of public recognition and celebration of LGBTQ+ people and culture, usually organized over the course of a week with local events, parades, marches, and rallies. Gay pride week occurs at different times during the year in different places but is typically held in June in the United States to commemorate the Stonewall uprising.
comment: Eventos que celebran la autoaceptación y la aceptación social, los logros y los derechos LGBTQ+, generalmente organizados en el transcurso de una semana con eventos locales, desfiles, marchas y concentraciones. Ocurre en diferentes momentos del año en diferentes lugares, pero normalmente se lleva a cabo en junio para conmemorar las revueltas de Stonewall.
alternative label: Pink Saturday
alternative label: Pink Week
alternative label: Pride Week
alternative label: Sábado rosado
alternative label: Sábado rosa
alternative label: Semana rosa
alternative label: Semana rosada
broader: Pride Month
change note: Version 4.2.0
has top concept: LGBTQ+ pride
in scheme: v3
preferred label: Semana del orgullo gay

Gay priests
type: Concept
issued: 2019-05-14
modified: 2025-02-23
replaces: gayPriests
comment: Gay men who are ordained as priests in different denominations of the Christian Church.
comment: Hombres gay que son ordenados sacerdotes en diferentes denominaciones de la Iglesia cristiana.
broader: Gay clergy
change note: Version 4.2.0
has top concept: LGBTQ+ clergy
in scheme: v3
preferred label: Sacerdotes gay

Gay sex workers
type: Concept
issued: 2019-05-14
modified: 2025-02-23
replaces: gayProstitutes
comment: Gay men who receive money or goods in exchange for sexual services, performances, or companionship. Use to describe gay men working across the broad spectrum of sex work.
alternative label: Gay prostitutes
alternative label: Gay prostitution
alternative label: Gay sex work
broader: LGBTQ+ sex workers
change note: Version 4.2.0
has top concept: Sex workers
in scheme: v3
preferred label: Trabajadores sexuales gay

Gay Protestants
type: Concept
issued: 2019-05-14
modified: 2025-02-23
replaces: gayProtestants
comment: Gay men who are members of the Protestant Church.
comment: Hombres gay que son miembros de la Iglesia protestante.
broader: LGBTQ+ Protestants
change note: Version 4.2.0
has top concept: LGBTQ+ African religions
in scheme: v3
preferred label: Protestantes gay

Gay publishers
type: Concept
issued: 2019-05-14
modified: 2025-02-23
replaces: gayPublishers
comment: Companies and organizations that publish materials for gay communities or addressing gay issues.
comment: Empresas y organizaciones que publican materiales para comunidades gay o que abordan asuntos gay.
broader: LGBTQ+ publishers
change note: Version 4.2.0
has top concept: LGBTQ+ publishers
in scheme: v3
preferred label: Editoriales gay

Gay rights
type: Concept
issued: 2019-05-14
modified: 2025-02-23
replaces: gayRights
comment: Legal, social, or ethical principles of freedom or entitlement held by gay men.
comment: Principios legales, sociales o éticos de libertad o derechos que tienen los hombres gay.
broader: LGBTQ+ civil rights
change note: Version 4.2.0
has top concept: Human rights
in scheme: v3
preferred label: Derechos gay

Gay Roman Catholics
type: Concept
issued: 2019-05-14
modified: 2025-02-23
replaces: gayRomanCatholics
comment: Gay men who are members of the Roman Catholic Church.
comment: Hombres gay que son miembros de la Iglesia católica romana.
alternative label: Católico Romanos gay
broader: LGBTQ+ Roman Catholics
change note: Version 4.2.0
has top concept: LGBTQ+ African religions
in scheme: v3
preferred label: Personas católico romanas gay

Gay sons
type: Concept
issued: 2019-05-14
modified: 2025-02-23
replaces: gaySons
comment: Sons who identify as gay men.
comment: Hijos que se autoidentifican como hombres gay.
broader: LGBTQ+ sons
change note: Version 4.2.0
has top concept: LGBTQ+ people
in scheme: v3
preferred label: Hijos gay

Gay victims' rights
type: Concept
issued: 2019-05-14
modified: 2025-02-23
replaces: gayVictimsRights
comment: Gay men's legal rights to be informed, present, and heard within the criminal justice system after having been harmed or injured as the result of of a crime, accident, or other event.
comment: Los derechos legales de los hombres gay a estar informados, estar presentes y a ser escuchados dentro del sistema de justicia penal después de haber sido perjudicados o lesionados como resultado de un delito, accidente u otro evento.
broader: LGBTQ+ victims' rights
change note: Version 4.2.0
has top concept: Law
in scheme: v3
preferred label: Derechos de víctimas gay

White gay men
type: Concept
issued: 2019-05-14
modified: 2025-02-23
replaces: gayWhitePeople
comment: Gay men who are white.
comment: Hombres gay que son blancos.
alternative label: Caucasian gay men
alternative label: Gay Caucasian men
alternative label: Gay white men
alternative label: Hombres gay caucásicos
alternative label: Hombres caucásicos gay
alternative label: Hombres blancos gay
broader: White LGBTQ+ people
change note: Version 4.2.0
has top concept: White LGBTQ+ people
in scheme: v3
preferred label: Hombres gay blancos

Gender blending
type: Concept
issued: 2019-05-14
modified: 2025-02-23
replaces: genderBlending
comment: Gender expression that involves blending dress and behaviors associated with different genders. Do not use to describe the identities of genderqueer or non-binary people.
comment: Expresión de género que implica mezclar vestimenta y comportamientos asociados a diferentes géneros. No debe utilizarse para describir las identidades de personas queer o no binarias.
broader: Gender expression
change note: Version 4.2.0
has top concept: Gender
in scheme: v3
preferred label: Mezcla de género

Given names
type: Concept
issued: 2019-05-14
modified: 2025-03-20
replaces: givenName
comment: Personal names ascribed to individuals at birth, typically by their parents. Sometimes referred to as "birth names" or, in cultures where the given name precedes the family name, "first names."
comment: Nombres personales adscritos a las personas al nacer, normalmente por sus padres. A veces se les denomina "nombres de nacimiento" o, en culturas donde el nombre de pila precede al apellido, "primer nombre"
alternative label: Birth names
alternative label: First names
alternative label: Nombre de nacimiento
alternative label: Primer nombre
change note: Version 4.2.0
in scheme: v3
preferred label: Nombre de pila

Güevedoce
type: Concept
issued: 2019-05-14
modified: 2025-02-23
replaces: guevedoche
comment: In the Dominican Republic, this term refers to people who have undifferentiated genitalia and who are generally raised as female until puberty; may be considered a third gender.
comment: En la República Dominicana, este término se refiere a las personas que tienen genitales indiferenciados y que generalmente son criadas como mujeres hasta la pubertad; puede considerarse un tercer género.
alternative label: Guevedoche
broader: Non-Euro-American gender and sexual identities
change note: Version 4.2.0
has top concept: Gender
in scheme: v3

Handcuffs
type: Concept
issued: 2019-05-14
modified: 2025-02-23
replaces: handcuffs
comment: A restraint device designed to secure an individual’s wrists.
alternative label: Handcuff restraints
broader: Cuffs
change note: Version 4.2.0
has top concept: Sex accessories
in scheme: v3
preferred label: Esposas

Hemaneh
type: Concept
issued: 2019-05-14
modified: 2025-02-23
replaces: hemaneh
comment: Cheyenne term for a half-man, half-woman persona.
comment: Término cheyenne para una persona mitad hombre, mitad mujer.
broader: Non-Euro-American gender and sexual identities
change note: Version 4.2.0
has top concept: Gender
in scheme: v3

Heterosexual marriage
type: Concept
issued: 2019-05-14
modified: 2025-02-23
replaces: heterosexualMarriage
comment: The legally and formally recognized union of a heterosexual man and woman as partners in a personal relationship.
comment: La unión legal y formalmente reconocida de un hombre y una mujer heterosexuales como pareja en una relación personal.
broader: Marriage
change note: Version 4.2.0
has top concept: Living arrangements
in scheme: v3
preferred label: Matrimonio heterosexual

LGBTQ+ Hindus
type: Concept
issued: 2019-05-14
modified: 2025-02-23
replaces: LGBTQHindus
comment: LGBTQ+ people who are Hindu.
comment: Personas LGBTQ+ que son hindúes.
alternative label: Hindus (LGBTQ)
alternative label: LGBTQ Hindus
broader: LGBTQ+ African religions
change note: Version 4.2.0
has top concept: LGBTQ+ African religions
in scheme: v3
preferred label: Hindúes LGBTQ+

LGBTQ+ monuments
type: Concept
is replaced by: homoit0000901
issued: 2019-05-14
modified: 2025-02-23
replaces: homomonuments
comment: Public monuments designed to commemorate LGBTQ+ people who have been persecuted because of their gender and/or sexual identities.
comment: Monumentos públicos diseñados para conmemorar a las personas LGBTQ+ que han sido perseguidas por su identidad de género y/o sexual.
alternative label: Homomonuments
alternative label: Monuments (LGBTQ)
alternative label: Homomonumentos
alternative label: Monumentos (LGBTQ)
change note: Version 4.2.0
in scheme: v3
preferred label: Monumentos LGBTQ+

Hypospadias
type: Concept
issued: 2019-05-14
modified: 2025-02-23
replaces: hypospadias
comment: People with hypospadias are born with their urinary opening located somewhere other than the tip of the penis. In "distal hypospadias," the urinary opening is elsewhere on the glans (head) of the penis, whereas in "proximal hypospadias," it is on the underside of the penis and sometimes further back near the scrotum. Hypospadias is one of the most common and visible genital variations. People with hypospadias often have additional variations like chordee (a bend in the penis) or cryptorchidism (undescended testicles).
comment: Las personas con hipospadias nacen con la apertura urinaria ubicada en algún lugar distinto a la punta del pene. En el "hipospadias distal", la apertura urinaria está en otra parte del glande (cabeza) del pene, mientras que en el "hipospadias proximal", está en la parte inferior del pene y, a veces, más atrás, cerca del escroto. El hipospadias es una de las variaciones genitales más comunes y visibles. Las personas con hipospadias suelen tener variaciones adicionales como cordee (una curvatura en el pene) o criptorquidia (testículos no descendidos).
broader: Intersex variations
change note: Version 4.2.0
has top concept: Sex (Body)
in scheme: v3
preferred label: Hipospadias

Hysterectomy
type: Concept
issued: 2019-05-14
modified: 2025-02-23
replaces: hysterectomy
comment: Surgical procedure to remove the uterus.
comment: Procedimiento quirúrgico para extirpar el útero.
broader: Bottom surgery
change note: Version 4.2.0
has top concept: Medical care
in scheme: v3
preferred label: Histerectomía

Jankha
type: Concept
issued: 2019-05-14
modified: 2025-02-23
replaces: jankha
comment: In India, this term is used to describe people assigned male at birth who take on female dress and characteristics but who do not elect to receive castration.
comment: En la India, este término se utiliza para describir a las personas asignadas al sexo masculino al nacer que adoptan vestimenta y características femeninas pero que no eligen la castración.
broader: Non-Euro-American gender and sexual identities
change note: Version 4.2.0
has top concept: Gender
in scheme: v3

LGBTQ+ Jehovah's Witnesses
type: Concept
issued: 2019-05-14
modified: 2025-02-23
replaces: LGBTQJehovahsWitnesses
comment: LGBTQ+ people who are Jehovah’s Witnesses.
comment: Personas LGBTQ+ que son testigos de Jehová.
alternative label: LGBTQ Jehova's Witnesses
alternative label: Jehova's Witnesses (LGBTQ)
alternative label: LGBTQ Jehovah's Witnesses
alternative label: Testigos de Jehová (LGBTQ)
broader: LGBTQ+ Christians
change note: Version 4.2.0
has top concept: LGBTQ+ African religions
in scheme: v3
preferred label: Testigos de Jehová LGBTQ+

Jerking off
type: Concept
issued: 2019-05-14
modified: 2025-02-23
replaces: jerkingOff
comment: Slang term for masturbation; typically refers to manual stimulation of the penis.
comment: Término de la jerga para la masturbación; usualmente se refiere a la estimulación manual del pene.
alternative label: Jacking off
alternative label: Jerking it
alternative label: Echar una paja
alternative label: Hacerse una puñeta
alternative label: Correrse
broader: Masturbation
change note: Version 4.2.0
has top concept: Sex (Act)
in scheme: v3
preferred label: Pajearse

Khwaja sira
type: Concept
issued: 2019-05-14
modified: 2025-02-23
replaces: khawajaSara
comment: An umbrella term used in Pakistan and South Asia to describe people assigned male at birth who identify as women, intersex, or third gender.
comment: Término del urdu utilizado en el sudeste de Asia para describir a personas transgénero.
preferred label: Khawaja sara
alternative label: Khwaja sara
alternative label: Khawaja sira
broader: Non-Euro-American gender and sexual identities
change note: Version 4.2.0
has top concept: Gender
in scheme: v3

Klinefelter syndrome
type: Concept
issued: 2019-05-14
modified: 2025-02-23
replaces: klinefelterSyndrome
comment: People with Klinefelter syndrome develop with an extra copy of the X chromosome, resulting in a 47XXY pattern (instead of the typical 46XY). These individuals might have smaller-than-typical testes that produce lower amounts of testosterone and/or sperm, and they may start puberty later than typical (or may not go through puberty without hormone therapy). They may grow taller than usual, may develop breast tissue, and often experience infertility. This variation often does not cause obvious physical differences, and many people do not realize they have it.
comment: Las personas con síndrome de Klinefelter se desarrollan con una copia adicional del cromosoma X, lo que da como resultado un patrón 47XXY (en lugar del típico 46XY). Estas personas pueden tener testículos más pequeños de lo típico que producen menores cantidades de testosterona y/o esperma, y ​​pueden comenzar la pubertad más tarde de lo normal (o pueden no atravesar la pubertad sin terapia hormonal). Pueden crecer más de lo habitual, desarrollar tejido mamario y, a menudo, experimentar infertilidad. Esta variación a menudo no causa diferencias físicas obvias y muchas personas no se dan cuenta de que la tienen.
alternative label: 47XXY
broader: Intersex variations
change note: Version 4.2.0
has top concept: Sex (Body)
in scheme: v3
preferred label: Síndrome de Klinefelter

Köçek
type: Concept
issued: 2019-05-14
modified: 2025-02-23
replaces: köçek
comment: Turkish term for male dancers who crossdress in feminine attire for entertainment purposes.
comment: Término turco para los bailarines que se visten con atuendos femeninos con fines de entretenimiento.
broader: Non-Euro-American gender and sexual identities
change note: Version 4.2.0
has top concept: Gender
in scheme: v3

Labrys
type: Concept
issued: 2019-05-14
modified: 2025-02-23
replaces: labrys
comment: Symbol used to represent lesbianism and feminism.
comment: Símbolo utilizado para representar el lesbianismo y el feminismo.
broader: LGBTQ+ symbols
change note: Version 4.2.0
has top concept: LGBTQ+ symbols
in scheme: v3

Lakin-on
type: Concept
issued: 2019-05-14
modified: 2025-02-23
replaces: lakinOn
comment: Cebuano term for women who are attracted to women and take on male personas and cultural work.
comment: Término cebuano para mujeres que se sienten atraídas por mujeres, y asumen el personaje y el trabajo cultural masculinos.
broader: Non-Euro-American gender and sexual identities
change note: Version 4.2.0
has top concept: Gender
in scheme: v3

Lambda
type: Concept
issued: 2019-05-14
modified: 2025-02-23
replaces: lambda
comment: Symbol for lesbian and gay rights.
comment: Símbolo de los derechos de lesbianas y hombres gay.
broader: LGBTQ+ symbols
change note: Version 4.2.0
has top concept: LGBTQ+ symbols
in scheme: v3

LBT
type: Concept
issued: 2019-05-14
modified: 2025-02-23
replaces: LBT
comment: Acronym used to describe lesbians, bisexuals, and transgender people as a group.
comment: Acrónimo utilizado para describir a lesbianas, personas bisexuales y personas transgénero como grupo.
broader: LGBT
change note: Version 4.2.0
has top concept: LGBTI
in scheme: v3

Legal names
type: Concept
issued: 2019-05-14
modified: 2025-02-23
replaces: legalName
comment: Use in reference to laws and regulations concerning the names assigned to individuals at birth.
comment: Utilícese en referencia a las leyes y regulaciones relativas al nombre asignado a una persona al nacer.
change note: Version 4.2.0
in scheme: v3
preferred label: Nombre legal

African American lesbians
type: Concept
issued: 2019-05-14
modified: 2025-02-23
replaces: lesbianAfricanAmericans
comment: Lesbians of African descent born in the United States or lesbians born in African countries who live in or have a strong connection to the United States. Use for individuals who self-identity as African American. Follow the individual’s preference for African American or Black whenever possible.
comment: Lesbianas de ascendencia africana nacidas en los Estados Unidos o nacidas en países africanos que viven o tienen una fuerte conexión con los Estados Unidos. Utilícese para personas que se autoidentifiquen como afroamericanas.
alternative label: Lesbian African Americans
alternative label: Afroamericanas lesbianas
broader: African American LGBTQ+ people
change note: Version 4.2.0
has top concept: LGBTQ+ people
in scheme: v3
preferred label: Lesbianas afroamericanas

Afro-Canadian lesbians
type: Concept
issued: 2019-05-14
modified: 2025-02-23
replaces: lesbianAfroCanadians
comment: Lesbians of African descent born in Canada or lesbians born in African countries who live in or have a strong connection to Canada. Use for individuals who self-identify as Afro-Canadian.
comment: Lesbianas de ascendencia africana nacidas en Canadá o lesbianas nacidas en países africanos que viven o tienen una conexión fuerte con Canadá. Utilícese para personas que se identifiquen como afrocanadienses.
alternative label: Lesbian Afro-Canadians
alternative label: Afrocanadienses lesbianas
broader: Afro-Canadian LGBTQ+ people
change note: Version 4.2.0
has top concept: LGBTQ+ people
in scheme: v3
preferred label: Lesbianas afrocanadienses

Afro-Caribbean lesbians
type: Concept
issued: 2019-05-14
modified: 2025-02-23
replaces: lesbianAfroCaribbeans
comment: Lesbians of African descent born in the Caribbean or lesbians born in African countries who live in or have a strong connection to the Caribbean. Only use for individuals who self-identify as Afro-Caribbean.
comment: Lesbianas afrodescendientes nacidas en el Caribe o lesbianas nacidas en países africanos que viven o tienen una conexión fuerte con el Caribe. Utilícese únicamente para personas que se identifiquen como afrocaribeñas.
alternative label: Lesbian Afro-Caribbeans
alternative label: Afrocaribeñas lesbianas
broader: Afro-Caribbean LGBTQ+ people
change note: Version 4.2.0
has top concept: LGBTQ+ people
in scheme: v3
preferred label: Lesbianas afrocaribeñas

Afro-European lesbians
type: Concept
issued: 2019-05-14
modified: 2025-02-23
replaces: lesbianAfroEuropeans
comment: Lesbians of African descent born in European countries or lesbians born in African countries who live in or have a strong connection to Europe. Only use for individuals who self-identify as Afro-European.
comment: Lesbianas de ascendencia africana nacidas en países europeos o lesbianas nacidas en países africanos que viven o tienen una conexión fuerte con Europa. Utilícese únicamente para personas que se identifiquen como afroeuropeas.
alternative label: Lesbian Afro-Europeans
alternative label: Afroeuropeas lesbianas
broader: Afro-European LGBTQ+ people
change note: Version 4.2.0
has top concept: LGBTQ+ people
in scheme: v3
preferred label: Lesbianas afroeuropeas

Afro-Latin American lesbians
type: Concept
issued: 2019-05-14
modified: 2025-02-23
replaces: lesbianAfroLatinAmericans
comment: Lesbians of African descent born in Latin American countries or lesbians born in African countries who live in or have a strong connection to Latin America. Only use for individuals who self-identify as Afro-Latin American.
comment: Lesbianas afrodescendientes nacidas en países latinoamericanos o lesbianas nacidas en países africanos que viven o tienen una conexión fuerte con América Latina. Utilícese únicamente para personas que se identifiquen como afrolatinoamericanas.
alternative label: Lesbian Afro-Latin Americans
alternative label: Afrolatinoamericanas lesbianas
broader: Afro-Latin American LGBTQ+ people
change note: Version 4.2.0
has top concept: LGBTQ+ people
in scheme: v3
preferred label: Lesbianas afrolatinoamericanas

Lesbian archives
type: Concept
issued: 2019-05-14
modified: 2025-02-23
replaces: lesbianArchives
comment: Collections of records and materials relating to lesbians or lesbian communities; can include a variety of organizations and institutions from community to government archives.
comment: Colecciones de registros y materiales relacionados con lesbianas o comunidades de lesbianas; pueden incluir una variedad de organizaciones e instituciones, desde archivos comunitarios hasta gubernamentales.
broader: LGBTQ+ archives
change note: Version 4.2.0
has top concept: LGBTQ+ cultural heritage institutions
in scheme: v3
preferred label: Archivos lésbicos

Lesbian artists
type: Concept
issued: 2019-05-14
modified: 2025-02-23
replaces: lesbianArtists
comment: Lesbians who practice any of various creative arts.
comment: Artistas conocidas como lesbianas.
broader: LGBTQ+ artists
change note: Version 4.2.0
has top concept: LGBTQ+ people
in scheme: v3
preferred label: Artistas lesbianas

Lesbian atheists
type: Concept
issued: 2019-05-14
modified: 2025-02-23
replaces: lesbianAtheists
comment: Lesbians who are atheists.
comment: Lesbianas que son ateas.
broader: LGBTQ+ atheists
change note: Version 4.2.0
has top concept: LGBTQ+ people
in scheme: v3
preferred label: Ateas lesbianas

Lesbian beaches
type: Concept
issued: 2019-05-14
modified: 2025-02-23
replaces: lesbianBeaches
comment: Beaches set aside for use by lesbians or beaches known to be frequented by lesbians.
comment: Playas reservadas para el uso de lesbianas o playas conocidas por ser frecuentadas por lesbianas.
broader: LGBTQ+ beaches
change note: Version 4.2.0
has top concept: LGBTQ+ meeting places
in scheme: v3
preferred label: Playas lésbicas

Black lesbians
type: Concept
issued: 2019-05-14
modified: 2025-02-23
replaces: lesbianBlackPeople
comment: Black people who are lesbians. Use only for individuals who self-identity as Black. Follow the individual’s preference for African American or Black whenever possible.
comment: Personas negras que son lesbianas. Utilícese únicamente para personas que seautoidentificancomo negras. Siga la preferencia del individuo para el uso de afroamericanos o negros siempre que sea posible.
broader: Black LGBTQ+ people
change note: Version 4.2.0
has top concept: LGBTQ+ people
in scheme: v3
preferred label: Lesbianas negras

Lesbian Buddhists
type: Concept
issued: 2019-05-14
modified: 2025-02-23
replaces: lesbianBuddhists
comment: Lesbians who are Buddhist.
comment: Lesbianas que son budistas.
alternative label: Lesbianas budistas
broader: LGBTQ+ Buddhists
change note: Version 4.2.0
has top concept: LGBTQ+ African religions
in scheme: v3
preferred label: Budistas lesbianas

Lesbian Christians
type: Concept
issued: 2019-05-14
modified: 2025-02-23
replaces: lesbianChristians
comment: Lesbians who are Christian.
comment: Lesbianas que son cristianas.
broader: LGBTQ+ Christians
change note: Version 4.2.0
has top concept: LGBTQ+ African religions
in scheme: v3
preferred label: Cristianas lesbianas

Lesbian daughters
type: Concept
issued: 2019-05-14
modified: 2025-02-23
replaces: lesbianDaughters
comment: Daughters who identify as lesbians.
comment: Hijas que se identifican como lesbianas.
broader: LGBTQ+ daughters
change note: Version 4.2.0
has top concept: LGBTQ+ people
in scheme: v3
preferred label: Hijas lesbianas

Jewish lesbians
type: Concept
issued: 2019-05-14
modified: 2025-02-23
replaces: lesbianJews
comment: Lesbians who are Jewish.
comment: Lesbianas que son judías.
alternative label: Lesbian Jews
preferred label: Lesbianas judías
broader: Jewish LGBTQ+ people
change note: Version 4.2.0
has top concept: LGBTQ+ people
in scheme: v3

Latino/a/x lesbians
type: Concept
issued: 2019-05-14
modified: 2025-02-23
replaces: lesbianLatinas
comment: Latin American people who are lesbians; only use to describe individuals who self-identify as Latino, Latina, or Latinx. Do not conflate with Chicano/a/x or Hispanic.
comment: Personas latinoamericanas que son lesbianas; utilícese únicamente para describir a personas que se autoidentifican como latinos, latinas o latinxs. No debe confundirse con chicano/a/x o hispano/a/x.
alternative label: Latina lesbians
alternative label: Latine lesbians
alternative label: Latino lesbians
alternative label: Latinx lesbians
alternative label: Lesbian Latinas
alternative label: Lesbian Latine
alternative label: Lesbian Latinos
broader: Latino/a/x LGBTQ+ people
change note: Version 4.2.0
has top concept: LGBTQ+ people
in scheme: v3
preferred label: Lesbianas Latinx

Lesbian museums
type: Concept
issued: 2019-05-14
modified: 2025-02-23
replaces: lesbianMuseums
comment: Institutions dedicated to the storage, exhibition, conservation, and preservation of materials relating to lesbians and lesbian history.
comment: Instituciones dedicadas al almacenamiento, la exhibición, la conservación y la preservación de materiales relacionados con las lesbianas y la historia lésbica.
alternative label: Museos lésbicos
broader: LGBTQ+ museums
change note: Version 4.2.0
has top concept: LGBTQ+ cultural heritage institutions
in scheme: v3
preferred label: Museos de lesbianas

Lesbian Muslims
type: Concept
issued: 2019-05-14
modified: 2025-02-23
replaces: lesbianMuslims
comment: Lesbians who are Muslim.
comment: Lesbianas que son musulmanas.
broader: LGBTQ+ Muslims
change note: Version 4.2.0
has top concept: LGBTQ+ African religions
in scheme: v3
preferred label: Musulmanas lesbianas

Native American lesbians
type: Concept
issued: 2019-05-14
modified: 2025-02-23
replaces: lesbianNativeAmericans
comment: People who are part of the Native peoples of the continental United States and Canada (excluding Inuit people) and self-identity as lesbians. Use more specific terms when available.
comment: Lesbianas que son nativoamericanas o parte de los pueblos indígenas de Norteamérica; utilícese únicamente para personas que se autoidentifiquen como nativoamericanas y lesbianas.
alternative label: American Indian lesbians
alternative label: Lesbian Native Americans
broader: Native American LGBTQ+ people
change note: Version 4.2.0
has top concept: LGBTQ+ people
in scheme: v3
preferred label: Lesbianas nativoamericanas

Lesbian political groups
type: Concept
issued: 2019-05-14
modified: 2025-02-23
replaces: lesbianPoliticalGroups
comment: Organized groups centered on political change and action for lesbian rights; may include advocating for lesbianism as a political and feminist choice against sexism.
comment: Grupos organizados centrados en el cambio político y la acción por los derechos de las lesbianas; puede incluir la defensa del lesbianismo como una opción política y feminista contra el sexismo.
broader: LGBTQ+ political groups
change note: Version 4.2.0
has top concept: LGBTQ+ political groups
in scheme: v3
preferred label: Grupos politicos lésbicos

Lesbian pride
type: Concept
issued: 2019-05-14
modified: 2025-02-23
replaces: lesbianPride
comment: The recognition and celebration of lesbians and lesbian culture, thereby affirming the visibility, dignity, and diversity of lesbian communities.
comment: La celebración y el reconocimiento de la identidad lésbica, afirmando la visibilidad, dignidad y diversidad de las comunidades lésbicas.
broader: LGBTQ+ pride
change note: Version 4.2.0
has top concept: LGBTQ+ pride
in scheme: v3
preferred label: Orgullo lésbico

Lesbian sex workers
type: Concept
issued: 2019-05-14
modified: 2025-02-23
replaces: lesbianProstitutes
comment: Lesbians who receive money or goods in exchange for sexual services, performances, or companionship. Use to describe lesbians working across the broad spectrum of sex work.
alternative label: Lesbian prostitutes
alternative label: Lesbian prostitution
alternative label: Lesbian sex work
broader: LGBTQ+ sex workers
change note: Version 4.2.0
has top concept: Sex workers
in scheme: v3
preferred label: Trabajadoras sexuales lesbianas

Lesbian Protestants
type: Concept
issued: 2019-05-14
modified: 2025-02-23
replaces: lesbianProtestants
comment: Lesbians who are members of the Protestant Church.
comment: Lesbianas que son miembros de la Iglesia protestante.
broader: LGBTQ+ Protestants
change note: Version 4.2.0
has top concept: LGBTQ+ African religions
in scheme: v3
preferred label: Protestantes lesbianas

Lesbian publishers
type: Concept
issued: 2019-05-14
modified: 2025-02-23
replaces: lesbianPublishers
comment: Companies and organizations that publish materials for lesbian communities or addressing lesbian issues.
comment: Empresas y organizaciones que publican materiales para comunidades lésbicas o que abordan asuntos lésbicos.
broader: LGBTQ+ publishers
change note: Version 4.2.0
has top concept: LGBTQ+ publishers
in scheme: v3
preferred label: Editoriales lésbicas

Lesbian rights
type: Concept
issued: 2019-05-14
modified: 2025-02-23
replaces: lesbianRights
comment: Legal, social, or ethical principles of freedom or entitlement held by lesbians.
comment: Principios legales, sociales o éticos de libertad o derechos que tienen las lesbianas.
broader: LGBTQ+ civil rights
change note: Version 4.2.0
has top concept: Human rights
in scheme: v3
preferred label: Derechos lésbicos

Lesbian Roman Catholics
type: Concept
issued: 2019-05-14
modified: 2025-02-23
replaces: lesbianRomanCatholics
comment: Lesbians who are members of the Roman Catholic Church.
comment: Lesbianas que son miembros de la Iglesia católica romana.
broader: LGBTQ+ Roman Catholics
change note: Version 4.2.0
has top concept: LGBTQ+ African religions
in scheme: v3
preferred label: Lesbianas católico romanas

Lesbian victims' rights
type: Concept
issued: 2019-05-14
modified: 2025-02-23
replaces: lesbianVictimsRights
comment: Lesbians' legal rights to be informed, present, and heard within the criminal justice system after having been harmed or injured as the result of of a crime, accident, or other event.
comment: Los derechos legales de las lesbianas a estar informadas, estar presentes y ser escuchadas dentro del sistema de justicia penal después de haber sido perjudicadas o lesionadas como resultado de un delito, accidente u otro evento.
alternative label: Derechos de víctimas lésbicas
broader: LGBTQ+ victims' rights
change note: Version 4.2.0
has top concept: Law
in scheme: v3
preferred label: Derechos de víctimas lesbianas

White lesbians
type: Concept
issued: 2019-05-14
modified: 2025-02-23
replaces: lesbianWhitePeople
comment: Lesbians who are white.
comment: Lesbianas que son blancas.
alternative label: Caucasian lesbians
alternative label: Lesbianas caucásicas
broader: White LGBTQ+ people
change note: Version 4.2.0
has top concept: White LGBTQ+ people
in scheme: v3
preferred label: Lesbianas blancas

Lesbians in the military
type: Concept
issued: 2019-05-14
modified: 2025-02-23
replaces: lesbiansInTheMilitary
comment: Lesbians serving in state and national armed forces.
comment: Lesbianas que sirven en las fuerzas armadas estatales y nacionales.
alternative label: Lesbianas en las fuerzas armadas
broader: LGBTQ+ people in the military
change note: Version 4.2.0
has top concept: Legal status
in scheme: v3
preferred label: Lesbianas en el ejército

Lesbians of color
type: Concept
issued: 2019-05-14
modified: 2025-02-23
replaces: lesbiansOfColour
comment: Primarily used in the United States, this term refers to lesbians who are not white and who identify as people of color.
comment: Lesbianas que no son blancas y que se autoidentifican como personas de color.
broader: LGBTQ+ people of color
change note: Version 4.2.0
has top concept: LGBTQ+ people
in scheme: v3
preferred label: Lesbianas de color
preferred label: Lesbians of colour

LGBTQ+ blood donors
type: Concept
issued: 2019-05-14
modified: 2025-02-23
replaces: LGBTQBloodDonors
comment: LGBTQ+ people who give blood for transfusion and medical purposes.
comment: Personas LGBTQ+ que donan sangre para transfusiones y con fines médicos.
alternative label: LGBTQ blood donors
alternative label: Donantes de sangre LGBTQ
broader: Donors
change note: Version 4.2.0
has top concept: Donors
in scheme: v3
preferred label: Donantes de sangre LGBTQ+

LGBTQ+ co-fathers
type: Concept
issued: 2019-05-14
modified: 2025-02-23
replaces: LGBTQCoFathers
comment: Co-parenting fathers who are LGBTQ+ people. They may or may not be partners.
comment: Padres coparentales que son personas LGBTQ+. Pueden o no ser pareja.
alternative label: LGBTQ co-fathers
alternative label: Co-padres LGBTQ
alternative label: Co-papás LGBTQ+
broader: LGBTQ+ co-parents
change note: Version 4.2.0
has top concept: LGBTQ+ families
in scheme: v3
preferred label: Co-padres LGBTQ+

LGBTQ+ communes
type: Concept
issued: 2019-05-14
modified: 2025-02-23
replaces: LGBTQCommunes
comment: Groups of LGBTQ+ people living in community and sharing possessions and responsibilities.
comment: Grupos de personas LGBTQ+ que viven en comunidad y comparten posesiones y responsabilidades.
alternative label: LGBTQ communes
alternative label: Comunas LGBTQ
broader: LGBTQ+ communities
change note: Version 4.2.0
has top concept: LGBTQ+ communities
in scheme: v3
preferred label: Comunas LGBTQ+

LGBTQ+ cruises
type: Concept
issued: 2019-05-14
modified: 2025-02-23
replaces: LGBTQCruises
comment: Voyages on a ship taken for pleasure or as a vacation; use in reference to cruises catered toward LGBTQ+ clientele.
comment: Viajes en un barco realizados por placer o como vacaciones; utilícese en referencia a cruceros dirigidos a clientes LGBTQ+.
alternative label: LGBTQ cruises
alternative label: Cruceros LGBTQ
broader: LGBTQ+ tourism
change note: Version 4.2.0
has top concept: LGBTQ+ tourism
in scheme: v3
preferred label: Cruceros LGBTQ+

LGBTQ+ ex-partners
type: Concept
issued: 2019-05-14
modified: 2025-02-23
replaces: LGBTQExPartners
comment: Gender-neutral term for former sexual, romantic, or play partners who are also LGBTQ+.
comment: Término de género neutro para antiguas parejas sexuales, románticas o de juego que también son LGBTQ+.
alternative label: LGBTQ ex-partners
broader: LGBTQ+ partners
change note: Version 4.2.0
has top concept: LGBTQ+ families
in scheme: v3
preferred label: Ex-parejas LGBTQ+

LGBTQ+ health education
type: Concept
issued: 2019-05-14
modified: 2025-02-23
replaces: LGBTQHealthEducation
comment: Instruction about health for LGBTQ+ people, including topics such as gender-affirming healthcare and safer sex practices.
comment: Instrucción sobre la salud para personas LGBTQ+, incluidos temas como la atención médica de afirmación de género y prácticas sexuales más seguras.
alternative label: LGBTQ health education
alternative label: Educación sanitaria (LGBTQ)
broader: Information provision
change note: Version 4.2.0
has top concept: Information provision
in scheme: v3
preferred label: Educación sanitaria LGBTQ+

LGBTQ+ Mormons
type: Concept
issued: 2019-05-14
modified: 2025-02-23
replaces: LGBTQMormons
comment: LGBTQ+ people who are members of the Mormon Church.
comment: Personas LGBTQ+ que son miembros de la Iglesia mormona.
alternative label: Mormons (LGBTQ)
alternative label: LGBTQ Mormons
alternative label: Mormones LGBTQ
alternative label: Mormones (LGBTQ)
broader: LGBTQ+ Christians
change note: Version 4.2.0
has top concept: LGBTQ+ African religions
in scheme: v3
preferred label: Mormones LGBTQ+

LGBTQ+ nonviolent resistance
type: Concept
issued: 2019-05-14
modified: 2025-02-23
replaces: LGBTQNonviolentResistance
comment: Actions taken to promote social change for LGBTQ+ people and communities through non-violent means, including protests, boycotts, and organized non-cooperation.
comment: Acciones tomadas para promover el cambio social para las personas y comunidades LGBTQ+ a través de medios no violentos, incluidas las protestas, los boicots y la no-cooperación organizada.
alternative label: LGBTQ nonviolent resistance
alternative label: Resistencia no violenta (LGBTQ)
broader: LGBTQ+ direct action
change note: Version 4.2.0
has top concept: LGBTQ+ activism
in scheme: v3
preferred label: Resistencia no violenta LGBTQ+

LGBTQ+ Old Catholics
type: Concept
issued: 2019-05-14
modified: 2025-02-23
replaces: LGBTQOldCatholicChurch
comment: LGBTQ+ members of the anti-papal-primacy Christian denomination that originated with groups that split from the Holy See because they disagreed with essential doctrines.
comment: Miembros LGBTQ+ de la denominación cristiana antiprimacía papal que se originó con grupos que se separaron de la Santa Sede porque no estaban de acuerdo con doctrinas esenciales.
alternative label: LGBTQ+ Old Catholic Church
alternative label: Iglesia católica antigua LGBTQ+
broader: LGBTQ+ Christians
change note: Version 4.2.0
has top concept: LGBTQ+ African religions
in scheme: v3
preferred label: Católicos antiguos LGBTQ+

LGBTQ+ petitions
type: Concept
issued: 2019-05-14
modified: 2025-02-23
replaces: LGBTQPetitions
comment: Written requests for political or social action that are addressed to government officials or public entities and signed by numerous people; use in reference to petitions created by or addressing LGBTQ+ organizations, communities, and/or concerns.
comment: Solicitudes escritas para acción política o social dirigidas a funcionarios gubernamentales o entidades públicas, y firmadas por numerosas personas; utilícese en referencia a peticiones creadas o dirigidas a organizaciones, comunidades y/o inquietudes LGBTQ+.
alternative label: LGBTQ petitions
alternative label: Peticiones LGBTQ
broader: LGBTQ+ direct action
change note: Version 4.2.0
has top concept: LGBTQ+ activism
in scheme: v3
preferred label: Peticiones LGBTQ+

LGBTQ+ prisoners of conscience
type: Concept
issued: 2019-05-14
modified: 2025-04-17
replaces: LGBTQPrisonersOfConscience
comment: LGBTQ+ people who are incarcerated because of their gender identity or sexuality, or due to conscientiously held beliefs such as opposition to war or human rights violations.
comment: Personas LGBTQ+ que están encarceladas por su identidad sexual o de género; también puede utilizarse para describir a personas LGBTQ+ encarceladas debido a su raza, religión u opiniones políticas.
alternative label: Prisoners of conscience (LGBTQ)
alternative label: LGBTQ prisoners of conscience
alternative label: Prisioneros de conciencia (LGBTQ)
broader: LGBTQ+ incarcerated people
change note: Version 4.2.0
has top concept: LGBTQ+ people
in scheme: v3
preferred label: Prisioneros de conciencia LGBTQ+

LGBTQ+ Quakers
type: Concept
issued: 2019-05-14
modified: 2025-02-23
replaces: LGBTQQuakers
comment: LGBTQ+ people who are Quakers.
comment: Personas LGBTQ+ que son cuáqueras.
alternative label: LGBTQ Religious Society of Friends
alternative label: LGBTQ Society of Friends
alternative label: Quakers (LGBTQ)
alternative label: LGBTQ Quakers
broader: LGBTQ+ Protestants
change note: Version 4.2.0
has top concept: LGBTQ+ African religions
in scheme: v3
preferred label: Cuáqueros LGBTQ+

LGBTQ+ resorts
type: Concept
issued: 2019-05-14
modified: 2025-02-23
replaces: LGBTQResorts
comment: Commercial establishments providing lodging, entertainment, food, drinks, sporting, and shopping; use in reference to resorts that cater primarily to LGBTQ+ people or are known to be frequented by LGBTQ+ people.
comment: Establecimientos comerciales que brindan alojamiento, entretenimiento, alimentos, bebidas, deportes y lugares de compras; utilícese en referencia a resorts que principalmente atienden a personas LGBTQ+ o que son conocidos por ser frecuentados por personas LGBTQ+.
alternative label: LGBTQ resorts
alternative label: Resorts (LGBTQ)
broader: LGBTQ+ hotels
change note: Version 4.2.0
has top concept: LGBTQ+ hotels
in scheme: v3
preferred label: Resorts LGBTQ+

LGBTQ+ self-defense
type: Concept
issued: 2019-05-14
modified: 2025-02-23
replaces: LGBTQSelfDefence
comment: Countermeasures taken by an LGBTQ+ person to protect their own health or well being from harm.
comment: Contramedidas tomadas por una persona LGBTQ+ para proteger su propia salud o bienestar de daños.
broader: LGBTQ+ direct action
change note: Version 4.2.0
has top concept: LGBTQ+ activism
in scheme: v3
preferred label: Autodefensa LGBTQ+
preferred label: LGBTQ+ self-defence

LGBTQ+ shamans
type: Concept
issued: 2019-05-14
modified: 2025-02-23
replaces: LGBTQShamans
comment: LGBTQ+ people who are shamans either through traditional community practices or self-designation.
comment: Personas LGBTQ+ que son chamanes ya sea a través de prácticas comunitarias tradicionales o por autodesignación.
alternative label: Shamans (LGBTQ)
alternative label: LGBTQ shamans
alternative label: Chamanes LGBTQ
alternative label: Chamanes (LGBTQ)
broader: LGBTQ+ African religions
change note: Version 4.2.0
has top concept: LGBTQ+ African religions
in scheme: v3
preferred label: Chamanes LGBTQ+

LGBTQ+ Shintoists
type: Concept
issued: 2019-05-14
modified: 2025-02-23
replaces: LGBTQShintoists
comment: LGBTQ+ people who are Shintoists.
comment: Personas LGBTQ+ que son sintoístas.
alternative label: LGBTQ Shinto
alternative label: Shintoists (LGBTQ)
alternative label: LGBTQ Shintoists
alternative label: Sintoístas LGBTQ
broader: LGBTQ+ African religions
change note: Version 4.2.0
has top concept: LGBTQ+ African religions
in scheme: v3
preferred label: Sintoístas LGBTQ+

LGBTQ+ single fathers
type: Concept
issued: 2019-05-14
modified: 2025-02-23
replaces: LGBTQSingleFathers
comment: LGBTQ+ people who are fathers but are not married or part of a long-term partnership.
comment: Personas LGBTQ+ que son padres pero no están casados ni en una relación a largo plazo.
alternative label: LGBTQ single fathers
alternative label: Papás solteros LGBTQ
broader: LGBTQ+ single parents
change note: Version 4.2.0
has top concept: LGBTQ+ families
in scheme: v3
preferred label: Padres solteros LGBTQ+

LGBTQ+ Taoists
type: Concept
issued: 2019-05-14
modified: 2025-02-23
replaces: LGBTQTaoists
comment: LGBTQ+ people who are Taoists.
comment: Personas LGBTQ+ que son taoístas.
alternative label: Taoists (LGBTQ)
alternative label: LGBTQ Taoists
alternative label: Taoístas LGBTQ
alternative label: Taoístas (LGBTQ)
broader: LGBTQ+ African religions
change note: Version 4.2.0
has top concept: LGBTQ+ African religions
in scheme: v3
preferred label: Taoístas LGBTQ+

LGBTQ+ unrequited love
type: Concept
issued: 2019-05-14
modified: 2025-02-23
replaces: LGBTQUnrequitedLove
comment: Attraction to another person that is not reciprocated, by LGBTQ+ people
comment: Atracción hacia otra persona que no es correspondida, por parte de personas LGBTQ+.
alternative label: LGBTQ unrequited love
broader: Being in love
change note: Version 4.2.0
has top concept: Being in love
in scheme: v3
preferred label: Amor LGBTQ+ no correspondido

LGBTQ+ visibility
type: Concept
issued: 2019-05-14
modified: 2025-02-23
replaces: LGBTQVisibility
comment: Visibility of LGBTQ+ people in society, meaning the extent to which LGBTQ+ people and identities are recognized by the general public.
comment: Visibilidad de las personas LGBTQ+ en la sociedad, es decir, el grado en que las personas e identidades LGBTQ+ son reconocidas por el público en general.
alternative label: Visibility of LGBTQ people
alternative label: LGBTQ visibility
broader: LGBTQ+ social processes
change note: Version 4.2.0
has top concept: LGBTQ+ social processes
in scheme: v3
preferred label: Visibilidad LGBTQ+

Love triangles
type: Concept
issued: 2019-05-14
modified: 2026-02-27
replaces: loveTriangles
comment: A scenario in which two people are pursuing or are romantically involved with one person, or in which one person is in a romantic relationship while pursuing or becoming involved with another. Often, the two individuals dating, pursuing, or being pursued by the same person are depicted as rivals competing for a monogamous romantic relationship. Love triangles should not be confused with triads, throuples, or other forms of polyamorous relationships.
comment: Relaciones poliamorosas que involucran a tres personas en diversos arreglos.
broader: Sexual relationships
change note: Version 4.2.0
has top concept: Relationship satisfaction
in scheme: v3
preferred label: Triángulos amorosos

Lubricants
type: Concept
issued: 2019-05-14
modified: 2025-02-23
replaces: lubricants
comment: Liquids or gels used during sexual activity, typically to ease the act of penetration by a penis or a sex toy.
comment: Líquidos o geles utilizados durante la actividad sexual, generalmente para facilitar el acto de penetración de un pene o un juguete sexual.
broader: Sex accessories
change note: Version 4.2.0
has top concept: Sex accessories
in scheme: v3
preferred label: Lubricantes

Mak nyahs
type: Concept
issued: 2019-05-14
modified: 2025-02-23
replaces: makNyah
comment: Term used in Malaysia for transgender women.
comment: Término utilizado en Malasia para mujeres transgénero.
broader: Non-Euro-American gender and sexual identities
change note: Version 4.2.0
has top concept: Gender
in scheme: v3

Mangaiko
type: Concept
issued: 2019-05-14
modified: 2025-02-23
replaces: mangaiko
comment: Mbo term for third gender people.
comment: Término mbo para personas del tercer género.
broader: Non-Euro-American gender and sexual identities
change note: Version 4.2.0
has top concept: Gender
in scheme: v3

Married people
type: Concept
issued: 2019-05-14
modified: 2025-02-23
replaces: marriedPeople
comment: Individuals who are currently married, or part of a legal union involving two or more people in a personal relationship that may or may not grant certain economic, legal, and social rights.
comment: Personas que actualmente están casadas o forman parte de una unión legal entre dos o más personas en una relación personal que puede o no otorgar ciertos derechos económicos, legales y sociales.
broader: Marital status
change note: Version 4.2.0
has top concept: Living arrangements
in scheme: v3
preferred label: Personas casadas

Mashoga
type: Concept
issued: 2019-05-14
modified: 2025-02-23
replaces: mashoga
comment: Swahili term for people assigned male at birth who engage in sex with men and who may dress as women.
comment: Término swahili para personas asignadas al sexo masculino al nacer que tienen relaciones sexuales con hombres y que pueden vestirse como mujeres.
broader: Non-Euro-American gender and sexual identities
change note: Version 4.2.0
has top concept: Gender
in scheme: v3

Men's movement
type: Concept
issued: 2019-05-14
modified: 2025-02-23
replaces: mensMovement
comment: Movement that began in the 1960s and 1970s (primarily in the United States, United Kingdom, and Australia) in response to the women's movement. Consists of groups and organizations of men and their allies working to address gender issues and their impact on men. Different men's movement groups vary significantly in how they frame their relationship to the women's movement and society at large. Not to be confused with the men's or father's rights movement, which focuses on perceived inequalities faced by men and seeks to maintain patriarchal values.
comment: Movimiento que comenzó en las décadas de 1960 y 1970 (principalmente en los Estados Unidos, el Reino Unido y Australia) en respuesta al movimiento de mujeres. Está formado por grupos y organizaciones de hombres y sus aliados que trabajan para abordar los asuntos de género y su impacto en los hombres. Los diferentes grupos del movimiento de hombres varían significativamente en la forma en que enmarcan su relación con el movimiento de mujeres y la sociedad en general. No confundir con el movimiento por los derechos de los hombres o de los padres, que se centra en las desigualdades percibidas que enfrentan los hombres y busca mantener los valores patriarcales.
broader: Social movements
change note: Version 4.2.0
has top concept: Social movements
in scheme: v3
preferred label: Movimiento de hombres

Metis
type: Concept
issued: 2019-05-14
modified: 2025-02-23
replaces: metis
comment: Officially recognized third gender in Nepal; predominantly used to refer to transgender women.
comment: Tercer género oficialmente reconocido en Nepal; se utiliza predominantemente para referirse a mujeres transgénero.
broader: Non-Euro-American gender and sexual identities
change note: Version 4.2.0
has top concept: Gender
in scheme: v3

Micropenis
type: Concept
issued: 2019-05-14
modified: 2025-02-23
replaces: micropenis
comment: A person born with a micropenis has a penis that is smaller than the typical size range for an infant. People may also develop a micropenis as a result of several different intersex variations. The size of a person’s penis does not generally affect its functionality.
comment: Una persona que nace con un micropene tiene un pene que es más pequeño que el rango de tamaño usual para un bebé. Las personas también pueden desarrollar un micropene como resultado de diferentes variaciones intersex. Por lo general, el tamaño del pene de una persona no afecta su funcionalidad.
alternative label: Microphallus
alternative label: Microfalo
broader: Intersex variations
change note: Version 4.2.0
has top concept: Sex (Body)
in scheme: v3
preferred label: Micropene

Mosaicism involving "sex" chromosomes
type: Concept
issued: 2019-05-14
modified: 2025-02-23
replaces: mosaicismInvolvingSexChromosomes
comment: People with mosaic chromosomes have different chromosome patterns in some cells of their body than in others. Mosaicism results from random differences in how cells divide while an embryo is growing, resulting in different numbers of chromosomes in different cells (such as 45X/46XX or 45X/46XY, which are both variants of Turner syndrome, or 46XY/47XXY or 46XX/47XXY, which are both variants of Klinefelter syndrome). If someone specifically has 46XX chromosomes in some cells and 46XY in others, their variation is probably chimerism instead of mosaicism. Having mosaic chromosomes can cause someone to develop variations in their genitals, gonads, or hormone function. For example, if they have at least one Y chromosome, they may have both ovarian and testicular tissue, or genital differences like hypospadias, or they may develop some secondary sex characteristics at puberty that are not expected for the sex they were assigned. People who have mosaicism without a Y chromosome (e.g., 45X/46XX, or 46XX/47XXX) may have streak gonads or ovaries that stop functioning at an earlier age than typical, which can affect development during puberty and fertility. Other people may not have any noticeable signs of their mosaicism at all.
broader: Intersex variations
change note: Version 4.2.0
has top concept: Sex (Body)
in scheme: v3

Mothers of bisexual people
type: Concept
issued: 2019-05-14
modified: 2025-02-23
replaces: mothersOfBisexualPeople
comment: A person who assumes the role of mother to a bisexual person; use only for individuals who self-identify as mothers.
comment: Una persona que asume el rol de madre de una persona bisexual; utilícese únicamente para personas que se autoidentifiquen como madres.
alternative label: Mamás de personas bisexuales
broader: Mothers of LGBTQ+ people
change note: Version 4.2.0
has top concept: Family members
in scheme: v3
preferred label: Madres de personas bisexuales

Mothers of gay men
type: Concept
issued: 2019-05-14
modified: 2025-02-23
replaces: mothersOfGayMen
comment: A person who assumes the role of mother to a gay man; use only for individuals who self-identify as mothers.
comment: Una persona que asume el rol de madre de un hombre gay; utilícese únicamente para personas que se autoidentifiquen como madres.
alternative label: Mamás de hombres gay
broader: Mothers of LGBTQ+ people
change note: Version 4.2.0
has top concept: Family members
in scheme: v3
preferred label: Madres de hombres gay

Mothers of lesbians
type: Concept
issued: 2019-05-14
modified: 2025-02-23
replaces: mothersOfLesbians
comment: A person who assumes the role of mother to a lesbian; use only for individuals who self-identify as mothers.
comment: Una persona que asume el rol de madre de una lesbiana; utilícese únicamente para personas que se autoidentifiquen como madres.
alternative label: Mamás de lesbianas
broader: Mothers of LGBTQ+ people
change note: Version 4.2.0
has top concept: Family members
in scheme: v3
preferred label: Madres de lesbianas

Mothers of transgender people
type: Concept
issued: 2019-05-14
modified: 2025-02-23
replaces: mothersOfTransgenderPeople
comment: A person who assumes the role of mother to a transgender person; use only for individuals who self-identify as mothers.
comment: Una persona que asume el rol de madre de una persona transgénero; utilícese únicamente para personas que se autoidentifiquen como madres.
alternative label: Mamás de personas transgénero
broader: Mothers of LGBTQ+ people
change note: Version 4.2.0
has top concept: Family members
in scheme: v3
preferred label: Madres de personas transgénero

Mukhannathun
type: Concept
issued: 2019-05-14
modified: 2025-02-23
replaces: mukhannathun
comment: A term used in classical Arabic to refer to men who are perceived as effeminate.
comment: Término utilizado en el árabe clásico para referirse a hombres percibidos como afeminados.
alternative label: Mukhannaths
broader: Non-Euro-American gender and sexual identities
change note: Version 4.2.0
has top concept: Gender
in scheme: v3

Muxe
type: Concept
issued: 2019-05-14
modified: 2025-02-23
replaces: muxe
comment: In Zapotec cultures of Oaxaca (southern Mexico), this term refers to people assigned male at birth who dress and behave in feminine ways; sometimes considered a third gender.
comment: En las culturas zapotecas de Oaxaca (sur de México), este término se refiere a personas asignadas al sexo masculino al nacer que se visten y comportan de manera femenina; a veces es considerado un tercer género.
broader: Non-Euro-American gender and sexual identities
change note: Version 4.2.0
has top concept: Gender
in scheme: v3

Older queer people
type: Concept
issued: 2019-05-14
modified: 2025-02-23
replaces: olderQueerPeople
comment: Queer people who are advanced in age, typically over 60 years of age.
comment: Personas queer de edad avanzada, normalmente mayores de 60 años.
alternative label: Personas ancianas queer
alternative label: Personas en su tercera edad queer
alternative label: Personas de tercera edad queer
broader: LGBTQ+ older people
change note: Version 4.2.0
has top concept: LGBTQ+ people
in scheme: v3
preferred label: Personas mayores queer

Single parent families
type: Concept
is replaced by: LGBTQ+ single-parent families
issued: 2019-05-14
modified: 2025-07-16
replaces: singleParentFamilies
comment: Families headed by a single parent. For single parent families headed by or including LGBTQ+ people, use the term "LGBTQ+ single parent families."
comment: Familias encabezadas por un solo progenitor. Para familias monoparentales encabezadas por personas LGBTQ+ o que las incluyan, utilícese el término "familias monoparentales LGBTQ+".
alternative label: One-parent families
alternative label: Familias de un padre
alternative label: Familia de una madre
change note: Version 4.2.0
in scheme: v3
preferred label: Familias monoparentales

Orgasms
type: Concept
issued: 2019-05-14
modified: 2025-03-20
replaces: orgasm
comment: Climaxes of sexual excitement, typically characterized by feelings of pleasure and physical sensations including rapid muscle contractions, higher blood pressure and heart rate, release of endorphins, and ejaculation.
comment: Clímax de la excitación sexual, típicamente caracterizado por sentimientos de placer y sensaciones físicas que incluyen contracciones musculares rápidas, presión arterial y frecuencia cardíaca más altas, liberación de endorfinas y eyaculación.
alternative label: Climaxes
change note: Version 4.2.0
in scheme: v3
preferred label: Orgasmo

Ovo-testes
type: Concept
issued: 2019-05-14
modified: 2025-02-23
replaces: ovoTestes
comment: People with this variation are born with both ovarian and testicular tissue. A person can develop one testis and one ovary, or they may develop one or more ovo-testes, which means that a single gonad is made up of both ovarian and testicular cells. The levels of hormones they produce can vary and how their genitals and secondary sex characteristics develop will depend partially on the levels of estrogen and testosterone that their bodies make. In adolescence, people with ovo-testes may develop features associated with either a typical estrogen puberty or a typical testosterone puberty, or they may develop some of each. Sometimes a person with an ovary and a testis or with ovo-testes can produce viable sperm and viable eggs.
comment: Las personas con esta variación nacen con tejido ovárico y testicular. Una persona puede desarrollar un testículo y un ovario, o puede desarrollar uno o más ovotestículos, lo que significa que una sola gónada está formada por células ováricas y testiculares. Los niveles de hormonas que producen pueden variar y la forma en que se desarrollan sus genitales y características sexuales secundarias dependerá en parte de los niveles de estrógeno y testosterona que produzca su cuerpo. En la adolescencia, las personas con ovotestículos pueden desarrollar características asociadas con una pubertad típica de estrógenos o una pubertad típica de testosterona, o pueden desarrollar algunas de cada una. A veces, una persona con un ovario y un testículo o con ovotestículos puede producir espermatozoides y óvulos viables.
alternative label: True hermaphroditism
alternative label: "Ovotesticular DSD "
broader: Intersex variations
change note: Version 4.2.0
has top concept: Sex (Body)
in scheme: v3
preferred label: Ovotestículo

Palao'ana
type: Concept
issued: 2019-05-14
modified: 2025-02-23
replaces: palaoana
comment: Chamorro (Mariana Islands) term for third gender people.
comment: Término chamorro (Islas Marianas) para personas del tercer género.
broader: Non-Euro-American gender and sexual identities
change note: Version 4.2.0
has top concept: Gender
in scheme: v3

Partners of bisexual people
type: Concept
issued: 2019-05-14
modified: 2025-02-23
replaces: partnersOfBisexualPeople
comment: People whose sexual, romantic, or play partner is bisexual.
comment: Personas cuya pareja sexual, romántica o de juego es bisexual.
broader: Partners of LGBTQ+ people
change note: Version 4.2.0
has top concept: Partners
in scheme: v3
preferred label: Parejas de personas bisexuales

Partners of gay men
type: Concept
issued: 2019-05-14
modified: 2025-02-23
replaces: partnersOfGayMen
comment: People whose sexual, romantic, or play partner is a gay man.
comment: Personas cuya pareja sexual, romántica o de juego es un hombre gay.
broader: Partners of LGBTQ+ people
change note: Version 4.2.0
has top concept: Partners
in scheme: v3
preferred label: Parejas de hombres gay

Partners of lesbians
type: Concept
issued: 2019-05-14
modified: 2025-02-23
replaces: partnersOfLesbians
comment: People whose sexual, romantic, or play partner is a lesbian.
comment: Personas cuya pareja sexual, romántica o de juego es lesbiana.
broader: Partners of LGBTQ+ people
change note: Version 4.2.0
has top concept: Partners
in scheme: v3
preferred label: Parejas de lesbianas

Partners of queer people
type: Concept
issued: 2019-05-14
modified: 2025-02-23
replaces: partnersOfQueerPeople
comment: People whose sexual, romantic, or play partner is queer.
comment: Personas cuya pareja sexual, romántica o de juego es queer.
broader: Partners of LGBTQ+ people
change note: Version 4.2.0
has top concept: Partners
in scheme: v3
preferred label: Parejas de personas queer

Peep shows
type: Concept
issued: 2019-05-14
modified: 2025-02-23
replaces: peepShows
comment: Live sex shows or pornographic movies viewed through a small opening or magnifying lens, typically from a coin-operated booth.
comment: Espectáculos de sexo en vivo o películas pornográficas vistas a través de una pequeña apertura o lente de aumento, generalmente desde una cabina que funciona con monedas.
alternative label: Peepshows
broader: Sex industry
change note: Version 4.2.0
has top concept: Sex industry
in scheme: v3

LGBTQ+ performance art
type: Concept
issued: 2019-05-14
modified: 2025-03-20
replaces: performanceArt
comment: Art created through actions performed by the artist or other participants, typically for a live audience. Use to refer to performance art created by LGBTQ+ artists and/or engaging with LGBTQ+ issues.
comment: Arte creado a través de acciones realizadas por el artista u otros participantes, generalmente para una audiencia en vivo.
alternative label: Performance art (LGBTQ)
alternative label: LGBTQ+ live art
alternative label: Live art (LGBTQ)
change note: Version 4.2.0
in scheme: v3
preferred label: Arte escénico

Physical health care for LGBTQ+ people
type: Concept
issued: 2019-05-14
modified: 2025-02-23
replaces: physicalHealthCareForLGBTQPeople
comment: Organized measures taken for the maintenance, treatment, or improvement of physical health or conditions of the body; use in reference to physical health care addressing the particular needs of LGBTQ+ individuals or communities.
comment: Medidas organizadas tomadas para el mantenimiento, el tratamiento o la mejora de la salud física o las condiciones del cuerpo; utilícese en referencia a la atención de la salud física que aborda las necesidades particulares de personas o comunidades LGBTQ+.
alternative label: Physical health care for LGBTQ people
alternative label: Asistencia médica física para personas LGBTQ
alternative label: Cuidado de la salud física para personas LGBTQ
alternative label: Atención médica física para personas LGBTQ
broader: Health care for LGBTQ+ people
change note: Version 4.2.0
has top concept: Health care for LGBTQ+ people
in scheme: v3
preferred label: Asistencia médica física para personas LGBTQ+

Pinching (Erotic)
type: Concept
issued: 2019-05-14
modified: 2025-03-20
replaces: pinching
comment: Form of manual stimulation involving gripping, pulling, or putting tension on parts of one’s body or another person's body for sexual stimulation, arousal, or pleasure.
comment: Forma de estimulación manual que implica agarrar, jalar, o poner tensión en partes del cuerpo de una misma persona o de otra persona para estimulación, excitación o placer sexual.
change note: Version 4.2.0
in scheme: v3
preferred label: Pellizcar

Pink triangles
type: Concept
issued: 2019-05-14
modified: 2025-02-23
replaces: pinkTriangles
comment: International symbol of gay pride and the gay rights movement that symbolizes the reclamation of the pink triangles used in Nazi Germany to identify gay men (and, later, bisexual men and transgender women) who were sent to concentration camps.
comment: Símbolo internacional del orgullo gay y del movimiento por los derechos gay que simboliza la reclamación de los triángulos rosas utilizados en la Alemania nazi para identificar a los hombres gay (y, eventualmente, a los hombres bisexuales y las mujeres transgénero) que fueron enviados a campos de concentración.
alternative label: Triángulos rosados
broader: LGBTQ+ symbols
change note: Version 4.2.0
has top concept: LGBTQ+ symbols
in scheme: v3
preferred label: Triángulos rosas

PrEP
type: Concept
issued: 2019-05-14
modified: 2025-03-20
replaces: prep
comment: Medication taken regularly to reduce the risk of contracting HIV.
comment: Medicamentos tomados para prevenir la contracción del VIH.
alternative label: Pre-exposure prophylaxis
alternative label: Profilaxis preexposición
change note: Version 4.2.0
in scheme: v3

Progestin induced virilization
type: Concept
issued: 2019-05-14
modified: 2025-02-23
replaces: progestinInducedVirilization
comment: People born with progestin-induced virilization have XX chromosomes and may have visible genital variations at birth such as a larger-than-typical clitoris, sometimes also with fused or partially fused labia. They usually have a typical uterus, ovaries, and fallopian tubes, though their vagina may or may not have differences. This variation develops in utero as a result of the individual's parent taking progestin medication while pregnant. Being exposed to these additional hormones before birth can change how someone’s genitals develop, but it generally will not change how their own body will produce or respond to hormones later on. This means that someone born with progestin-induced virilization will usually develop features associated with a typical estrogen puberty.
broader: Intersex variations
change note: Version 4.2.0
has top concept: Sex (Body)
in scheme: v3

Queer people of color
type: Concept
issued: 2019-05-14
modified: 2025-02-23
replaces: queerPeopleOfColour
comment: Primarily used in the United States, this term refers to queer people who are not white and who identify as people of color.
comment: Personas queer que no son blancas y que se autoidentifican como personas de color.
alternative label: QPOC
broader: LGBTQ+ people of color
change note: Version 4.2.0
has top concept: LGBTQ+ people
in scheme: v3
preferred label: Personas queer de color
preferred label: Queer people of colour

African American queer people
type: Concept
issued: 2019-05-14
modified: 2025-02-23
replaces: queerAfricanAmericans
comment: Queer people of African descent born in the United States or queer people born in African countries who live in or have a strong connection to the United States. Use for individuals who self-identity as African American. Follow the individual’s preference for African American or Black whenever possible.
comment: Personas queer de ascendencia africana nacidas en los Estados Unidos o personas queer nacidas en países africanos que viven o tienen una conexión fuerte con los Estados Unidos. Utilícese para personas que se autoidentifiquen como afroamericanas.
alternative label: Queer African American people
alternative label: Queer African Americans
alternative label: Afroamericanos queer
alternative label: Queers afroamericanos
alternative label: Afroamericanas queer
alternative label: Queers afroamericanas
broader: African American LGBTQ+ people
change note: Version 4.2.0
has top concept: LGBTQ+ people
in scheme: v3
preferred label: Personas queer afroamericanas

Afro-Canadian queer people
type: Concept
issued: 2019-05-14
modified: 2025-02-23
replaces: queerAfroCanadians
comment: Queer people of African descent born in Canada or queer people born in African countries who live in or have a strong connection to Canada. Use for individuals who self-identify as Afro-Canadian.
comment: Personas queer de ascendencia africana nacidas en Canadá o personas queer nacidas en países africanos que viven o tienen una conexión fuerte con Canadá. Utilícese para personas que se identifiquen como afrocanadienses.
alternative label: Queer Afro-Canadian people
alternative label: Queer Afro-Canadians
alternative label: Personas afrocanadienses queer
alternative label: Afrocanadienses queer
broader: Afro-Canadian LGBTQ+ people
change note: Version 4.2.0
has top concept: LGBTQ+ people
in scheme: v3
preferred label: Personas queer afrocanadienses

Afro-Caribbean queer people
type: Concept
issued: 2019-05-14
modified: 2025-02-23
replaces: queerAfroCaribbeans
comment: Queer people of African descent born in the Caribbean or queer people born in African countries who live in or have a strong connection to the Caribbean. Only use for individuals who self-identify as Afro-Caribbean.
comment: Personas queer de ascendencia africana nacidas en el Caribe o personas queer nacidas en países africanos que viven o tienen una conexión fuerte con el Caribe. Utilícese únicamente para personas que se identifiquen como afrocaribeñas.
alternative label: Queer Afro-Caribbean people
alternative label: Queer Afro-Caribbeans
alternative label: Personas afrocaribeñas queer
alternative label: Afrocaribeños queer
alternative label: Afrocaribeñas queer
broader: Afro-Caribbean LGBTQ+ people
change note: Version 4.2.0
has top concept: LGBTQ+ people
in scheme: v3
preferred label: Personas queer afrocaribeñas

Afro-European queer people
type: Concept
issued: 2019-05-14
modified: 2025-02-23
replaces: queerAfroEuropeans
comment: Queer people of African descent born in European countries or queer people born in African countries who live in or have a strong connection to Europe. Only use for individuals who self-identify as Afro-European.
comment: Personas queer de ascendencia africana nacidas en países europeos o personas queer nacidas en países africanos que viven o tienen una fuerte conexión con Europa. Utilícese únicamente para personas que se identifiquen como afroeuropeas.
alternative label: Queer Afro-European people
alternative label: Queer Afro-Europeans
alternative label: Personas afroeuropeas queer
alternative label: Afroeuropeos queer
alternative label: Afroeuropeas queer
broader: Afro-European LGBTQ+ people
change note: Version 4.2.0
has top concept: LGBTQ+ people
in scheme: v3
preferred label: Personas queer afroeuropeas

Afro-Latin American queer people
type: Concept
issued: 2019-05-14
modified: 2025-02-23
replaces: queerAfroLatinAmericans
comment: Queer people of African descent born in Latin American countries or queer people born in African countries who live in or have a strong connection to Latin America. Only use for individuals who self-identify as Afro-Latin American.
comment: Personas queer afrodescendientes nacidas en países latinoamericanos o personas queer nacidas en países africanos que viven o tienen una conexión fuerte con América Latina. Utilícese únicamente para personas que se identifiquen como afrolatinoamericanas.
alternative label: Queer Afro-Latin American people
alternative label: Queer Afro-Latin Americans
alternative label: Personas afrolatinoamericanas queer
alternative label: Afrolatinoamericanos queer
alternative label: Afrolatinoamericanas queer
broader: Afro-Latin American LGBTQ+ people
change note: Version 4.2.0
has top concept: LGBTQ+ people
in scheme: v3
preferred label: Personas queer afrolatinoamericanas

Queer artists
type: Concept
issued: 2019-05-14
modified: 2025-02-23
replaces: queerArtists
comment: Queer people who practice any of various creative arts.
comment: Artistas conocidos por ser queer.
broader: LGBTQ+ artists
change note: Version 4.2.0
has top concept: LGBTQ+ people
in scheme: v3
preferred label: Artistas queer

Queer atheists
type: Concept
issued: 2019-05-14
modified: 2025-02-23
replaces: queerAtheists
comment: Queer people who are atheists.
comment: Personas queer que son ateas.
broader: LGBTQ+ atheists
change note: Version 4.2.0
has top concept: LGBTQ+ people
in scheme: v3
preferred label: Ateos queer

Queer beaches
type: Concept
issued: 2019-05-14
modified: 2025-02-23
replaces: queerBeaches
comment: Beaches set aside for use by queer people or beaches known to be frequented by queer people.
comment: Playas reservadas para el uso de personas queer o playas conocidas por ser frecuentadas por personas queer.
broader: LGBTQ+ beaches
change note: Version 4.2.0
has top concept: LGBTQ+ meeting places
in scheme: v3
preferred label: Playas queer

Queer bookshops
type: Concept
issued: 2019-05-14
modified: 2025-02-23
replaces: queerBookshops
comment: Bookshops that sell materials intended for use by queer people or addressing topics related to queerness.
comment: Librerías que venden materiales destinados a personas queer o que abordan temas relacionados con lo queer.
broader: LGBTQ+ bookshops
change note: Version 4.2.0
has top concept: LGBTQ+ bookshops
in scheme: v3
preferred label: Librerías queer

Queer Buddhists
type: Concept
issued: 2019-05-14
modified: 2025-02-23
replaces: queerBuddhists
comment: Queer people who are Buddhist.
comment: Personas queer que son budistas.
broader: LGBTQ+ Buddhists
change note: Version 4.2.0
has top concept: LGBTQ+ African religions
in scheme: v3
preferred label: Budistas queer

Queer Christians
type: Concept
issued: 2019-05-14
modified: 2025-02-23
replaces: queerChristians
comment: Queer people who are Christian.
comment: Personas queer que son cristianas.
broader: LGBTQ+ Christians
change note: Version 4.2.0
has top concept: LGBTQ+ African religions
in scheme: v3
preferred label: Cristianos queer

Queer community centers
type: Concept
issued: 2019-05-14
modified: 2025-02-23
replaces: queerCommunityCentres
comment: Spaces in which people from queer communities meet for social, education, recreational, or organizing activities.
comment: Espacios en los que personas de comunidades queer se reúnen para realizar actividades sociales, educativas, recreativas u organizativas.
broader: LGBTQ+ community centers
change note: Version 4.2.0
has top concept: LGBTQ+ centers
in scheme: v3
preferred label: Centros comunitarios queer
preferred label: Queer community centres

Queer couples
type: Concept
issued: 2019-05-14
modified: 2025-02-23
replaces: queerCouples
comment: Partnerships in which both people are queer.
comment: Relaciones en las que ambas personas son queer.
broader: LGBTQ+ couples
change note: Version 4.2.0
has top concept: Relationship satisfaction
in scheme: v3
preferred label: Parejas queer

Queer daughters
type: Concept
issued: 2019-05-14
modified: 2025-02-23
replaces: queerDaughters
comment: Daughters who identify as queer.
comment: Hijas que se identifican como queer.
broader: LGBTQ+ daughters
change note: Version 4.2.0
has top concept: LGBTQ+ people
in scheme: v3
preferred label: Hijas queer

Jewish queer people
type: Concept
issued: 2019-05-14
modified: 2025-02-23
replaces: queerJews
comment: Queer people who are Jewish.
comment: Personas queer que son judías.
alternative label: Jewish queers
alternative label: Queer Jews
alternative label: Judíos queer
broader: Jewish LGBTQ+ people
change note: Version 4.2.0
has top concept: LGBTQ+ people
in scheme: v3
preferred label: Personas queer judías

Latino/a/x queer people
type: Concept
issued: 2019-05-14
modified: 2025-02-23
replaces: queerLatinx
comment: Latin American people who are queer; only use to describe individuals who self-identify as Latino, Latina, or Latinx. Do not conflate with Chicano/a/x or Hispanic.
comment: Personas latinoamericanas que son queer; utilícese únicamente para describir a personas que se autoidentifican como latinos, latinas o latinxs. No debe confundirse con chicano/a/x o hispano/a/x.
alternative label: Latina queer people
alternative label: Latine queer people
alternative label: Latino queer people
alternative label: Latinx queer people
alternative label: Queer Latinas
alternative label: Queer Latine people
alternative label: Queer Latinos
alternative label: Queer Latinx people
broader: Latino/a/x LGBTQ+ people
change note: Version 4.2.0
has top concept: LGBTQ+ people
in scheme: v3
preferred label: Personas queer Latinx

Queer libraries
type: Concept
issued: 2019-05-14
modified: 2025-02-23
replaces: queerLibraries
comment: Libraries that hold materials primarily pertaining to queer people or intended for use by queer people.
comment: Bibliotecas que contienen materiales principalmente relacionados con personas queer o destinados a ser utilizados por personas queer.
broader: LGBTQ+ libraries
change note: Version 4.2.0
has top concept: LGBTQ+ cultural heritage institutions
in scheme: v3
preferred label: Bibliotecas queer

Queer dominants
type: Concept
issued: 2019-05-14
modified: 2025-02-23
replaces: queerMasters
comment: Queer people who are part of the BDSM scene and assume the dominant role in sexual relationships with a dominant/submissive dynamic.
comment: Personas queer que forman parte de la escena BDSM y asumen el rol dominante en las relaciones sexuales con una dinámica dominante/sumisa.
alternative label: Queer masters
alternative label: Amos queer
broader: LGBTQ+ dominants
change note: Version 4.2.0
has top concept: Sexual identity
in scheme: v3
preferred label: Dominantes queer

Queer museums
type: Concept
issued: 2019-05-14
modified: 2025-02-23
replaces: queerMuseums
comment: Institutions dedicated to the storage, exhibition, conservation, and preservation of materials relating to queerness, queer people, or queer history.
comment: Instituciones dedicadas al almacenamiento, la exhibición, la conservación y la preservación de materiales relacionados con lo queer, las personas queer o la historia queer.
broader: LGBTQ+ museums
change note: Version 4.2.0
has top concept: LGBTQ+ cultural heritage institutions
in scheme: v3
preferred label: Museos queer

Queer Muslims
type: Concept
issued: 2019-05-14
modified: 2025-02-23
replaces: queerMuslims
comment: Queer people who are Muslim.
comment: Personas queer que son musulmanas.
broader: LGBTQ+ Muslims
change note: Version 4.2.0
has top concept: LGBTQ+ African religions
in scheme: v3
preferred label: Musulmanes queer

Native American queer people
type: Concept
issued: 2019-05-14
modified: 2025-02-23
replaces: queerNativeAmericans
comment: People who are part of the Native peoples of the continental United States and Canada (excluding Inuit people) and self-identity as queer. Use more specific terms when available.
comment: Personas queer que son nativoamericanas o parte de los pueblos indígenas de Norteamérica; utilícese únicamente para personas que se autoidentifiquen como nativoamericanas y queer.
alternative label: American Indian queer people
alternative label: Queer American Indians
alternative label: Queer Native Americans
alternative label: Personas nativoamericanas queer
broader: Native American LGBTQ+ people
change note: Version 4.2.0
has top concept: LGBTQ+ people
in scheme: v3
preferred label: Personas queer nativoamericanas

Queer newsletters
type: Concept
issued: 2019-05-14
modified: 2025-02-23
replaces: queerNewsletters
comment: Serialized print or digital periodicals created by or for queer people, often with the purpose of sharing news and information related to queer communities and queer issues.
comment: Publicaciones periódicas impresas o digitales serializadas creadas por o para personas queer, a menudo con el propósito de compartir noticias e información relacionadas con comunidades y temas queer.
broader: LGBTQ+ newsletters
change note: Version 4.2.0
has top concept: LGBTQ+ press
in scheme: v3
preferred label: Boletines queer

Queer newspapers
type: Concept
issued: 2019-05-14
modified: 2025-02-23
replaces: queerNewspapers
comment: Serialized print or digital publications about queer people or queer issues (and typically produced by queer people or queer organizations) that contain news, articles, columns, correspondence, and advertisements.
comment: Publicaciones impresas o digitales serializadas sobre personas queer o temas queer (y generalmente producidas por personas queer u organizaciones queer) que contienen noticias, artículos, columnas, correspondencia y anuncios.
alternative label: Diarios queer
broader: LGBTQ+ newspapers
change note: Version 4.2.0
has top concept: LGBTQ+ press
in scheme: v3
preferred label: Periódicos queer

Queer people in the military
type: Concept
issued: 2019-05-14
modified: 2025-02-23
replaces: queerPeopleInTheMilitary
comment: Queer people serving in state and national armed forces.
comment: Personas queer que sirven en las fuerzas armadas estatales y nacionales.
alternative label: Personas queer en las fuerzas armadas
broader: LGBTQ+ people in the military
change note: Version 4.2.0
has top concept: Legal status
in scheme: v3
preferred label: Personas queer en el ejército

Queer sex workers
type: Concept
issued: 2019-05-14
modified: 2025-02-23
replaces: queerProstitutes
comment: Queer people who receive money or goods in exchange for sexual services, performances, or companionship. Use to describe queer people working across the broad spectrum of sex work.
comment: Personas queer que reciben dinero o bienes a cambio de servicios o actuaciones sexuales. Se utiliza para describir a las personas queer que trabajan en el amplio espectro del trabajo sexual.
alternative label: Queer prostitutes
alternative label: Queer prostitution
alternative label: Queer sex work
alternative label: Prostitutxs queer
alternative label: Prostitutos queer
alternative label: Prostitutas queer
alternative label: Trabajo sexual queer
broader: LGBTQ+ sex workers
change note: Version 4.2.0
has top concept: Sex workers
in scheme: v3
preferred label: Trabajadores sexuales queer

Queer Protestants
type: Concept
issued: 2019-05-14
modified: 2025-02-23
replaces: queerProtestants
comment: Queer people who are members of the Protestant Church.
comment: Personas queer que son miembros de la Iglesia protestante.
broader: LGBTQ+ Protestants
change note: Version 4.2.0
has top concept: LGBTQ+ African religions
in scheme: v3
preferred label: Protestantes queer

Queer publishers
type: Concept
issued: 2019-05-14
modified: 2025-02-23
replaces: queerPublishers
comment: Companies and organizations that publish materials for queer communities or addressing queer issues.
comment: Empresas y organizaciones que publican materiales para comunidades queer o que abordan asuntos queer.
broader: LGBTQ+ publishers
change note: Version 4.2.0
has top concept: LGBTQ+ publishers
in scheme: v3
preferred label: Editoriales queer

Queer rights
type: Concept
issued: 2019-05-14
modified: 2025-02-23
replaces: queerRights
comment: Legal, social, or ethical principles of freedom or entitlement held by queer people.
comment: Principios legales, sociales o éticos de libertad o derechos que tienen las personas queer.
broader: LGBTQ+ civil rights
change note: Version 4.2.0
has top concept: Human rights
in scheme: v3
preferred label: Derechos queer

Queer Roman Catholics
type: Concept
issued: 2019-05-14
modified: 2025-02-23
replaces: queerRomanCatholics
comment: Queer people who are members of the Roman Catholic Church.
comment: Personas queer que son miembros de la Iglesia católica romana.
alternative label: Católicos romanos queer
broader: LGBTQ+ Roman Catholics
change note: Version 4.2.0
has top concept: LGBTQ+ African religions
in scheme: v3
preferred label: Personas católico romanas queer

Queer sons
type: Concept
issued: 2019-05-14
modified: 2025-02-23
replaces: queerSons
comment: Sons who identify as queer.
comment: Hijos que se identifican como queer.
broader: LGBTQ+ sons
change note: Version 4.2.0
has top concept: LGBTQ+ people
in scheme: v3
preferred label: Hijos queer

Queer television
type: Concept
issued: 2019-05-14
modified: 2025-02-23
replaces: queerTelevision
comment: Television shows featuring queer people or queer themes.
comment: Programas de televisión que presentan a personas queer o temas queer.
broader: LGBTQ+ television
change note: Version 4.2.0
has top concept: LGBTQ+ television
in scheme: v3
preferred label: Televisión queer

Queer theater
type: Concept
issued: 2019-05-14
modified: 2025-02-23
replaces: queerTheatre
comment: Works in the performance arts that focus on queer characters, communities, or issues.
comment: Obras en las artes escénicas que se centran en personajes, comunidades o cuestiones queer.
alternative label: Drama queer
broader: LGBTQ+ theater
change note: Version 4.2.0
has top concept: LGBTQ+ theater
in scheme: v3
preferred label: Teatro queer
preferred label: Queer theatre

Queer transgender people
type: Concept
issued: 2019-05-14
modified: 2025-02-23
replaces: queerTransgenderPeople
comment: Queer people who identify as transgender.
comment: Personas queer que se identifican como transgénero.
broader: Queer people
change note: Version 4.2.0
has top concept: LGBTQ+ people
in scheme: v3
preferred label: Personas transgénero queer

Queer victims' rights
type: Concept
issued: 2019-05-14
modified: 2025-02-23
replaces: queerVictimsRights
comment: Queer people’s legal rights to be informed, present, and heard within the criminal justice system after having been harmed or injured as the result of a crime, accident, or other event.
comment: Los derechos legales de las personas queer a estar informadas, estar presentes y ser escuchadas dentro del sistema de justicia penal después de haber sido perjudicadas o lesionadas como resultado de un delito, accidente u otro evento.
broader: LGBTQ+ victims' rights
change note: Version 4.2.0
has top concept: Law
in scheme: v3
preferred label: Derechos de víctimas queer

White queer people
type: Concept
issued: 2019-05-14
modified: 2025-02-23
replaces: queerWhitePeople
comment: Queer people who are white.
comment: Personas queer que son blancas.
alternative label: Caucasian queer people
alternative label: Queer Caucasian people
alternative label: Queer white people
alternative label: Personas caucásicas queer
alternative label: Personas queer caucásicas
alternative label: Personas blancas queer
broader: White LGBTQ+ people
change note: Version 4.2.0
has top concept: White LGBTQ+ people
in scheme: v3
preferred label: Personas queer blancas

Rainbow flags
type: Concept
issued: 2019-05-14
modified: 2025-02-23
replaces: rainbowFlags
comment: Rainbow-striped flags that symbolize LGBTQ+ pride and LGBTQ+ social movements. The first rainbow pride flag, which had eight colors, was created by Gilbert Baker, Lynn Segerblom, and others in San Francisco, California in 1978. Due to difficulties obtaining hot pink fabric and a desire for an even number of stripes, Baker modified his design in 1979 to contain six colors. The six-color version of the flag has been the most popular design since then.
comment: Banderas con franjas arcoíris que simbolizan el orgullo LGBTQ+ y los movimientos sociales LGBTQ+. La primera bandera arcoíris de orgullo fue creada por Gilbert Baker en 1978.
alternative label: Baker flags
broader: LGBTQ+ pride flags
change note: Version 4.2.0
has top concept: LGBTQ+ symbols
in scheme: v3
preferred label: Banderas arcoíris

Reciprocal in vitro fertilization
type: Concept
issued: 2019-05-14
modified: 2025-02-23
replaces: reciprocalInVitroFertilisation
comment: A medical procedure in which the egg of one partner is fertilized with donor sperm and then transferred to the uterus of the other partner to bring to term.
comment: Un procedimiento médico en el que el óvulo de una pareja se fertiliza con esperma de un donante y luego se transfiere al útero de la otra pareja para llevarlo a término.
alternative label: Shared motherhood
alternative label: Maternidad compartida
broader: In vitro fertilization
change note: Version 4.2.0
has top concept: LGBTQ+ family planning
in scheme: v3
preferred label: Fertilización in vitro recíproca
preferred label: Reciprocal in vitro fertilisation

Rope play
type: Concept
issued: 2019-05-14
modified: 2025-02-23
replaces: ropePlay
comment: Bondage involving the use of rope for sexual stimulation.
comment: Bondage que implica el uso de cuerdas para la estimulación sexual.
alternative label: Shibari
broader: Sex accessories
change note: Version 4.2.0
has top concept: Sex accessories
in scheme: v3
preferred label: Juego de cuerda

Romantic friendships
type: Concept
issued: 2019-05-14
modified: 2025-02-23
replaces: romanticFriendships
comment: Very close but non-sexual relationships between friends, often involving a degree of physical closeness beyond that which is common in modern Western societies; this may include, for example, friends holding hands, cuddling, kissing, and/or sharing a bed.
comment: Relaciones muy estrechas pero no sexuales entre amigos, que a menudo implican un grado de cercanía física más allá de lo que es común en las sociedades occidentales modernas; esto puede incluir, por ejemplo, amigos tomados de la mano, abrazándose, besándose y/o compartiendo cama.
broader: Friendships
change note: Version 4.2.0
has top concept: Relationship satisfaction
in scheme: v3
preferred label: Amistades románticas

Same-sex divorce
type: Concept
issued: 2019-05-14
modified: 2025-02-23
replaces: sameSexDivorce
comment: A legal proceeding undertaken to dissolve a marriage between two individuals of the same sex.
comment: Procedimiento legal emprendido para disolver un matrimonio entre dos personas del mismo sexo.
broader: LGBTQ+ divorce
change note: Version 4.2.0
has top concept: Living arrangements
in scheme: v3
preferred label: Divorcio entre personas del mismo sexo

Saris
type: Concept
issued: 2019-05-14
modified: 2025-03-13
replaces: saris
comment: In Jewish culture, this term is used to refer to individuals who were assigned male at birth but later developed feminine characteristics.
comment: En la cultura judía, este término se utiliza para referirse a personas a quienes se les asignó al sexo masculino al nacer pero que luego desarrollaron características femeninas.
change note: Version 4.2.0
in scheme: v3

Sekhet
type: Concept
issued: 2019-05-14
modified: 2025-02-23
replaces: sekhet
comment: Egyptian term that refers to a range of people of non-normative gender and sexual identities, including gay people, eunuchs, trans people, etc. Only use to describe people who self-identify as sekhet.
comment: Término egipcio que se refiere a una variedad de personas con identidades sexuales y de género no normativas, incluidos hombres gay, eunucos, personas trans, etc. Utilícese únicamente para describir a personas que se autoidentifiquen como sekhet.
alternative label: Sht
broader: Non-Euro-American gender and sexual identities
change note: Version 4.2.0
has top concept: Gender
in scheme: v3

Sekrata
type: Concept
issued: 2019-05-14
modified: 2025-02-23
replaces: sekrata
comment: In Madagascar, this term refers to people of a third gender who were assigned male at birth and present feminine characteristics.
comment: En Madagascar, este término se refiere a las personas de un tercer género a las que se les asignó al sexo masculino al nacer y presentan características femeninas.
broader: Non-Euro-American gender and sexual identities
change note: Version 4.2.0
has top concept: Gender
in scheme: v3

Shiv-Shakthis
type: Concept
issued: 2019-05-14
modified: 2025-02-23
replaces: shivShakthis
comment: Term used in the Andhra Pradesh region of India to describe transgender people who are considered to be married to the gods (particularly Shiva). They often serve as astrologers and spiritual healers and their community is guarded by gurus who induct disciples and train them.
comment: Término utilizado en la región de Andhra Pradesh en India para describir a las personas transgénero que se consideran estar casadas con los dioses (particularmente Shiva). A menudo sirven como astrólogos y sanadores espirituales y su comunidad está custodiada por gurús que inician a sus discípulos y los entrenan.
broader: Non-Euro-American gender and sexual identities
change note: Version 4.2.0
has top concept: Gender
in scheme: v3

Skoptsy
type: Concept
issued: 2019-05-14
modified: 2025-02-23
replaces: skoptsy
comment: A sect within the larger Spiritual Christianity movement in the Russian Empire that emerged in the 18th century. This sect is most commonly known for conducting castrations and mastectomies in order to suppress sexual desire.
comment: Una secta dentro del movimiento más amplio del cristianismo espiritual en el Imperio ruso que surgió en el siglo XVIII. Esta secta es más conocida por realizar castraciones y mastectomías para suprimir el deseo sexual.
alternative label: Eunucos
alternative label: Castrados
alternative label: Blancas Palomas
broader: Non-Euro-American gender and sexual identities
change note: Version 4.2.0
has top concept: Gender
in scheme: v3

Spreader bars
type: Concept
issued: 2019-05-14
modified: 2025-03-20
replaces: spreaderBars
comment: Bondage devices consisting of wooden or metal bars with cuffs at either end that are used to keep an individual's arms or legs apart.
comment: Equipo de bondage que consiste en barras de madera o metal con esposas en cada extremo que se utilizan para mantener separados los brazos o las piernas de la persona, generalmente durante actividades sexuales o para estimulación sexual.
alternative label: Barra de expansión
alternative label: Spreader bar
change note: Version 4.2.0
in scheme: v3
preferred label: Barra separadora

Stature
type: Concept
issued: 2019-05-14
modified: 2025-02-23
replaces: stature
comment: A person’s natural height in an upright position.
comment: La altura natural de una persona en posición erguida.
broader: Secondary sex characteristics
change note: Version 4.2.0
has top concept: Sex (Body)
in scheme: v3
preferred label: Estatura

Suffragettes
type: Concept
issued: 2019-05-14
modified: 2025-02-23
replaces: suffragettes
comment: Women who seek the right to vote, often through organized protest; typically used to describe members of political movements in the late 1800s and early 1900s focusing on women’s right to vote in the U.S. and Britain.
comment: Mujeres que buscan el derecho al voto, a menudo mediante protestas organizadas; normalmente se utiliza para describir a miembros de movimientos políticos de finales del siglo XIX y principios del XX que se centraban en el derecho de las mujeres al voto en Estados Unidos y Gran Bretaña.
broader: Feminists
change note: Version 4.2.0
has top concept: Feminists
in scheme: v3
preferred label: Sufragistas

Swyer syndrome
type: Concept
issued: 2019-05-14
modified: 2025-02-23
replaces: swyerSyndrome
comment: Swyer syndrome occurs when a person is born with XY chromosomes, but their gonads have not developed into testes. It is a form of gonadal dysgenesis, meaning that a person with this variation will have streak gonads that do not produce hormones. Since they do not produce testosterone, their body does not develop a penis and usually develops a vulva and vagina instead. Since they do not produce another hormone known as anti-Müllerian hormone (AMH), people with Swyer syndrome often develop a uterus and fallopian tubes as well. They will not usually start puberty or begin menstruating, but some people with Swyer syndrome do menstruate (without ovulating) if they receive estrogen therapy.
comment: El síndrome de Swyer ocurre cuando una persona nace con cromosomas XY, pero sus gónadas no se han convertido en testículos. Es una forma de disgenesia gonadal, lo que significa que una persona con esta variación tendrá gónadas en franjas que no producen hormonas. Como no producen testosterona, su cuerpo no desarrolla un pene y, por lo general, desarrolla una vulva y una vagina. Dado que no producen otra hormona conocida como hormona antimülleriana (AMH, por sus siglas en inglés), las personas con síndrome de Swyer a menudo también desarrollan útero y trompas de Falopio. Por lo general, no comienzan la pubertad ni comienzan a menstruar, pero algunas personas con síndrome de Swyer menstrúan (sin ovular) si reciben terapia con estrógenos.
alternative label: XY Gonadal dysgenesis
alternative label: Disgenesia gonadal 46XY pura
broader: Intersex variations
change note: Version 4.2.0
has top concept: Sex (Body)
in scheme: v3
preferred label: Síndrome de Swyer

Thirunambi
type: Concept
issued: 2019-05-14
modified: 2025-02-23
replaces: thirunambi
comment: Regional term in Tamil Nadu, India for people assigned female at birth who identify as men.
comment: Término regional en Tamil Nadu, la India, para las personas asignadas al sexo femenino al nacer y que se autoidentifican como hombres.
broader: Non-Euro-American gender and sexual identities
change note: Version 4.2.0
has top concept: Gender
in scheme: v3

Tongzhi
type: Concept
issued: 2019-05-14
modified: 2025-02-23
replaces: tongzhi
comment: Contemporary term for LGBTQ+ people in China and Taiwan.
comment: Término contemporáneo para las personas LGBTQ+ en China y Taiwán.
alternative label: Tongzhis
broader: Sexual minorities
change note: Version 4.2.0
has top concept: Sexual minorities
in scheme: v3

Transgender artists
type: Concept
issued: 2019-05-14
modified: 2025-02-23
replaces: transgenderArtists
comment: Trans people who practice any of various creative arts.
comment: Artistas conocidos por ser transgénero.
broader: LGBTQ+ artists
change note: Version 4.2.0
has top concept: LGBTQ+ people
in scheme: v3
preferred label: Artistas transgénero

Transgender atheists
type: Concept
issued: 2019-05-14
modified: 2025-02-23
replaces: transgenderAtheists
comment: Transgender people who are atheists.
comment: Personas transgénero que son ateas.
broader: LGBTQ+ atheists
change note: Version 4.2.0
has top concept: LGBTQ+ people
in scheme: v3
preferred label: Ateos transgénero

Transgender bars
type: Concept
issued: 2019-05-14
modified: 2025-02-23
replaces: transgenderBars
comment: Drinking establishments that primarily cater to transgender people.
comment: Establecimientos de bebidas que atienden principalmente a personas transgénero.
broader: LGBTQ+ bars
change note: Version 4.2.0
has top concept: LGBTQ+ meeting places
in scheme: v3
preferred label: Bares transgénero

Transgender beaches
type: Concept
issued: 2019-05-14
modified: 2025-02-23
replaces: transgenderBeaches
comment: Beaches set aside for use by transgender people or beaches known to be frequented by transgender people.
comment: Playas reservadas para uso por personas transgénero o playas conocidas por ser frecuentadas por personas transgénero.
broader: LGBTQ+ beaches
change note: Version 4.2.0
has top concept: LGBTQ+ meeting places
in scheme: v3
preferred label: Playas transgénero

Transgender bookshops
type: Concept
issued: 2019-05-14
modified: 2025-02-23
replaces: transgenderBookshops
comment: Bookshops that sell materials intended for use by transgender people or addressing topics related to transgender experiences.
comment: Librerías que venden materiales destinados a personas transgénero o que abordan temas relacionados con experiencias transgénero.
broader: LGBTQ+ bookshops
change note: Version 4.2.0
has top concept: LGBTQ+ bookshops
in scheme: v3
preferred label: Librerías transgénero

Transgender Buddhists
type: Concept
issued: 2019-05-14
modified: 2025-02-23
replaces: transgenderBuddhists
comment: Transgender people who are Buddhist.
comment: Personas transgénero que son budistas.
broader: LGBTQ+ Buddhists
change note: Version 4.2.0
has top concept: LGBTQ+ African religions
in scheme: v3
preferred label: Budistas transgénero

Transgender Christians
type: Concept
issued: 2019-05-14
modified: 2025-02-23
replaces: transgenderChristians
comment: Transgender people who are Christian.
comment: Personas transgénero que son cristianas.
broader: LGBTQ+ Christians
change note: Version 4.2.0
has top concept: LGBTQ+ African religions
in scheme: v3
preferred label: Cristianos transgénero

Transgender couples
type: Concept
issued: 2019-05-14
modified: 2025-02-23
replaces: transgenderCouples
comment: Partnerships in which both people are transgender.
comment: Relaciones en las que ambas personas son transgénero.
broader: LGBTQ+ couples
change note: Version 4.2.0
has top concept: Relationship satisfaction
in scheme: v3
preferred label: Parejas transgénero

Transgender Day of Remembrance
type: Concept
issued: 2019-05-14
modified: 2025-02-23
replaces: transgenderDayOfRemembrance
comment: International day of observance recognized annually on November 20 to honor the memory and lives of trans people who were murdered in the previous 12 months and to draw attention to the continued violence against trans people. Transgender Day of Remembrance (abbreviated TDoR) was founded in 1999 by a small group of trans people, including Gwendolyn Ann Smith, to memorialize Rita Hester, a trans woman murdered in Allston, Massachusetts.
comment: Día internacional de conmemoración reconocido anualmente el 20 de noviembre para honrar la memoria y las vidas de las personas trans que fueron asesinadas en los 12 meses anteriores y para concientizar sobre la continua violencia contra las personas trans. El Día de la Memoria Transgénero (TDoR, por sus siglas en inglés) fue fundado en 1999 por un pequeño grupo de personas trans, incluida Gwendolyn Ann Smith, para conmemorar a Rita Hester, una mujer trans asesinada en Allston, Massachusetts.
alternative label: TDOR
alternative label: TDoR
alternative label: Trans Day of Remembrance
alternative label: Transgender Day of Rememberance
alternative label: Día Internacional de la Remembranza Trans
alternative label: Día Internacional de la Memoria Trans
broader: LGBTQ+ memorials
change note: Version 4.2.0
has top concept: LGBTQ+ memorials
in scheme: v3
preferred label: Día Internacional de la Memoria Transgénero

Jewish transgender people
type: Concept
issued: 2019-05-14
modified: 2025-02-23
replaces: transgenderJews
comment: Transgender people who are Jewish.
comment: Personas transgénero que son judíos.
alternative label: Transgender Jews
alternative label: Judíos transgénero
broader: Jewish LGBTQ+ people
change note: Version 4.2.0
has top concept: LGBTQ+ people
in scheme: v3
preferred label: Personas transgénero judías

Latino/a/x transgender people
type: Concept
issued: 2019-05-14
modified: 2025-02-23
replaces: transgenderLatinx
comment: Latin American people who are transgender; only use to describe individuals who self-identify as Latino, Latina, or Latinx. Do not conflate with Chicano/a/x or Hispanic.
comment: Personas latinoamericanas que son transgénero; utilícese únicamente para describir a personas que se autoidentifican como latinos, latinas o latinxs. No debe confundirse con chicano/a/x o hispano/a/x.
alternative label: Latina transgender people
alternative label: Latine transgender people
alternative label: Latino transgender people
alternative label: Latinx transgender people
alternative label: Transgender Latinas
alternative label: Transgender Latine people
alternative label: Transgender Latinos
alternative label: Transgender Latinx people
broader: Latino/a/x LGBTQ+ people
change note: Version 4.2.0
has top concept: LGBTQ+ people
in scheme: v3
preferred label: Personas transgénero Latinx

Transgender dominants
type: Concept
issued: 2019-05-14
modified: 2025-02-23
replaces: transgenderMasters
comment: Transgender people who are part of the BDSM scene and assume the dominant role in sexual relationships with a dominant/submissive dynamic.
comment: Personas transgénero que forman parte de la escena BDSM y asumen el rol dominante en las relaciones sexuales con una dinámica dominante/sumisa.
alternative label: Transgender masters
alternative label: Amos transgénero
broader: LGBTQ+ dominants
change note: Version 4.2.0
has top concept: Sexual identity
in scheme: v3
preferred label: Dominantes transgénero

Transgender Muslims
type: Concept
issued: 2019-05-14
modified: 2025-02-23
replaces: transgenderMuslims
comment: Transgender people who are Muslim.
comment: Personas transgénero que son musulmanas.
broader: LGBTQ+ Muslims
change note: Version 4.2.0
has top concept: LGBTQ+ African religions
in scheme: v3
preferred label: Musulmanes transgénero

Native American transgender people
type: Concept
issued: 2019-05-14
modified: 2025-02-23
replaces: transgenderNativeAmericans
comment: People who are part of the Native peoples of the continental United States and Canada (excluding Inuit people) and self-identity as transgender. Use more specific terms when available.
comment: Personas transgénero que son nativoamericanas o parte de los pueblos indígenas de Norteamérica; utilícese únicamente para personas que se autoidentifiquen como nativoamericanas y transgénero.
alternative label: American Indian transgender people
alternative label: Transgender American Indians
alternative label: Transgender Native Americans
alternative label: Personas nativoamericanas transgénero
broader: Native American LGBTQ+ people
change note: Version 4.2.0
has top concept: LGBTQ+ people
in scheme: v3
preferred label: Personas transgénero nativoamericanas

Transgender people of color
type: Concept
issued: 2019-05-14
modified: 2025-02-23
replaces: transgenderPeopleOfColour
comment: Primarily used in the United States, this term refers to transgender people who are not white and who identify as people of color.
comment: Personas transgénero que no son blancas y que se autoidentifican como personas de color.
alternative label: Trans people of color
broader: LGBTQ+ people of color
change note: Version 4.2.0
has top concept: LGBTQ+ people
in scheme: v3
preferred label: Personas transgénero de color
preferred label: Transgender people of colour

Transgender sex workers
type: Concept
issued: 2019-05-14
modified: 2025-02-23
replaces: transgenderProstitutes
comment: Transgender people who receive money or goods in exchange for sexual services, performances, or companionship. Use to describe transgender people working across the broad spectrum of sex work.
comment: Personas transgénero que reciben dinero o bienes a cambio de servicios o actuaciones sexuales. Se utiliza para describir a las personas transgénero que trabajan en el amplio espectro del trabajo sexual.
alternative label: Trans sex workers
alternative label: Transgender prostitutes
alternative label: Trans prostitutes
alternative label: Transgender prostitution
alternative label: Transgender sex work
alternative label: Trans sex work
broader: LGBTQ+ sex workers
change note: Version 4.2.0
has top concept: Sex workers
in scheme: v3
preferred label: Trabajadores sexuales transgénero

Transgender Protestants
type: Concept
issued: 2019-05-14
modified: 2025-02-23
replaces: transgenderProtestants
comment: Transgender people who are members of the Protestant Church.
comment: Personas transgénero que son miembros de la Iglesia protestante.
broader: LGBTQ+ Protestants
change note: Version 4.2.0
has top concept: LGBTQ+ African religions
in scheme: v3
preferred label: Protestantes transgénero

Transgender publishers
type: Concept
issued: 2019-05-14
modified: 2025-02-23
replaces: transgenderPublishers
comment: Companies and organizations that publish materials for transgender communities or addressing transgender issues.
comment: Empresas y organizaciones que publican materiales para comunidades transgénero o que abordan asuntos transgénero.
preferred label: Editoriales transgénero
broader: LGBTQ+ publishers
change note: Version 4.2.0
has top concept: LGBTQ+ publishers
in scheme: v3

Transgender rights
type: Concept
issued: 2019-05-14
modified: 2025-02-23
replaces: transgenderRights
comment: Legal, social, or ethical principles of freedom or entitlement held by transgender people.
comment: Principios legales, sociales o éticos de libertad o derechos que tienen las personas transgénero.
broader: LGBTQ+ civil rights
change note: Version 4.2.0
has top concept: Human rights
in scheme: v3
preferred label: Derechos de personas transgénero

Transgender Roman Catholics
type: Concept
issued: 2019-05-14
modified: 2025-02-23
replaces: transgenderRomanCatholics
comment: Transgender people who are members of the Roman Catholic Church.
comment: Personas transgénero que son miembros de la Iglesia católica romana.
alternative label: Católico romanos transgénero
broader: LGBTQ+ Roman Catholics
change note: Version 4.2.0
has top concept: LGBTQ+ African religions
in scheme: v3
preferred label: Personas católico romanas transgénero

Transgender theater
type: Concept
issued: 2019-05-14
modified: 2025-02-23
replaces: transgenderTheatre
comment: Works in the performance arts that focus on transgender characters or themes.
comment: Trabajos en las artes escénicas que se centran en personajes o temas transgénero.
broader: LGBTQ+ theater
change note: Version 4.2.0
has top concept: LGBTQ+ theater
in scheme: v3
preferred label: Teatro transgénero
preferred label: Transgender theatre

Transgender victims' rights
type: Concept
issued: 2019-05-14
modified: 2025-02-23
replaces: transgenderVictimsRights
comment: Transgender people’s legal rights to be informed, present, and heard within the criminal justice system after having been harmed or injured as the result of of a crime, accident, or other event.
comment: Los derechos legales de las personas transgénero a estar informadas, estar presentes y ser escuchadas dentro del sistema de justicia penal después de haber sido perjudicadas o lesionadas como resultado de un delito, accidente u otro evento.
broader: LGBTQ+ victims' rights
change note: Version 4.2.0
has top concept: Law
in scheme: v3
preferred label: Derechos de víctimas transgénero

White transgender people
type: Concept
issued: 2019-05-14
modified: 2025-02-23
replaces: transgenderWhitePeople
comment: Transgender people who are white.
comment: Personas transgénero que son blancas.
alternative label: Caucasian transgender people
alternative label: Transgender Caucasian people
alternative label: Transgender white people
alternative label: Personas trasngénero caucásicas
alternative label: Personas caucásicas transgénero
alternative label: Personas blancas transgénero
broader: White LGBTQ+ people
change note: Version 4.2.0
has top concept: White LGBTQ+ people
in scheme: v3
preferred label: Personas transgénero blancas

Travestis
type: Concept
issued: 2019-05-14
modified: 2025-02-23
replaces: travesti
comment: Spanish term for people assigned male at birth who have a feminine gender identity; commonly used in South America.
comment: Término para personas asignadas al sexo masculino al nacer que tienen una identidad de género femenina; comúnmente utilizado en Sudamérica.
alternative label: Travesti
broader: Non-Euro-American gender and sexual identities
change note: Version 4.2.0
has top concept: Gender
in scheme: v3

Tritiya-Prakriti
type: Concept
issued: 2019-05-14
modified: 2025-02-23
replaces: tritiyaPrakriti
comment: Ancient Hindu term for a third gender that is typically described as fluid and/or continuously transformative.
comment: Término hindú antiguo para un tercer género que normalmente se describe como fluido y/o continuamente en transformación.
broader: Non-Euro-American gender and sexual identities
change note: Version 4.2.0
has top concept: Gender
in scheme: v3

Tumtum
type: Concept
issued: 2019-05-14
modified: 2025-02-23
replaces: tumtum
comment: Term originating in Rabbinic Judaism to refer to someone with an unknown sex; literally translates to "hidden." Used historically to refer to intersex variations where the genitals were covered by skin. Only use for individuals who are Jewish and who self-identify as Tumtum.
comment: Término hebreo utilizado en referencia a un género desconocido; se traduce literalmente como "oculto".
broader: Non-Euro-American gender and sexual identities
change note: Version 4.2.0
has top concept: Gender
in scheme: v3

Turner syndrome
type: Concept
issued: 2019-05-14
modified: 2025-02-23
replaces: turnerSyndrome
comment: Turner syndrome is a variation in which a person is born with a 45X chromosome pattern (sometimes called 45XO) rather than the typical 46XX. People with Turner syndrome often share specific physical features such as short stature, a webbed neck and broad chest, and heart issues. They can also develop variations in their other sex characteristics, such as smaller-than-typical ovaries that may stop producing hormones at a younger age than typical, and they might not menstruate or experience pubertal changes.
comment: El síndrome de Turner es una variación en la que una persona nace con un patrón cromosómico 45X (a veces llamado 45XO) en lugar del típico 46XX. Las personas con síndrome de Turner a menudo comparten características físicas específicas, como baja estatura, cuello palmeado y pecho ancho, y problemas cardíacos. También pueden desarrollar variaciones en sus otras características sexuales, como ovarios más pequeños de lo típico que pueden dejar de producir hormonas a una edad más temprana de lo normal, y es posible que no menstrúen ni experimenten cambios puberales.
broader: Intersex variations
change note: Version 4.2.0
has top concept: Sex (Body)
in scheme: v3
preferred label: Síndrome de Turner

Unmarried couples
type: Concept
issued: 2019-05-14
modified: 2025-02-23
replaces: unmarriedCouples
comment: Romantic and/or sexual partnerships of two people who are unmarried.
comment: Parejas románticas y/o sexuales de dos personas que no están casadas.
broader: Marital status
change note: Version 4.2.0
has top concept: Living arrangements
in scheme: v3
preferred label: Parejas no casadas

Waria
type: Concept
issued: 2019-05-14
modified: 2025-02-23
replaces: waria
comment: Third gender people in Indonesia who are assigned male at birth but who express femininity and may identify as women.
comment: Personas del tercer género en Indonesia que fueron asignadas al sexo masculino al nacer pero que expresan feminidad y pueden identificarse como mujeres.
broader: Non-Euro-American gender and sexual identities
change note: Version 4.2.0
has top concept: Gender
in scheme: v3

Widowed people
type: Concept
issued: 2019-05-14
modified: 2025-02-23
replaces: widowedPeople
comment: People whose spouses or partners have died.
comment: Personas cuyos cónyuges o parejas hayan fallecido.
alternative label: Widowers
alternative label: Widows
alternative label: Viudas
alternative label: Viudos
broader: Marital status
change note: Version 4.2.0
has top concept: Living arrangements
in scheme: v3
preferred label: Personas enviudadas

Witches (Lesbians)
type: Concept
is replaced by: homoit0001908
issued: 2019-05-14
modified: 2022-08-22
replaces: witchesLesbian
change note: Version 4.2.0
in scheme: v3
related: Goddess movement
related: Lesbian Pagans

Women's community centers
type: Concept
issued: 2019-05-14
modified: 2025-02-23
replaces: womensCommunityCentres
comment: Spaces in which women meet for social, educational, recreational, and organizing activities.
comment: Espacios en los que las mujeres se reúnen para actividades sociales, educativas, recreativas y organizativas.
alternative label: Centros comunitarios de mujeres
broader: LGBTQ+ community centers
change note: Version 4.2.0
has top concept: LGBTQ+ centers
in scheme: v3
preferred label: Centros comunitarios para mujeres
preferred label: Women's community centres

Khaniths
type: Concept
issued: 2019-05-14
modified: 2025-02-23
replaces: xanith
comment: Arabic word used in Oman for people who assigned male at birth who adopt feminine mannerisms and/or roles.
comment: Palabra árabe utilizada en Omán para las personas asignadas al sexo masculino al nacer y que adoptan gestos y/o roles femeninos.
alternative label: Khanith
alternative label: Xanith
alternative label: Xaniths
broader: Non-Euro-American gender and sexual identities
change note: Version 4.2.0
has top concept: Gender
in scheme: v3

Yīnyángrén
type: Concept
issued: 2019-05-14
modified: 2025-02-23
replaces: yinyangRen
comment: Chinese word for individuals who are both female (yin) and male (yang).
comment: Palabra china para personas que son tanto femeninas (yin) como masculinas (yang).
alternative label: Jiānxìngrén
alternative label: Yin-yang ren
alternative label: Yinyang ren
alternative label: Yinyangren
broader: Non-Euro-American gender and sexual identities
change note: Version 4.2.0
has top concept: Gender
in scheme: v3

Zenanas
type: Concept
is replaced by: homoit0001523
issued: 2019-05-14
modified: 2025-02-23
modified: 2022-12-13
replaces: zenanas
replaces: zenani
comment: In northern India and Pakistan, this term is used to refer to effeminate people.
comment: En el norte de la India y Pakistán, este término se utiliza para referirse a las personas afeminadas.
comment: Urdu word for effeminate people.
broader: Non-Euro-American gender and sexual identities
change note: Version 4.2.0
has top concept: Gender
in scheme: v3
preferred label: Zenani

LGBTQ+ people with internet sex addictions
type: Concept
issued: 2020-06-03
modified: 2025-02-23
replaces: internetSexAddiction
comment: LGBTQ+ people experiencing addiction to or dependency upon sexual activities involving the internet, including watching pornography, engaging in sexual conversations online, etc. Only use to refer to individuals who describe themselves as having internet sex addictions, not individuals who sexual practices are perceived as promiscuous or excessive by others.
comment: Personas LGBTQ+ que experimentan una adicción o dependencia de actividades sexuales que involucran el internet, incluyendo ver pornografía, participar de conversaciones sexuales en línea, etc. Utilícese únicamente para referirse a personas que se describen a sí mismas como adictas al sexo por internet, no a personas cuyas prácticas sexuales se perciban como promiscuas o excesivo por otras personas.
alternative label: LGBTQ+ people with cybersex addictions
alternative label: LGBTQ+ people with internet sexual addictions
alternative label: LGBTQ+ people with porn addictions
alternative label: LGBTQ+ people with pornography addictions
broader: LGBTQ+ people with sexual addictions
change note: Version 4.2.0
has top concept: LGBTQ+ people
in scheme: v3
preferred label: Personas LGBTQ+ con adicciones al sexo por Internet

Lesbian fantasy fiction
type: Concept
issued: 2020-06-03
modified: 2025-02-23
replaces: lesbianFantasyFiction
comment: Written works that include magical or fantastical elements; use in reference to fantasy fiction focusing on lesbian characters or themes.
comment: Obras escritas que incluyan elementos mágicos o fantásticos; utilícese en referencia a la ficción fantástica centrada en personajes o temas lésbicos.
broader: LGBTQ+ fantasy fiction
change note: Version 4.2.0
has top concept: Subcultures
in scheme: v3
preferred label: Ficción fantástica lésbica

Gay fantasy fiction
type: Concept
issued: 2020-06-03
modified: 2025-02-23
replaces: gayFantasyFiction
comment: Written works that include magical or fantastical elements; use in reference to fantasy fiction focusing on gay characters or themes.
comment: Obras escritas que incluyen elementos mágicos o fantásticos; utilícese en referencia a la ficción fantástica que se centra en personajes o temas gay.
broader: LGBTQ+ fantasy fiction
change note: Version 4.2.0
has top concept: Subcultures
in scheme: v3
preferred label: Ficción fantástica gay

Bisexual fantasy fiction
type: Concept
issued: 2020-06-03
modified: 2025-02-23
replaces: bisexualFantasyFiction
comment: Written works that include magical or fantastical elements; use in reference to fantasy fiction focusing on bisexual characters or themes.
comment: Familias, ya sean biológicas, adoptivas o elegidas, en las que una o más personas se autoidentican como bisexuales.
broader: LGBTQ+ fantasy fiction
change note: Version 4.2.0
has top concept: Subcultures
in scheme: v3
preferred label: Familias bisexuales

Transgender fantasy fiction
type: Concept
issued: 2020-06-03
modified: 2025-02-23
replaces: transgenderFantasyFiction
comment: Written works that include magical or fantastical elements; use in reference to fantasy fiction focusing on transgender characters or themes.
comment: Obras escritas que incluyan elementos mágicos o fantásticos; utilícese en referencia a la ficción fantástica centrada en personajes o temas transgénero.
broader: LGBTQ+ fantasy fiction
change note: Version 4.2.0
has top concept: Subcultures
in scheme: v3
preferred label: Ficción fantástica transgénero

Queer fantasy fiction
type: Concept
issued: 2020-06-03
modified: 2025-02-23
replaces: queerFantasyFiction
comment: Written works that include magical or fantastical elements; use in reference to fantasy fiction focusing on queer characters or themes.
comment: Obras escritas que incluyan elementos mágicos o fantásticos; utilícese en referencia a la ficción fantástica que se centra en personajes o temas queer.
broader: LGBTQ+ fantasy fiction
change note: Version 4.2.0
has top concept: Subcultures
in scheme: v3
preferred label: Ficción fantástica queer

Lesbian science fiction
type: Concept
issued: 2020-06-03
modified: 2025-02-23
replaces: lesbianScienceFiction
comment: Written literary works about imaginative or futuristic concepts incorporating science, technology, space, time travel, and other speculative elements; use in reference to science fiction focusing on lesbian characters and themes.
comment: Obras literarias escritas sobre conceptos imaginativos o futuristas que incorporen la ciencia, la tecnología, el espacio, los viajes en el tiempo y otros elementos especulativos; utilícese en referencia a la ciencia ficción centrada en personajes y temas lésbicos.
broader: LGBTQ+ science fiction
change note: Version 4.2.0
has top concept: Subcultures
in scheme: v3
preferred label: Ciencia ficción lésbica

Gay science fiction
type: Concept
issued: 2020-06-03
modified: 2025-02-23
replaces: gayScienceFiction
comment: Written literary works about imaginative or futuristic concepts incorporating science, technology, space, time travel, and other speculative elements; use in reference to science fiction focusing on gay characters or themes.
comment: Obras literarias escritas sobre conceptos imaginativos o futuristas que incorporan la ciencia, la tecnología, el espacio, los viajes en el tiempo y otros elementos especulativos; utilícese en referencia a la ciencia ficción centrada en personajes o temas gay.
broader: LGBTQ+ science fiction
change note: Version 4.2.0
has top concept: Subcultures
in scheme: v3
preferred label: Ciencia ficción gay

Bisexual science fiction
type: Concept
issued: 2020-06-03
modified: 2025-02-23
replaces: bisexualScienceFiction
comment: Written literary work about imaginative or futuristic concepts incorporating science, technology, space, time travel, and other speculative elements; use in reference to science fiction focusing on bisexual characters or themes.
comment: Personas bisexuales que son miembros de la Iglesia católica romana.
alternative label: Católico romanos bisexuales
alternative label: Católico romanas bisexuales
broader: LGBTQ+ science fiction
change note: Version 4.2.0
has top concept: Subcultures
in scheme: v3
preferred label: Personas católico romanas bisexuales

Transgender science fiction
type: Concept
issued: 2020-06-03
modified: 2025-02-23
replaces: transgenderScienceFiction
comment: Written literary works about imaginative or futuristic concepts incorporating science, technology, space, time travel, and other speculative elements; use in reference to science fiction focusing on transgender characters and themes.
comment: Obras literarias escritas sobre conceptos imaginativos o futuristas que incorporen la ciencia, la tecnología, el espacio, los viajes en el tiempo y otros elementos especulativos; utilícese en referencia a la ciencia ficción centrada en personajes y temas transgénero.
broader: LGBTQ+ science fiction
change note: Version 4.2.0
has top concept: Subcultures
in scheme: v3
preferred label: Ciencia ficción transgénero

Queer science fiction
type: Concept
issued: 2020-06-03
modified: 2025-02-23
replaces: queerScienceFiction
comment: Written literary works about imaginative or futuristic concepts incorporating science, technology, space, time travel, and other speculative elements; use in reference to science fiction focusing on queer characters or themes.
comment: Obras literarias escritas sobre conceptos imaginativos o futuristas que incorporen la ciencia, la tecnología, el espacio, los viajes en el tiempo y otros elementos especulativos; utilícese en referencia a la ciencia ficción centrada en personajes o temas queer.
broader: LGBTQ+ science fiction
change note: Version 4.2.0
has top concept: Subcultures
in scheme: v3
preferred label: Ciencia ficción queer

Lesbian mystery and detective fiction
type: Concept
issued: 2020-06-03
modified: 2025-02-23
replaces: lesbianMysteryAndDectectiveFiction
comment: Written literary works about the investigation of crime or the work of detectives; use in reference to mystery and detective fiction focusing on lesbian characters and themes.
comment: Obras literarias escritas sobre la investigación de crímenes o el trabajo de detectives; utilícese en referencia a la ficción de misterio y de detectives centrada en personajes y temas lésbicos.
alternative label: Ficción de misterio y detectives lésbica
broader: LGBTQ+ mystery and detective fiction
change note: Version 4.2.0
has top concept: Subcultures
in scheme: v3
preferred label: Ficción lésbica de misterio y de detectives

Gay mystery and detective fiction
type: Concept
issued: 2020-06-03
modified: 2025-02-23
replaces: gayMysteryAndDetectiveFiction
comment: Written literary works about the investigation of crime or the work of detectives; use in reference to mystery and detective fiction focusing on gay characters or themes.
comment: Hombres gay que son musulmanes.
broader: LGBTQ+ mystery and detective fiction
change note: Version 4.2.0
has top concept: Subcultures
in scheme: v3
preferred label: Musulmanes gay

Bisexual mystery and detective fiction
type: Concept
issued: 2020-06-03
modified: 2025-02-23
replaces: bisexualMysteryAndDetectiveFiction
comment: Written literary works about the investigation of crime or the work of detectives; use in reference to mystery and detective fiction focusing on bisexual characters or themes.
comment: Musicales creados por directores bisexuales, que representan a personas bisexuales o que se consideran importantes dentro de la cultura bisexual.
broader: LGBTQ+ mystery and detective fiction
change note: Version 4.2.0
has top concept: Subcultures
in scheme: v3
preferred label: Musicales bisexuales

Transgender mystery and detective fiction
type: Concept
issued: 2020-06-03
modified: 2025-02-23
replaces: transgenderMysteryAndDetectiveFiction
comment: Written literary works about the investigation of crime or the work of detectives; use in reference to mystery and detective fiction focusing on transgender characters and themes.
comment: Obras literarias escritas sobre la investigación de crímenes o el trabajo de detectives; utilícese en referencia a la ficción de misterio y de detectives centrada en personajes y temas transgénero.
broader: LGBTQ+ mystery and detective fiction
change note: Version 4.2.0
has top concept: Subcultures
in scheme: v3
preferred label: Ficción transgénero de misterio y de detectives

Queer mystery and detective fiction
type: Concept
issued: 2020-06-03
modified: 2025-02-23
replaces: queerMysteryAndDetectiveFiction
comment: Written literary works about the investigation of crime or the work of detectives; use in reference to mystery and detective fiction focusing on queer characters and themes.
comment: Obras literarias escritas sobre la investigación de crímenes o el trabajo de detectives; utilícese en referencia a la ficción de misterio y de detectives centrada en personajes y temas queer.
broader: LGBTQ+ mystery and detective fiction
change note: Version 4.2.0
has top concept: Subcultures
in scheme: v3
preferred label: Ficción queer de misterio y de detectives

Lesbian horror fiction
type: Concept
issued: 2020-06-03
modified: 2025-02-23
replaces: lesbianHorrorFiction
comment: Written works of fiction intended to frighten, scare, or disgust; use in reference to horror fiction focusing on lesbian characters or themes.
comment: Obras de ficción escritas con la intención de asustar, atemorizar o provocar disgusto; utilícese en referencia a la ficción de horror centrada en personajes o temas lésbicos.
alternative label: Ficción lésbica de terror
broader: LGBTQ+ horror fiction
change note: Version 4.2.0
has top concept: Subcultures
in scheme: v3
preferred label: Ficción de horror lésbica

Gay horror fiction
type: Concept
issued: 2020-06-03
modified: 2025-02-23
replaces: gayHorrorFiction
comment: Written works of fiction intended to frighten, scare, or disgust; use in reference to horror fiction focusing on gay characters or themes.
comment: Obras de ficción escritas con la intención de asustar, atemorizar o provocar disgusto; utilícese en referencia a la ficción de horror centrada en personajes o temas gay.
broader: LGBTQ+ horror fiction
change note: Version 4.2.0
has top concept: Subcultures
in scheme: v3
preferred label: Ficción de horror gay

Bisexual horror fiction
type: Concept
issued: 2020-06-03
modified: 2025-02-23
replaces: bisexualHorrorFiction
comment: Written works of fiction intended to frighten, scare, or disgust; use in reference to horror fiction focusing on bisexual characters or themes.
comment: Eventos o relatos del pasado relacionados con personas bisexuales, o personas que podrían ser percibidas como bisexuales si estuvieran vivas hoy.
broader: LGBTQ+ horror fiction
change note: Version 4.2.0
has top concept: Subcultures
in scheme: v3
preferred label: Historia bisexual

Transgender horror fiction
type: Concept
issued: 2020-06-03
modified: 2025-02-23
replaces: transgenderHorrorFiction
comment: Written works of fiction intended to frighten, scare, or disgust; use in reference to horror fiction focusing on transgender characters or themes.
comment: Obras de ficción escritas con la intención de asustar, atemorizar o provocar disgusto; utilícese en referencia a la ficción de horror centrada en personajes o temas transgénero.
broader: LGBTQ+ horror fiction
change note: Version 4.2.0
has top concept: Subcultures
in scheme: v3
preferred label: Ficción de horror transgénero

Queer horror fiction
type: Concept
issued: 2020-06-03
modified: 2025-02-23
replaces: queerHorrorFiction
comment: Written works of fiction intended to frighten, scare, or disgust; use in reference to horror fiction focusing on queer characters or themes.
comment: Obras de ficción escritas con la intención de asustar, atemorizar o provocar disgusto; utilícese en referencia a la ficción de horror centrada en personajes o temas queer.
broader: LGBTQ+ horror fiction
change note: Version 4.2.0
has top concept: Subcultures
in scheme: v3
preferred label: Ficción de horror queer

Lesbian comics
type: Concept
issued: 2020-06-03
modified: 2025-02-23
replaces: lesbianComics
comment: Works consisting of sequential images often accompanied by text; use in reference to comics focusing on lesbian characters or themes.
comment: Obras que consisten en imágenes secuenciales, a menudo acompañadas de texto; utilícese en referencia a cómics que se centran en personajes o temas lésbicos.
broader: LGBTQ+ comics
change note: Version 4.2.0
has top concept: Subcultures
in scheme: v3
preferred label: Cómics lésbicos

Gay comics
type: Concept
issued: 2020-06-03
modified: 2025-02-23
replaces: gayComics
comment: Works consisting of sequential images often accompanied by text; use in reference to comics focusing on gay characters or themes.
comment: Obras que consisten en imágenes secuenciales, a menudo acompañadas de texto; utilicese en referencia a cómics que se centran en personajes o temas gay.
alternative label: Historietas gay
broader: LGBTQ+ comics
change note: Version 4.2.0
has top concept: Subcultures
in scheme: v3
preferred label: Cómics gay

Bisexual comics
type: Concept
issued: 2020-06-03
modified: 2025-02-23
replaces: bisexualComics
comment: Works consisting of sequential images often accompanied by text; use in reference to comics focusing on bisexual characters or themes.
comment: Obras que consisten en imágenes secuenciales, a menudo acompañadas de texto; utilícese en referencia a cómics que se centran en personajes o temas bisexuales.
alternative label: Historietas bisexuales
broader: LGBTQ+ comics
change note: Version 4.2.0
has top concept: Subcultures
in scheme: v3
preferred label: Cómics bisexuales

Transgender comics
type: Concept
issued: 2020-06-03
modified: 2025-02-23
replaces: transgenderComics
comment: Works consisting of sequential images often accompanied by text; use in reference to comics focusing on transgender characters or themes.
comment: Obras que consisten en imágenes secuenciales, a menudo acompañadas de texto; utilícese en referencia a cómics que se centran en personajes o temas transgénero.
alternative label: Historietas transgénero
broader: LGBTQ+ comics
change note: Version 4.2.0
has top concept: Subcultures
in scheme: v3
preferred label: Cómics transgénero

Queer comics
type: Concept
issued: 2020-06-03
modified: 2025-02-23
replaces: queerComics
comment: Works consisting of sequential images often accompanied by text; use in reference to comics focusing on queer characters or themes.
comment: Obras que consisten en imágenes secuenciales, a menudo acompañadas de texto; utilícese en referencia a cómics que se centran en personajes o temas queer.
alternative label: Historietas queer
broader: LGBTQ+ comics
change note: Version 4.2.0
has top concept: Subcultures
in scheme: v3
preferred label: Cómics queer

Lesbian romance fiction
type: Concept
issued: 2020-06-03
modified: 2025-02-23
replaces: lesbianRomanceFiction
comment: Written literary works focusing on romantic relationships and love between people; use in reference to romance fiction focusing on lesbian characters and themes.
comment: Obras literarias escritas centradas en las relaciones románticas y en el amor entre personas; utilícese en referencia a la ficción romántica centrada en personajes y temas lésbicos.
broader: LGBTQ+ romance fiction
change note: Version 4.2.0
has top concept: Subcultures
in scheme: v3
preferred label: Ficción romántica lésbica

Gay romance fiction
type: Concept
issued: 2020-06-03
modified: 2025-02-23
replaces: gayRomanceFiction
comment: Written literary work focusing on romantic relationships and love between people; use in reference to romance fiction focusing on gay characters or themes.
comment: Obras literarias escritas centradas en las relaciones románticas y el amor entre personas; utilícese en referencia a la ficción romántica centrada en personajes o temas gay.
broader: LGBTQ+ romance fiction
change note: Version 4.2.0
has top concept: Subcultures
in scheme: v3
preferred label: Ficción romántica gay

Bisexual romance fiction
type: Concept
issued: 2020-06-03
modified: 2025-02-23
replaces: bisexualRomanceFiction
comment: Written literary work focusing on romantic relationships and love between people; use in reference to romance fiction focusing on bisexual characters or themes.
comment: Principios legales, sociales o éticos de libertad o derecho que tienen las personas bisexuales.
broader: LGBTQ+ romance fiction
change note: Version 4.2.0
has top concept: Subcultures
in scheme: v3
preferred label: Derechos bisexuales

Transgender romance fiction
type: Concept
issued: 2020-06-03
modified: 2025-02-23
replaces: transgenderRomanceFiction
comment: Written literary works focusing on romantic relationships and love between people; use in reference to romance fiction focusing on transgender characters and themes.
comment: Obras literarias escritas centradas en las relaciones románticas y el amor entre personas; utilícese en referencia a la ficción romántica centrada en personajes y temas transgénero.
broader: LGBTQ+ romance fiction
change note: Version 4.2.0
has top concept: Subcultures
in scheme: v3
preferred label: Ficción romántica transgénero

Queer romance fiction
type: Concept
issued: 2020-06-03
modified: 2025-02-23
replaces: queerRomanceFiction
comment: Written literary work focusing on romantic relationships and love between people; use in reference to romance fiction focusing on queer characters or themes.
comment: Obras literarias escritas centradas en las relaciones románticas y el amor entre personas; utilícese en referencia a la ficción romántica que se centra en personajes o temas queer.
broader: LGBTQ+ romance fiction
change note: Version 4.2.0
has top concept: Subcultures
in scheme: v3
preferred label: Ficción romántica queer

Bisexual erotic literature
type: Concept
issued: 2020-06-03
modified: 2025-02-23
replaces: bisexualEroticLiterature
comment: Literary works that have erotic or sexual elements; use in reference to erotic literature focusing on bisexual characters or themes.
comment: Filmes o películas eróticas, creadas por directores bisexuales, que representan a personas bisexuales o a personas consideradas importantes dentro de la cultura bisexual.
broader: LGBTQ+ erotic literature
change note: Version 4.2.0
has top concept: Erotica
in scheme: v3
preferred label: Películas eróticas bisexuales

Transgender erotic literature
type: Concept
issued: 2020-06-03
modified: 2025-02-23
replaces: transgenderEroticLiterature
comment: Literary works that have erotic or sexual elements; use in reference to erotic literature focusing on transgender characters or themes.
comment: Obras literarias que tengan elementos eróticos o sexuales; utilícese en referencia a la literatura erótica que se centra en personajes o temas transgénero.
broader: LGBTQ+ erotic literature
change note: Version 4.2.0
has top concept: Erotica
in scheme: v3
preferred label: Literatura erótica transgénero

Queer erotic literature
type: Concept
issued: 2020-06-03
modified: 2025-02-23
replaces: queerEroticLiterature
comment: Literary works that have erotic or sexual elements; use in reference to erotic literature focusing on queer characters or themes.
comment: Obras literarias que tengan elementos eróticos o sexuales; utilícese en referencia a la literatura erótica que se centra en personajes o temas queer.
broader: LGBTQ+ erotic literature
change note: Version 4.2.0
has top concept: Erotica
in scheme: v3
preferred label: Literatura erótica queer

Lesbian short stories
type: Concept
issued: 2020-06-03
modified: 2025-02-23
replaces: lesbianShortStories
comment: Written literary works that are short in length and detail a self-contained incident or concept; use in reference to short stories focusing on lesbian characters or themes.
comment: Obras literarias escritas que son breves y detallan un incidente o concepto autónomo; utilícese en referencia a cuentos centrados en personajes o temas lésbicos.
alternative label: Relatos lésbicos||
broader: LGBTQ+ short stories
change note: Version 4.2.0
has top concept: Subcultures
in scheme: v3
preferred label: Cuentos cortos lésbicos

Gay short stories
type: Concept
issued: 2020-06-03
modified: 2025-02-23
replaces: gayShortStories
comment: Written literary works that are short in length and detail a self-contained incident or concept; use in reference to short stories focusing on gay characters or themes.
comment: Obras literarias escritas que son breves y detallan un incidente o concepto autónomo; utilícese en referencia a cuentos cortos que se centren en personajes o temas gay.
alternative label: Relatos gay
broader: LGBTQ+ short stories
change note: Version 4.2.0
has top concept: Subcultures
in scheme: v3
preferred label: Cuentos cortos gay

Bisexual short stories
type: Concept
issued: 2020-06-03
modified: 2025-02-23
replaces: bisexualShortStories
comment: Written literary works that are short in length and detail a self-contained incident or concept; use in reference to short stories focusing on bisexual characters or themes.
comment: Obras literarias escritas centradas en las relaciones románticas y el amor entre personas; utilícese en referencia a la ficción romántica centrada en personajes o temas bisexuales.
broader: LGBTQ+ short stories
change note: Version 4.2.0
has top concept: Subcultures
in scheme: v3
preferred label: Ficción romántica bisexual

Transgender short stories
type: Concept
issued: 2020-06-03
modified: 2025-02-23
replaces: transgenderShortStories
comment: Written literary works that are short in length and detail a self-contained incident or concept; use in reference to short stories focusing on transgender characters or themes.
comment: Obras literarias escritas que son breves y detallan un incidente o concepto autónomo; utilícese en referencia a cuentos cortos que se centren en personajes o temas transgénero.
alternative label: Relatos transgénero
broader: LGBTQ+ short stories
change note: Version 4.2.0
has top concept: Subcultures
in scheme: v3
preferred label: Cuentos cortos transgénero

Queer short stories
type: Concept
issued: 2020-06-03
modified: 2025-02-23
replaces: queerShortStories
comment: Written literary works that are short in length and detail a self-contained incident or concept; use in reference to short stories focusing on queer characters or themes.
comment: Obras literarias escritas que son breves y detallan un incidente o concepto autónomo; utilícese en referencia a los cuentos cortos que se centren en personajes o temas queer.
alternative label: Relatos queer
broader: LGBTQ+ short stories
change note: Version 4.2.0
has top concept: Subcultures
in scheme: v3
preferred label: Cuentos cortos queer

He/Him/Himself (Pronouns)
type: Concept
issued: 2021-07-01
modified: 2025-02-23
replaces: hePronouns
comment: A set of pronouns. Used in this manner: He went to the Homosaurus website. I watched him browse the Homosaurus. He uses the Homosaurus himself.
comment: Un conjunto de pronombres. Utilizado de esta manera: Él fue al sitio web de Homosaurus. Lo vi explorar el Homosaurus. Él mismo usa el Homosaurus.
alternative label: He (Pronouns)
alternative label: He/Him (Pronouns)
alternative label: Él (pronombres)
broader: Pronouns
change note: Version 4.2.0
has top concept: Pronouns
in scheme: v3
preferred label: Él/Lo (pronombres)

She/Her/Herself (Pronouns)
type: Concept
issued: 2021-07-01
modified: 2025-02-23
replaces: shePronouns
comment: A set of pronouns. Used in this manner: She went to the Homosaurus website. I watched her browse the Homosaurus. She uses the Homosaurus herself.
comment: Un conjunto de pronombres. Utilizados de la siguiente manera: Ella visitó el website del Homosaurus. Yo la vi navegar el Homosaurus. Ella utiliza el Homosaurus por sí misma.
alternative label: She (Pronouns)
alternative label: She/Her (Pronouns)
alternative label: Ella (pronombre)
alternative label: Ella/La
broader: Pronouns
change note: Version 4.2.0
has top concept: Pronouns
in scheme: v3
preferred label: Ella/La (Pronombre)

They/Them/Themselves (Pronouns)
type: Concept
issued: 2021-07-01
modified: 2025-02-23
replaces: theyThemThemselvesPronouns
comment: A set of pronouns. Used in this manner: They went to the Homosaurus website. I watched them browse the Homosaurus. They use the Homosaurus themselves.
comment: Un conjunto de pronombres. Utilizados de la siguiente manera: Elle visitó el website del Homosaurus. Yo le vi navegar el Homosaurus. Elle utiliza el Homosaurus por sí misme.
alternative label: They/Them/Themselves
broader: Pronouns
change note: Version 4.2.0
has top concept: Pronouns
in scheme: v3
preferred label: Elle/Le

They/Them/Themself (Pronouns)
type: Concept
issued: 2021-07-01
modified: 2025-02-23
replaces: theyThemThemselfPronouns
comment: A set of pronouns. Used in this manner: They went to the Homosaurus website. I watched them browse the Homosaurus. They use the Homosaurus themself.
comment: Un conjunto de pronombres. Utilizados de la siguiente manera: Elle visitó el website del Homosaurus. Yo le vi navegar el Homosaurus. Elle utiliza el Homosaurus por sí misme.
alternative label: They/Them/Themself
broader: Pronouns
change note: Version 4.2.0
has top concept: Pronouns
in scheme: v3
preferred label: Elle/Le

Blaqueer people
type: Concept
issued: 2021-12-07
modified: 2025-02-23
comment: Black queer people who recognize their queer identity as salient to their Blackness and vice versa; only use to describe individuals who identify as Blaqueer or BlaQ.
comment: Personas negras queer que reconocen su identidad queer como imprescindible para su negritud y viceversa; utilícese para describir a personas que se autoidentifican como Blaqueer o BlaQ.
alternative label: BlaQ people
alternative label: Personas Blaq
alternative label: Blaqueer
broader: Black LGBTQ+ people
change note: Version 4.2.0
has top concept: LGBTQ+ people
in scheme: v3
preferred label: Personas blaqueer

Biracial lesbians
type: Concept
issued: 2022-01-18
modified: 2025-02-23
comment: Lesbians who belong to two or more racial groups. Only use to describe people who self-identify as biracial.
comment: Lesbianas que pertenecen a dos o más grupos raciales. Utilícese únicamente para personas que se autoidentifiquen como birraciales.
alternative label: Bi-racial lesbians
alternative label: Lesbianas bi-raciales
broader: Biracial LGBTQ+ people
change note: Version 4.2.0
has top concept: LGBTQ+ people
in scheme: v3
preferred label: Lesbianas birraciales

Biracial gay men
type: Concept
issued: 2022-01-18
modified: 2025-02-23
comment: Gay men who belong to two or more racial groups. Only use to describe people who self-identify as biracial.
comment: Hombres gay que pertenecen a dos o más grupos raciales. Utilícese únicamente para personas que se autoidentifiquen como birraciales.
alternative label: Bi-racial gay men
alternative label: Gay bi-racial men
alternative label: Gay biracial men
alternative label: Hombres gay bi-raciales
alternative label: Gays bi-raciales
alternative label: Hombres bi-raciales gay
alternative label: Hombres birraciales gay
broader: Biracial LGBTQ+ people
change note: Version 4.2.0
has top concept: LGBTQ+ people
in scheme: v3
preferred label: Hombres gay birraciales

Biracial bisexual people
type: Concept
issued: 2022-01-18
modified: 2025-02-23
comment: Bisexual people who belong to two or more racial groups. Only use to describe people who self-identify as biracial.
comment: Personas bisexuales que pertenecen a dos o más grupos raciales. Utilícese únicamente para personas que se autoidentifiquen como birraciales.
alternative label: Bi-racial bisexual people
alternative label: Bisexual bi-racial people
alternative label: Bisexual biracial people
broader: Biracial LGBTQ+ people
change note: Version 4.2.0
has top concept: LGBTQ+ people
in scheme: v3
preferred label: Personas bisexuales birraciales

Biracial transgender people
type: Concept
issued: 2022-01-18
modified: 2025-02-23
comment: Transgender people who belong to two or more racial groups. Only use to describe people who self-identify as biracial.
comment: Personas transgénero que pertenecen a dos o más grupos raciales. Utilícese únicamente para personas que se autoidentifiquen como birraciales.
alternative label: Bi-racial transgender people
alternative label: Transgender bi-racial people
alternative label: Transgender biracial people
alternative label: Personas bi-raciales transgénero
alternative label: Personas transgénero bi-raciales
alternative label: Personas birraciales transgénero
broader: Biracial LGBTQ+ people
change note: Version 4.2.0
has top concept: LGBTQ+ people
in scheme: v3
preferred label: Personas transgénero birraciales

Biracial queer people
type: Concept
issued: 2022-01-18
modified: 2025-02-23
comment: Queer people who belong to two or more racial groups. Only use to describe people who self-identify as biracial.
comment: Personas queer que pertenecen a dos o más grupos raciales. Utilícese únicamente para personas que se autoidentifiquen como birraciales.
alternative label: Bi-racial queer people
alternative label: Queer bi-racial people
alternative label: Queer biracial people
alternative label: Personas queer bi-raciales
alternative label: Personas birraciales queer
alternative label: Personas bi-raciales queer
broader: Biracial LGBTQ+ people
change note: Version 4.2.0
has top concept: LGBTQ+ people
in scheme: v3
preferred label: Personas queer birraciales

Studs (Lesbian culture)
type: Concept
issued: 2022-02-28
modified: 2025-03-20
comment: Masculine identity associated with Black lesbian communities in the United States.
comment: Identidad masculina asociada a las comunidades de lesbianas negras en Estados Unidos.
change note: Version 4.2.0
in scheme: v3
preferred label: Studs

Pacific Islander American lesbians
type: Concept
issued: 2022-05-10
modified: 2025-02-23
comment: Lesbians who identify as both Pacific Islanders (or of Pacific Islander ancestry) and American.
comment: Lesbianas que se identifican a la vez como isleñas del Pacífico (o de ascendencia isleña del Pacífico) y estadounidenses.
alternative label: Lesbian Pacific Islander Americans
alternative label: Personas del Pacífico estadounidenses lesbianas
broader: Pacific Islander American LGBTQ+ people
change note: Version 4.2.0
has top concept: LGBTQ+ people
in scheme: v3
preferred label: Lesbianas del Pacífico estadounidenses

Pacific Islander American gay men
type: Concept
issued: 2022-05-10
modified: 2025-02-23
comment: Gay men who identify as both Pacific Islanders (or of Pacific Islander ancestry) and American.
comment: Hombres gay que se identifican a la vez como isleños del Pacífico (o de ascendencia isleña del Pacífico) y estadounidenses.
alternative label: Gay Pacific Islander American men
alternative label: Gay Pacific Islander Americans
alternative label: Hombres del Pacífico estadounidenses gay
broader: Pacific Islander American LGBTQ+ people
change note: Version 4.2.0
has top concept: LGBTQ+ people
in scheme: v3
preferred label: Hombres gay del Pacífico estadounidenses

Pacific Islander American bisexual people
type: Concept
issued: 2022-05-10
modified: 2025-02-23
comment: Bisexual people who identify as both Pacific Islanders (or of Pacific Islander ancestry) and American.
comment: Personas bisexuales que se identifican a la vez como isleñas del Pacífico (o de ascendencia isleña del Pacífico) y estadounidenses.
alternative label: Bisexual Pacific Islander American people
alternative label: Bisexual Pacific Islander Americans
alternative label: Personas del Pacífico estadounidenses bisexuales
broader: Pacific Islander American LGBTQ+ people
change note: Version 4.2.0
has top concept: LGBTQ+ people
in scheme: v3
preferred label: Personas bisexuales del Pacífico estadounidenses

Pacific Islander American transgender people
type: Concept
issued: 2022-05-10
modified: 2025-02-23
comment: Transgender people who identify as both Pacific Islanders (or of Pacific Islander ancestry) and American.
comment: Personas transgénero que se identifican a la vez como isleñas del Pacífico (o de ascendencia isleña del Pacífico) y estadounidenses.
alternative label: Transgender Pacific Islander American people
alternative label: Transgender Pacific Islander Americans
alternative label: Personas del Pacífico estadounidense transgénero
broader: Pacific Islander American LGBTQ+ people
change note: Version 4.2.0
has top concept: LGBTQ+ people
in scheme: v3
preferred label: Personas transgénero del Pacífico estadounidense

Pacific Islander American queer people
type: Concept
issued: 2022-05-10
modified: 2025-02-23
comment: Queer people who identify as both Pacific Islanders (or of Pacific Islander ancestry) and American.
comment: Personas queer que se identifican a la vez como isleñas del Pacífico (o de ascendencia isleña del Pacífico) y estadounidenses.
alternative label: Queer Pacific Islander American people
alternative label: Queer Pacific Islander Americans
alternative label: Personas del Pacífico estadounidenses queer
broader: Pacific Islander American LGBTQ+ people
change note: Version 4.2.0
has top concept: LGBTQ+ people
in scheme: v3
preferred label: Personas queer del Pacífico estadounidenses

Papuan lesbians
type: Concept
issued: 2022-05-11
modified: 2025-02-23
comment: Lesbians who are Papuan, or part of the Indigenous peoples of new Guinea; only use for people who identify as Papuan.
comment: Lesbianas que son papúes o parte de los pueblos indígenas de Nueva Guinea. Utilícese únicamente para personas que se autoidentifiquen como papúes.
alternative label: Lesbian Papuans
alternative label: Papúes lesbianas
broader: Papuan LGBTQ+ people
change note: Version 4.2.0
has top concept: LGBTQ+ people
in scheme: v3
preferred label: Lesbianas papúes

Papuan gay men
type: Concept
issued: 2022-05-11
modified: 2025-02-23
comment: Gay men who are Papuan, or part of the Indigenous peoples of new Guinea; only use for people who identify as Papuan.
comment: Hombres gay que son papúes o parte de los pueblos indígenas de Nueva Guinea. Utilícese únicamente para personas que se autoidentifiquen como papúes.
alternative label: Gay Papuan men
alternative label: Gay Papuans
alternative label: Hombres papúes gay
broader: Papuan LGBTQ+ people
change note: Version 4.2.0
has top concept: LGBTQ+ people
in scheme: v3
preferred label: Hombres gay papúes

Papuan bisexual people
type: Concept
issued: 2022-05-11
modified: 2025-02-23
comment: Bisexual people who are Papuan, or part of the Indigenous peoples of new Guinea; only use for people who identify as Papuan.
comment: Personas bisexuales que son papúes o parte de los pueblos indígenas de Nueva Guinea. Utilícese únicamente para personas que se autoidentifiquen como papúes.
alternative label: Bisexual Papuan people
alternative label: Bisexual Papuans
alternative label: Personas papúes bisexuales
broader: Papuan LGBTQ+ people
change note: Version 4.2.0
has top concept: LGBTQ+ people
in scheme: v3
preferred label: Personas bisexuales papúes

Papuan transgender people
type: Concept
issued: 2022-05-11
modified: 2025-02-23
comment: Transgender people who are Papuan, or part of the Indigenous peoples of new Guinea; only use for people who identify as Papuan.
comment: Personas transgénero que son papúes o parte de los pueblos indígenas de Nueva Guinea. Utilícese únicamente para personas que se autoidentifiquen como papúes.
alternative label: Transgender Papuan people
alternative label: Transgender Papuans
alternative label: Personas papúes transgénero
broader: Papuan LGBTQ+ people
change note: Version 4.2.0
has top concept: LGBTQ+ people
in scheme: v3
preferred label: Personas transgénero papúes

Papuan queer people
type: Concept
issued: 2022-05-11
modified: 2025-02-23
comment: Queer people who are Papuan, or part of the Indigenous peoples of new Guinea; only use for people who identify as Papuan.
comment: Personas queer que son papúes o parte de los pueblos indígenas de Nueva Guinea. Utilícese únicamente para personas que se autoidentifiquen como papúes.
alternative label: Queer Papuan people
alternative label: Queer Papuans
alternative label: Personas papúes queer
broader: Papuan LGBTQ+ people
change note: Version 4.2.0
has top concept: LGBTQ+ people
in scheme: v3
preferred label: Personas queer papúes

Papuan intersex people
type: Concept
issued: 2022-05-11
modified: 2025-02-23
comment: Intersex people who are Papuan, or part of the Indigenous peoples of new Guinea; only use for people who identify as Papuan.
comment: Personas intersexuales que son papúes o parte de los pueblos indígenas de Nueva Guinea. Utilícese únicamente para personas que se autoidentifiquen como papúes.
alternative label: Intersex Papuan people
alternative label: Intersex Papuans
alternative label: Personas intersex papúes
alternative label: Personas papúes intersexuales
broader: Papuan LGBTQ+ people
change note: Version 4.2.0
has top concept: LGBTQ+ people
in scheme: v3
preferred label: Personas intersexuales papúes

Romani lesbians
type: Concept
issued: 2022-05-11
modified: 2026-02-23
comment: Lesbians who are Romani or descend from this traditionally nomadic Indo-European people; only use to refer to people who self-identify as Romani.
comment: Lesbianas que son romaníes o parte del pueblo indoeuropeo tradicionalmente nómada.
alternative label: Lesbian Roma
alternative label: Lesbian Romanis
alternative label: Lesbian Romany
alternative label: Roma lesbians
alternative label: Romany lesbians
alternative label: Romaníes lesbianas
broader: Romani LGBTQ+ people
change note: Version 4.2.0
has top concept: LGBTQ+ people
in scheme: v3
preferred label: Lesbianas romaníes

Romani gay men
type: Concept
issued: 2022-05-11
modified: 2026-02-23
comment: Gay men who are Romani or descend from this traditionally nomadic Indo-European people; only use to refer to people who self-identify as Romani.
comment: Hombres gay que son romaníes o parte del pueblo indoeuropeo tradicionalmente nómada.
alternative label: Gay Roma
alternative label: Gay Romanis
alternative label: Gay Romany
alternative label: Roma gay men
alternative label: Romany gay men
alternative label: Hombres romaníes gay
broader: Romani LGBTQ+ people
change note: Version 4.2.0
has top concept: LGBTQ+ people
in scheme: v3
preferred label: Hombres gay romaníes

Romani bisexual people
type: Concept
issued: 2022-05-11
modified: 2026-02-23
comment: Bisexual people who are Romani or descend from this traditionally nomadic Indo-European people; only use to refer to people who self-identify as Romani.
comment: Personas bisexuales que son romaníes o parte del pueblo indoeuropeo tradicionalmente nómada.
alternative label: Bisexual Roma
alternative label: Bisexual Romanis
alternative label: Bisexual Romany
alternative label: Roma bisexual people
alternative label: Romany bisexual people
alternative label: Personas romaníes bisexuales
broader: Romani LGBTQ+ people
change note: Version 4.2.0
has top concept: LGBTQ+ people
in scheme: v3
preferred label: Personas bisexuales romaníes

Romani transgender people
type: Concept
issued: 2022-05-11
modified: 2026-02-23
comment: Transgender people who are Romani or descend from this traditionally nomadic Indo-European people; only use to refer to people who self-identify as Romani.
comment: Personas transgénero que son romaníes o parte del pueblo indoeuropeo tradicionalmente nómada.
alternative label: Roma transgender people
alternative label: Romany transgender people
alternative label: Transgender Roma
alternative label: Transgender Romanis
alternative label: Transgender Romany
alternative label: Personas romaníes transgénero
broader: Romani LGBTQ+ people
change note: Version 4.2.0
has top concept: LGBTQ+ people
in scheme: v3
preferred label: Personas transgénero romaníes

Romani queer people
type: Concept
issued: 2022-05-11
modified: 2026-02-23
comment: Queer people who are Romani or descend from this traditionally nomadic Indo-European people; only use to refer to people who self-identify as Romani.
comment: Personas queer que son romaníes o parte del pueblo indoeuropeo tradicionalmente nómada.
alternative label: Queer Roma
alternative label: Queer Romanis
alternative label: Queer Romany
alternative label: Roma queer people
alternative label: Romany queer people
alternative label: Personas romaníes queer
broader: Romani LGBTQ+ people
change note: Version 4.2.0
has top concept: LGBTQ+ people
in scheme: v3
preferred label: Personas queer romaníes

Romani intersex people
type: Concept
issued: 2022-05-11
modified: 2026-02-23
comment: Intersex people who are Romani or descend from this traditionally nomadic Indo-European people; only use to refer to people who self-identify as Romani.
comment: Personas intersexuales que son romaníes o parte del pueblo indoeuropeo tradicionalmente nómada.
alternative label: Intersex Roma
alternative label: Intersex Romanis
alternative label: Intersex Romany
alternative label: Roma intersex people
alternative label: Romany intersex people
alternative label: Personas romaníes intersexuales
alternative label: Personas intersex romaníes
alternative label: Personas romaníes intersex
broader: Romani LGBTQ+ people
change note: Version 4.2.0
has top concept: LGBTQ+ people
in scheme: v3
preferred label: Personas intersexuales romaníes

Kānaka Maoli lesbians
type: Concept
issued: 2022-05-11
modified: 2025-02-23
comment: Lesbians who are part of the Indigenous people of Mokupuni o Hawai‘i, or the Hawaiian Islands; only use to refer to people who identify as Kanaka Maoli.
comment: Lesbianas que pertenecen al pueblo indígena mokupuni o hawai‘i, o a las islas hawaianas. Utilícese únicamente para describir a las personas que se identifiquen como kānaka maoli.
alternative label: Indigenous Hawaiian lesbians
alternative label: Lesbian Indigenous Hawaiians
alternative label: Lesbian Kānaka Maoli
alternative label: Lesbian Kānaka ʻŌiwi
alternative label: Lesbian Native Hawaiians
alternative label: Native Hawaiian lesbians
broader: Kānaka Maoli LGBTQ+ people
change note: Version 4.2.0
has top concept: LGBTQ+ people
in scheme: v3
preferred label: Lesbianas kānaka maoli

Kānaka Maoli gay men
type: Concept
issued: 2022-05-11
modified: 2025-02-23
comment: Gay men who are part of the Indigenous people of Mokupuni o Hawai‘i, or the Hawaiian Islands; only use to refer to people who identify as Kanaka Maoli.
comment: Hombres gay que pertenecen al pueblo indígena mokupuni o hawai‘i, o a las islas hawaianas. Utilícese únicamente para describir a las personas que se identifiquen como kānaka maoli.
alternative label: Gay Indigenous Hawaiians
alternative label: Gay Kānaka Maoli
alternative label: Gay Kānaka ʻŌiwi
alternative label: Gay Native Hawaiians
alternative label: Indigenous Hawaiian gay men
alternative label: Native Hawaiian gay men
broader: Kānaka Maoli LGBTQ+ people
change note: Version 4.2.0
has top concept: LGBTQ+ people
in scheme: v3
preferred label: Hombres gay kānaka maoli

Kānaka Maoli bisexual people
type: Concept
issued: 2022-05-11
modified: 2025-02-23
comment: Bisexual people who are part of the Indigenous people of Mokupuni o Hawai‘i, or the Hawaiian Islands; only use to refer to people who identify as Kanaka Maoli.
comment: Personas bisexuales que pertenecen al pueblo indígena mokupuni o hawai‘i, o a las islas hawaianas. Utilícese únicamente para describir a las personas que se identifiquen como kānaka maoli.
alternative label: Bisexual Indigenous Hawaiians
alternative label: Bisexual Kānaka Maoli
alternative label: Bisexual Kānaka ʻŌiwi
alternative label: Bisexual Native Hawaiians
alternative label: Indigenous Hawaiian bisexual people
alternative label: Native Hawaiian bisexual people
broader: Kānaka Maoli LGBTQ+ people
change note: Version 4.2.0
has top concept: LGBTQ+ people
in scheme: v3
preferred label: Personas bisexuales kānaka maoli

Kānaka Maoli queer people
type: Concept
issued: 2022-05-11
modified: 2025-02-23
comment: Queer people who are part of the Indigenous people of Mokupuni o Hawai‘i, or the Hawaiian Islands; only use to refer to people who identify as Kanaka Maoli.
comment: Personas queer que pertenecen al pueblo indígena mokupuni o hawai‘i, o a las islas hawaianas. Utilícese únicamente para describir a las personas que se identifiquen como kānaka maoli.
alternative label: Indigenous Hawaiian queer people
alternative label: Native Hawaiian queer people
alternative label: Queer Indigenous Hawaiians
alternative label: Queer Kānaka Maoli
alternative label: Queer Kānaka ʻŌiwi
alternative label: Queer Native Hawaiians
broader: Kānaka Maoli LGBTQ+ people
change note: Version 4.2.0
has top concept: LGBTQ+ people
in scheme: v3
preferred label: Personas queer kānaka maoli

Inuit lesbians
type: Concept
issued: 2022-05-11
modified: 2025-02-23
comment: Lesbians who are Inuit, or part of several Indigenous peoples inhabiting the Inuit homeland in the Arctic and subarctic regions of Greenland, Canada, and Alaska. Only use for people who identify as Inuit.
comment: Lesbianas que son inuit o que son parte de varios pueblos indígenas que habitan los territorios ancestrales inuit en las regiones árticas o subárticas de Groenlandia, Canadá y Alaska. Utilícese únicamente para personas que se identifiquen como inuit.
alternative label: Lesbian Inuit people
alternative label: Lesbian Inuits
alternative label: Personas inuit lesbianas
broader: Inuit LGBTQ+ people
change note: Version 4.2.0
has top concept: LGBTQ+ people
in scheme: v3
preferred label: Lesbianas inuit

Inuit gay men
type: Concept
issued: 2022-05-11
modified: 2025-02-23
comment: Gay men who are Inuit, or part of several Indigenous peoples inhabiting the Inuit homeland in the Arctic and subarctic regions of Greenland, Canada, and Alaska. Only use for people who identify as Inuit.
comment: Hombres gay que son inuit o que son parte de varios pueblos indígenas que habitan los territorios ancestrales inuit en las regiones árticas o subárticas de Groenlandia, Canadá y Alaska. Utilícese únicamente para personas que se identifiquen como inuit.
alternative label: Gay Inuit men
alternative label: Gay Inuits
alternative label: Inuit gays
alternative label: Hombres inuit gay
alternative label: Inuits gay
broader: Inuit LGBTQ+ people
change note: Version 4.2.0
has top concept: LGBTQ+ people
in scheme: v3
preferred label: Hombres gay inuit

Inuit bisexual people
type: Concept
issued: 2022-05-11
modified: 2025-02-23
comment: Bisexual people who are Inuit, or part of several Indigenous peoples inhabiting the Inuit homeland in the Arctic and subarctic regions of Greenland, Canada, and Alaska. Only use for people who identify as Inuit.
comment: Personas bisexuales que son inuit o que son parte de varios pueblos indígenas que habitan los territorios ancestrales inuit en las regiones árticas o subárticas de Groenlandia, Canadá y Alaska. Utilícese únicamente para personas que se identifiquen como inuit.
alternative label: Bisexual Inuit people
alternative label: Bisexual Inuits
alternative label: Personas inuit bisexuales
broader: Inuit LGBTQ+ people
change note: Version 4.2.0
has top concept: LGBTQ+ people
in scheme: v3
preferred label: Personas bisexuales inuit

Inuit transgender people
type: Concept
issued: 2022-05-11
modified: 2025-02-23
comment: Transgender people who are Inuit, or part of several Indigenous peoples inhabiting the Inuit homeland in the Arctic and subarctic regions of Greenland, Canada, and Alaska. Only use for people who identify as Inuit.
comment: Personas transgénero que son inuit o que son parte de varios pueblos indígenas que habitan los territorios ancestrales inuit en las regiones árticas o subárticas de Groenlandia, Canadá y Alaska. Utilícese únicamente para personas que se identifiquen como inuit.
alternative label: Transgender Inuit people
alternative label: Transgender Inuits
alternative label: Personas inuit transgénero
broader: Inuit LGBTQ+ people
change note: Version 4.2.0
has top concept: LGBTQ+ people
in scheme: v3
preferred label: Personas transgénero inuit

Inuit queer people
type: Concept
issued: 2022-05-11
modified: 2025-02-23
comment: Queer people who are Inuit, or part of several Indigenous peoples inhabiting the Inuit homeland in the Arctic and subarctic regions of Greenland, Canada, and Alaska. Only use for people who identify as Inuit.
comment: Personas queer que son inuit o que son parte de varios pueblos indígenas que habitan los territorios ancestrales inuit en las regiones árticas o subárticas de Groenlandia, Canadá y Alaska. Utilícese únicamente para personas que se identifiquen como inuit.
alternative label: Queer Inuit people
alternative label: Queer Inuits
alternative label: Personas inuit queer
broader: Inuit LGBTQ+ people
change note: Version 4.2.0
has top concept: LGBTQ+ people
in scheme: v3
preferred label: Personas queer inuit

Inuit intersex people
type: Concept
issued: 2022-05-11
modified: 2025-02-23
comment: Intersex people who are Inuit, or part of several Indigenous peoples inhabiting the Inuit homeland in the Arctic and subarctic regions of Greenland, Canada, and Alaska. Only use for people who identify as Inuit.
comment: Personas intersexuales que son inuit o que son parte de varios pueblos indígenas que habitan los territorios ancestrales inuit en las regiones árticas o subárticas de Groenlandia, Canadá y Alaska. Utilícese únicamente para personas que se identifiquen como inuit.
alternative label: Intersex Inuit people
alternative label: Intersex Inuits
alternative label: Personas inuit intersexuales
alternative label: Personas intersex inuit
broader: Inuit LGBTQ+ people
change note: Version 4.2.0
has top concept: LGBTQ+ people
in scheme: v3
preferred label: Personas intersexuales inuit

Indigenous lesbians
type: Concept
issued: 2022-05-11
modified: 2025-02-23
comment: Lesbians who are part of an Indigenous people, or culturally distinct ethnic group whose members are directly descended from the earliest known inhabitants of a particular region and, to some extent, maintain the language and culture of those people. Only use to describe people who identify as Indigenous; use more specific terms whenever possible.
comment: Lesbianas que forman parte de un pueblo indígena o grupo étnico culturalmente distinto cuyos miembros descienden directamente de los primeros habitantes conocidos de una región en particular y, hasta cierto punto, mantienen el idioma y la cultura de ese pueblo. Utilícese únicamente para describir a personas que se autoidentifiquen como indígenas; utilícese términos más específicos siempre que sea posible.
alternative label: Lesbian Indigenous people
alternative label: Personas lesbianas indígenas
broader: Indigenous LGBTQ+ people
change note: Version 4.2.0
has top concept: LGBTQ+ people
in scheme: v3
preferred label: Lesbianas indígenas

Indigenous gay men
type: Concept
issued: 2022-05-11
modified: 2025-02-23
comment: Gay men who are part of an Indigenous people, or culturally distinct ethnic group whose members are directly descended from the earliest known inhabitants of a particular region and, to some extent, maintain the language and culture of those people. Only use to describe people who identify as Indigenous; use more specific terms whenever possible.
comment: Hombres gay que forman parte de un pueblo indígena o de un grupo étnico culturalmente distinto cuyos miembros descienden directamente de los primeros habitantes conocidos de una región en particular y, hasta cierto punto, mantienen el idioma y la cultura de ese pueblo. Utilicé únicamente para describir a personas que se autoidentifiquen como indígenas; Utilice términos más específicos siempre que sea posible.
alternative label: Gay Indigenous men
alternative label: Indigenous gays
alternative label: Hombres indígenas gay
broader: Indigenous LGBTQ+ people
change note: Version 4.2.0
has top concept: LGBTQ+ people
in scheme: v3
preferred label: Hombres gay indígenas

Indigenous bisexual people
type: Concept
issued: 2022-05-11
modified: 2025-02-23
comment: Bisexual people who are part of an Indigenous people, or culturally distinct ethnic group whose members are directly descended from the earliest known inhabitants of a particular region and, to some extent, maintain the language and culture of those people. Only use to describe people who identify as Indigenous; use more specific terms whenever possible.
comment: Personas bisexuales que forman parte de un pueblo indígena o grupo étnico culturalmente distinto cuyos miembros descienden directamente de los primeros habitantes conocidos de una región en particular y, hasta cierto punto, mantienen el idioma y la cultura de ese pueblo. Utilícese únicamente para describir a personas que se autoidentifiquen como indígenas; utilícese términos más específicos siempre que sea posible.
alternative label: Bisexual Indigenous people
alternative label: Personas indígenas bisexuales
broader: Indigenous LGBTQ+ people
change note: Version 4.2.0
has top concept: LGBTQ+ people
in scheme: v3
preferred label: Personas bisexuales indígenas

Indigenous transgender people
type: Concept
issued: 2022-05-11
modified: 2025-02-23
comment: Transgender people who are part of an Indigenous people, or culturally distinct ethnic group whose members are directly descended from the earliest known inhabitants of a particular region and, to some extent, maintain the language and culture of those people. Only use to describe people who identify as Indigenous; use more specific terms whenever possible.
comment: Personas transgénero que forman parte de un pueblo indígena o grupo étnico culturalmente distinto cuyos miembros descienden directamente de los primeros habitantes conocidos de una región en particular y, hasta cierto punto, mantienen el idioma y la cultura de esas personas. Utilícese únicamente para describir a personas que se autoidentifiquen como indígenas; utilícese términos más específicos siempre que sea posible.
alternative label: Transgender Indigenous people
alternative label: Personas indígenas transgénero
broader: Indigenous LGBTQ+ people
change note: Version 4.2.0
has top concept: LGBTQ+ people
in scheme: v3
preferred label: Personas transgénero indígenas

Indigenous queer people
type: Concept
issued: 2022-05-11
modified: 2025-02-23
comment: Queer people who are part of an Indigenous people, or culturally distinct ethnic group whose members are directly descended from the earliest known inhabitants of a particular region and, to some extent, maintain the language and culture of those people. Only use to describe people who identify as Indigenous; use more specific terms whenever possible.
comment: Personas queer que forman parte de un pueblo indígena o de un grupo étnico culturalmente distinto cuyos miembros descienden directamente de los primeros habitantes conocidos de una región en particular y, hasta cierto punto, mantienen el idioma y la cultura de ese pueblo. Utilícese únicamente para describir a personas que se autoidentifiquen como indígenas; utilícese términos más específicos siempre que sea posible.
alternative label: Queer Indigenous people
alternative label: Personas indígenas queer
broader: Indigenous LGBTQ+ people
change note: Version 4.2.0
has top concept: LGBTQ+ people
in scheme: v3
preferred label: Personas queer indígenas

Aboriginal Australian lesbians
type: Concept
issued: 2022-05-11
modified: 2025-02-23
comment: Lesbians who belong to one or more of the various Indigenous peoples of Australia; do not use to refer to the Indigenous people of the Torres Strait Islands, who are considered ethnically and culturally distinct. Only use to describe people who identify as Aboriginal Australian.
comment: Lesbianas que pertenecen a uno o más de los diversos pueblos indígenas de Australia; no para referirse a los pueblos indígenas de las Islas del Estrecho de Torres, que se consideran étnica y culturalmente distintos. Utilícese únicamente para describir a las personas que se autoidentifiquen como aborígenes australianos.
alternative label: Aboriginal lesbians
alternative label: Lesbian aboriginal Australians
preferred label: Lesbianas aborígenes australianas
alternative label: Aborígenes australianas lesbianas
broader: Aboriginal Australian LGBTQ+ people
change note: Version 4.2.0
has top concept: LGBTQ+ people
in scheme: v3

Aboriginal Australian gay men
type: Concept
issued: 2022-05-11
modified: 2025-02-23
comment: Gay men who belong to one or more of the various Indigenous peoples of Australia; do not use to refer to the Indigenous people of the Torres Strait Islands, who are considered ethnically and culturally distinct. Only use to describe people who identify as Aboriginal Australian.
comment: Hombres gay que pertenecen a uno o más de los diversos pueblos indígenas de Australia; no para referirse a los pueblos indígenas de las Islas del Estrecho de Torres, que se consideran étnica y culturalmente distintos. Utilícese únicamente para describir a las personas que se autoidentifiquen como aborígenes australianos.
alternative label: Aboriginal gay men
alternative label: Gay Aboriginal Australian men
alternative label: Gay Aboriginal Australians
preferred label: Hombres gay aborígenes australianos
alternative label: Australianos gay aborígenes
alternative label: Hombres aborígenes australianos gay
broader: Aboriginal Australian LGBTQ+ people
change note: Version 4.2.0
has top concept: LGBTQ+ people
in scheme: v3

Aboriginal Australian bisexual people
type: Concept
issued: 2022-05-11
modified: 2025-02-23
comment: Bisexual people who belong to one or more of the various Indigenous peoples of Australia; do not use to refer to the Indigenous people of the Torres Strait Islands, who are considered ethnically and culturally distinct. Only use to describe people who identify as Aboriginal Australian.
comment: Personas bisexuales que pertenecen a uno o más de los diversos pueblos indígenas de Australia; no para referirse a los pueblos indígenas de las Islas del Estrecho de Torres, que se consideran étnica y culturalmente distintos. Utilícese únicamente para describir a las personas que se autoidentifiquen como aborígenes australianos.
alternative label: Aboriginal bisexual people
alternative label: Bisexual Aboriginal Australian people
alternative label: Bisexual Aboriginal Australians
alternative label: Bisexuales aborígenes australianos
alternative label: Australianos bisexuales aborígenes
alternative label: Bisexuales aborígenes australianas
alternative label: Australianas bisexuales aborígenes
broader: Aboriginal Australian LGBTQ+ people
change note: Version 4.2.0
has top concept: LGBTQ+ people
in scheme: v3
preferred label: Personas bisexuales aborígenes australianas

Aboriginal Australian transgender people
type: Concept
issued: 2022-05-11
modified: 2025-02-23
comment: Transgender people who belong to one or more of the various Indigenous peoples of Australia; do not use to refer to the Indigenous people of the Torres Strait Islands, who are considered ethnically and culturally distinct. Only use to describe people who identify as Aboriginal Australian.
comment: Personas transgenero que pertenecen a uno o más de los diversos pueblos indígenas de Australia; no para referirse a los pueblos indígenas de las Islas del Estrecho de Torres, que se consideran étnica y culturalmente distintos. Utilícese únicamente para describir a las personas que se autoidentifiquen como aborígenes australianos.
alternative label: Aboriginal transgender people
alternative label: Transgender Aboriginal Australian people
alternative label: Transgender Aboriginal Australians
alternative label: Personas transgénero aborígenes
alternative label: Personas aborígenes australianas transgénero
alternative label: Aborígenes australianos transgénero
alternative label: Aborígenes australianas transgénero
preferred label: Personas transgénero aborígenes australianas
broader: Aboriginal Australian LGBTQ+ people
change note: Version 4.2.0
has top concept: LGBTQ+ people
in scheme: v3

Aboriginal Australian queer people
type: Concept
issued: 2022-05-11
modified: 2025-02-23
comment: Queer people who belong to one or more of the various Indigenous peoples of Australia; do not use to refer to the Indigenous people of the Torres Strait Islands, who are considered ethnically and culturally distinct. Only use to describe people who identify as Aboriginal Australian.
comment: Personas queer que pertenecen a uno o más de los diversos pueblos indígenas de Australia; no para referirse a los pueblos indígenas de las Islas del Estrecho de Torres, que se consideran étnica y culturalmente distintos. Utilícese únicamente para describir a las personas que se autoidentifiquen como aborígenes australianos.
alternative label: Aboriginal queer people
alternative label: Queer Aboriginal Australian people
alternative label: Queer Aboriginal Australians
alternative label: Personas aborígenes australianas queer
alternative label: Aborígenes australianos queer
alternative label: Aborígenes australianas queer
broader: Aboriginal Australian LGBTQ+ people
change note: Version 4.2.0
has top concept: LGBTQ+ people
in scheme: v3
preferred label: Personas queer aborígenes australianas

Aboriginal Australian intersex people
type: Concept
issued: 2022-05-11
modified: 2025-02-23
comment: Intersex people who belong to one or more of the various Indigenous peoples of Australia; do not use to refer to the Indigenous people of the Torres Strait Islands, who are considered ethnically and culturally distinct. Only use to describe people who identify as Aboriginal Australian.
comment: Personas intersexuales que pertenecen a uno o más de los diversos pueblos indígenas de Australia; no para referirse a los pueblos indígenas de las Islas del Estrecho de Torres, que se consideran étnica y culturalmente distintos. Utilícese únicamente para describir a las personas que se autoidentifiquen como aborígenes australianos.
alternative label: Aboriginal intersex people
alternative label: Intersex Aboriginal Australian people
alternative label: Intersex Aboriginal Australians
alternative label: Intersex aborígenes australianos
alternative label: Personas intersex aborígenes australianas
alternative label: Australianos intersex aborígenes
alternative label: Intersex aborígenes australianas
alternative label: Australianas intersex aborígenes
broader: Aboriginal Australian LGBTQ+ people
change note: Version 4.2.0
has top concept: LGBTQ+ people
in scheme: v3
preferred label: Personas intersexuales aborígenes australianas

Lesbian victims of bullying
type: Concept
issued: 2022-05-11
modified: 2025-02-23
comment: Lesbians who have experienced bullying due to their sexual identity and may or may not have survived; follow the individual's preference for "victims" or "survivors" whenever possible.
comment: Lesbianas que han sufrido acoso debido a su identidad sexual y que pueden o no haber sobrevivido; siga la preferencia de la persona sobre el uso de "víctimas" o "sobrevivientes" siempre que sea posible.
alternative label: Víctimas lésbicas de acoso
broader: LGBTQ+ victims of bullying
change note: Version 4.2.0
has top concept: LGBTQ+ people
in scheme: v3
preferred label: Víctimas lesbianas de acoso

Gay victims of bullying
type: Concept
issued: 2022-05-11
modified: 2025-02-23
comment: Gay men who have experienced bullying due to their sexual identity and may or may not have survived; follow the individual's preference for "victims" or "survivors" whenever possible.
comment: Hombres gay que han sufrido acoso debido a su identidad sexual y pueden haber sobrevivido o no; siga la preferencia de la persona sobre el uso de "víctimas" o "sobrevivientes" siempre que sea posible.
broader: LGBTQ+ victims of bullying
change note: Version 4.2.0
has top concept: LGBTQ+ people
in scheme: v3
preferred label: Víctimas gay de acoso

Bisexual victims of bullying
type: Concept
issued: 2022-05-11
modified: 2025-02-23
comment: Bisexual people who have experienced bullying due to their sexual identity and may or may not have survived; follow the individual's preference for "victims" or "survivors" whenever possible.
comment: Personas bisexuales que han sufrido acoso por su identidad sexual y pueden haber sobrevivido o no; siga la preferencia del individuo sobre el uso de "víctimas" o "sobrevivientes" siempre que sea posible.
broader: LGBTQ+ victims of bullying
change note: Version 4.2.0
has top concept: LGBTQ+ people
in scheme: v3
preferred label: Víctimas bisexuales de acoso

Transgender victims of bullying
type: Concept
issued: 2022-05-11
modified: 2025-02-23
comment: Transgender people who have experienced bullying due to their gender identity and may or may not have survived; follow the individual's preference for "victims" or "survivors" whenever possible.
comment: Personas transgénero que han sufrido acoso debido a su identidad de género y pueden o no haber sobrevivido; siga la preferencia de la persona sobre el uso de "víctimas" o "sobrevivientes" siempre que sea posible.
broader: LGBTQ+ victims of bullying
change note: Version 4.2.0
has top concept: LGBTQ+ people
in scheme: v3
preferred label: Víctimas transgénero de acoso

Queer victims of bullying
type: Concept
issued: 2022-05-11
modified: 2025-02-23
comment: Queer people who have experienced bullying due to their gender or sexual identity and may or may not have survived; follow the individual's preference for "victims" or "survivors" whenever possible.
comment: Personas queer que han sufrido acoso debido a su género o identidad sexual y pueden o no haber sobrevivido; siga la preferencia de la persona sobre el uso de "víctimas" o "sobrevivientes" siempre que sea posible.
broader: LGBTQ+ victims of bullying
change note: Version 4.2.0
has top concept: LGBTQ+ people
in scheme: v3
preferred label: Víctimas queer de acoso

Intersex victims of bullying
type: Concept
issued: 2022-05-11
modified: 2025-02-23
comment: Intersex people who have experienced bullying directed toward them because they are intersex and may or may not have survived; follow the individual's preference for "victims" or "survivors" whenever possible.
comment: Personas intersex que han sufrido acoso dirigido hacia ellas porque son intersex y pueden haber sobrevivido o no; siga la preferencia de la persona sobre el uso de "víctimas" o "sobrevivientes" siempre que sea posible.
broader: LGBTQ+ victims of bullying
change note: Version 4.2.0
has top concept: LGBTQ+ people
in scheme: v3
preferred label: Víctimas intersex de acoso

Lesbian survivors of bullying
type: Concept
issued: 2022-05-11
modified: 2025-02-23
comment: Lesbians who have experienced and survived bullying due to their sexual identity; follow the individual's preference for "victims" or "survivors" whenever possible.
comment: Lesbianas que han sufrido y sobrevivido acoso debido a su identidad sexual; siga la preferencia de la persona sobre el uso de "víctimas" o "sobrevivientes" siempre que sea posible.
alternative label: Lesbianas sobrevivientes de acoso
broader: LGBTQ+ survivors of bullying
change note: Version 4.2.0
has top concept: LGBTQ+ people
in scheme: v3
preferred label: Sobrevivientes lesbianas de acoso

Gay survivors of bullying
type: Concept
issued: 2022-05-11
modified: 2025-02-23
comment: Gay men who have experienced and survived bullying due to their sexual identity; follow the individual's preference for "victims" or "survivors" whenever possible.
comment: Hombres gay que han sufrido y sobrevivido al acoso por su identidad sexual; siga la preferencia de la persona sobre el uso de "víctimas" o "sobrevivientes" siempre que sea posible.
broader: LGBTQ+ survivors of bullying
change note: Version 4.2.0
has top concept: LGBTQ+ people
in scheme: v3
preferred label: Sobrevivientes gay de acoso

Bisexual survivors of bullying
type: Concept
issued: 2022-05-11
modified: 2025-02-23
comment: Bisexual people who have experienced and survived bullying due to their sexual identity; follow the individual's preference for "victims" or "survivors" whenever possible.
comment: Hijos que se autoidentifican como bisexuales.
broader: LGBTQ+ survivors of bullying
change note: Version 4.2.0
has top concept: LGBTQ+ people
in scheme: v3
preferred label: Hijos bisexuales

Transgender survivors of bullying
type: Concept
issued: 2022-05-11
modified: 2025-02-23
comment: Transgender people who have experienced and survived bullying due to their gender identity; follow the individual's preference for "victims" or "survivors" whenever possible.
comment: Personas transgénero que han sufrido y sobrevivido acoso debido a su identidad de género; siga la preferencia de la persona sobre el uso de "víctimas" o "sobrevivientes" siempre que sea posible.
broader: LGBTQ+ survivors of bullying
change note: Version 4.2.0
has top concept: LGBTQ+ people
in scheme: v3
preferred label: Sobrevivientes transgénero de acoso

Queer survivors of bullying
type: Concept
issued: 2022-05-11
modified: 2025-02-23
comment: Queer people who have experienced and survived bullying due to their gender or sexual identity; follow the individual's preference for "victims" or "survivors" whenever possible.
comment: Personas queer que han sufrido y sobrevivido al acoso debido a su género o identidad sexual; siga la preferencia de la persona sobre el uso de "víctimas" o "sobrevivientes" siempre que sea posible.
broader: LGBTQ+ survivors of bullying
change note: Version 4.2.0
has top concept: LGBTQ+ people
in scheme: v3
preferred label: Sobrevivientes queer de acoso

Asexual survivors of bullying
type: Concept
issued: 2022-05-11
modified: 2025-02-23
comment: Asexual people who have experienced and survived bullying due to their sexual identity; follow the individual's preference for "victims" or "survivors" whenever possible.
comment: Personas asexuales que han sufrido y sobrevivido al acoso por su identidad sexual; siga la preferencia de la persona sobre el uso de "víctimas" o "supervivientes" siempre que sea posible.
broader: LGBTQ+ survivors of bullying
change note: Version 4.2.0
has top concept: LGBTQ+ people
in scheme: v3
preferred label: Sobrevivientes asexuales de acoso

Intersex survivors of bullying
type: Concept
issued: 2022-05-11
modified: 2025-02-23
comment: Intersex people who have experienced and survived bullying directed toward them because they are intersex; follow the individual's preference for "victims" or "survivors" whenever possible.
comment: Personas intersex que han sufrido y sobrevivido acoso dirigido hacia ellas por ser intersex; siga la preferencia de la persona sobre el uso de "víctimas" o "sobrevivientes" siempre que sea posible.
broader: LGBTQ+ survivors of bullying
change note: Version 4.2.0
has top concept: LGBTQ+ people
in scheme: v3
preferred label: Sobrevivientes intersex de acoso

Chicano/a/x lesbians
type: Concept
issued: 2022-05-11
modified: 2025-02-23
comment: Lesbians of Mexican descent born in the United States; only use to describe people who self-identify as Chicano, Chicana, or Chicanx. Do not conflate with Latino/a/x or Hispanic people.
comment: Lesbianas de ascendencia mexicana nacidas en Estados Unidos; utilícese únicamente para describir a personas que se autoidentifiquen como chicanas. No se debe confundir con latinos/a/x o hispanos.
alternative label: Chicana lesbians
alternative label: Chicano lesbians
alternative label: Chicanx lesbians
alternative label: LGBTQ+ Chicanas
alternative label: Lesbian Chicanos
alternative label: Lesbian Chicanx people
alternative label: Lesbian Chicanxs
alternative label: Chicanas lesbianas
broader: Chicano/a/x LGBTQ+ people
change note: Version 4.2.0
has top concept: LGBTQ+ people
in scheme: v3
preferred label: Lesbianas chicanas

Arab lesbians
type: Concept
issued: 2022-05-11
modified: 2025-02-23
comment: Lesbians from Arab countries and/or are descended from Arab peoples. Do not conflate with Muslim people.
comment: Lesbianas que son de países árabes, hablan árabe y/o son descendientes de pueblos árabes. No se debe confundir con personas musulmanas.
alternative label: Lesbian Arab people
alternative label: Lesbian Arabs
alternative label: Árabes lesbianas
broader: Arab LGBTQ+ people
change note: Version 4.2.0
has top concept: LGBTQ+ people
in scheme: v3
preferred label: Lesbianas árabes

Arab gay men
type: Concept
issued: 2022-05-11
modified: 2025-02-23
comment: Gay men who are from Arab countries and/or are descended from Arab peoples. Do not conflate with Muslim people.
comment: Hombres gay que son de países árabes, hablan árabe y/o son descendientes de pueblos árabes. No se debe confundir con personas musulmanas.
alternative label: Gay Arab men
alternative label: Gay Arabs
alternative label: Hombres árabes gay
alternative label: Árabes gay
broader: Arab LGBTQ+ people
change note: Version 4.2.0
has top concept: LGBTQ+ people
in scheme: v3
preferred label: Hombres gay árabes

Arab bisexual people
type: Concept
issued: 2022-05-11
modified: 2025-02-23
comment: Bisexual people who are from Arab countries and/or are descended from Arab peoples. Do not conflate with Muslim people.
comment: Personas bisexuales que son de países árabes, hablan árabe y/o son descendientes de pueblos árabes. No se debe confundir con personas musulmanas.
alternative label: Bisexual Arab people
alternative label: Bisexual Arabs
alternative label: Personas árabes bisexuales
alternative label: Árabes bisexuales
broader: Arab LGBTQ+ people
change note: Version 4.2.0
has top concept: LGBTQ+ people
in scheme: v3
preferred label: Personas bisexuales árabes

Arab transgender people
type: Concept
issued: 2022-05-11
modified: 2025-02-23
comment: Transgender people who are from Arab countries and/or are descended from Arab peoples. Do not conflate with Muslim people.
comment: Personas transgénero que son de países árabes, hablan árabe y/o son descendientes de pueblos árabes. No se debe confundir con personas musulmanas.
alternative label: Transgender Arab people
alternative label: Transgender Arabs
alternative label: Personas árabes transgénero
alternative label: Árabes transgénero
broader: Arab LGBTQ+ people
change note: Version 4.2.0
has top concept: LGBTQ+ people
in scheme: v3
preferred label: Personas transgénero árabes

Arab queer people
type: Concept
issued: 2022-05-11
modified: 2025-02-23
comment: Queer people who are from Arab countries and/or are descended from Arab peoples. Do not conflate with Muslim people.
comment: Personas queer que son de países árabes, hablan árabe y/o descienden de pueblos árabes. No se debe confundir con personas musulmanas.
alternative label: Queer Arab people
alternative label: Queer Arabs
alternative label: Personas árabes queer
alternative label: Árabes queer
broader: Arab LGBTQ+ people
change note: Version 4.2.0
has top concept: LGBTQ+ people
in scheme: v3
preferred label: Personas queer árabes

Arab asexual people
type: Concept
issued: 2022-05-11
modified: 2025-02-23
comment: Asexual people who are from Arab countries and/or are descended from Arab peoples. Do not conflate with Muslim people.
comment: Personas asexuales que son de países árabes, hablan árabe y/o son descendientes de pueblos árabes. No se debe confundir con personas musulmanas.
alternative label: Asexual Arab people
alternative label: Asexual Arabs
alternative label: Personas árabes asexuales
alternative label: Árabes asexuales
broader: Arab LGBTQ+ people
change note: Version 4.2.0
has top concept: LGBTQ+ people
in scheme: v3
preferred label: Personas asexuales árabes

Arab intersex people
type: Concept
issued: 2022-05-11
modified: 2025-02-23
comment: Intersex people who are from Arab countries and/or are descended from Arab peoples. Do not conflate with Muslim people.
comment: Personas intersexuales que son de países árabes, hablan árabe y/o son descendientes de pueblos árabes. No se debe confundir con personas musulmanas.
alternative label: Intersex Arab people
alternative label: Intersex Arabs
alternative label: Personas árabes intersex
alternative label: Árabes intersex
alternative label: Personas intersex árabes
broader: Arab LGBTQ+ people
change note: Version 4.2.0
has top concept: LGBTQ+ people
in scheme: v3
preferred label: Personas intersexuales árabes

Chicano/a/x bisexual people
type: Concept
issued: 2022-05-11
modified: 2025-02-23
comment: Bisexual people of Mexican descent born in the United States; only use to describe people who self-identify as Chicano, Chicana, or Chicanx. Do not conflate with Latino/a/x or Hispanic people.
comment: Personas bisexuales de ascendencia mexicana nacidas en Estados Unidos; utilícese únicamente para describir a personas que se autoidentifiquen como chicanas. No se debe confundir con latinos/a/x o hispanos.
alternative label: Bisexual Chicanas
alternative label: Bisexual Chicanos
alternative label: Bisexual Chicanx people
alternative label: Bisexual Chicanxs
alternative label: Chicana bisexual people
alternative label: Chicano bisexual people
alternative label: Chicanx bisexual people
alternative label: Chicanas bisexuales
alternative label: Chicanos bisexuales
alternative label: Chicanxs bisexuales
alternative label: Personas chicanas bisexuales||
broader: Chicano/a/x LGBTQ+ people
change note: Version 4.2.0
has top concept: LGBTQ+ people
in scheme: v3
preferred label: Personas bisexuales chicanas

Chicano/a/x transgender people
type: Concept
issued: 2022-05-11
modified: 2025-02-23
comment: Transgender people of Mexican descent born in the United States; only use to describe people who self-identify as Chicano, Chicana, or Chicanx. Do not conflate with Latino/a/x or Hispanic people.
comment: Personas transgénero de ascendencia mexicana nacidas en Estados Unidos; utilícese únicamente para describir a personas que se autoidentifiquen como chicanas. No se debe confundir con latinos/a/x o hispanos.
alternative label: Chicana transgender people
alternative label: Chicano transgender people
alternative label: Chicanx transgender people
alternative label: Transgender Chicanas
alternative label: Transgender Chicanos
alternative label: Transgender Chicanx people
alternative label: Transgender Chicanxs
alternative label: Personas chicanas transgénero
alternative label: Chicanos transgénero
alternative label: Chicanas transgénero
alternative label: Chicanxs transgénero||
broader: Chicano/a/x LGBTQ+ people
change note: Version 4.2.0
has top concept: LGBTQ+ people
in scheme: v3
preferred label: Personas transgénero chicanas

Chicano/a/x queer people
type: Concept
issued: 2022-05-11
modified: 2025-02-23
comment: Queer people of Mexican descent born in the United States; only use to describe people who self-identify as Chicano, Chicana, or Chicanx. Do not conflate with Latino/a/x or Hispanic people.
comment: Personas queer de ascendencia mexicana nacidas en Estados Unidos; utilícese únicamente para describir a personas que se autoidentifiquen como chicanas. No se debe confundir con latinos/a/x o hispanos.
alternative label: Chicana queer people
alternative label: Chicano queer people
alternative label: Chicanx queer people
alternative label: Queer Chicanas
alternative label: Queer Chicanos
alternative label: Queer Chicanx people
alternative label: Queer Chicanxs
alternative label: Personas chicanas queer
alternative label: Chicanos queer
alternative label: Chicanas queer
alternative label: Chicanxs queer||
broader: Chicano/a/x LGBTQ+ people
change note: Version 4.2.0
has top concept: LGBTQ+ people
in scheme: v3
preferred label: Personas queer chicanas

Chicano/a/x intersex people
type: Concept
issued: 2022-05-11
modified: 2025-02-23
comment: Intersex people of Mexican descent born in the United States; only use to describe people who self-identify as Chicano, Chicana, or Chicanx. Do not conflate with Latino/a/x or Hispanic people.
comment: Personas intersexuales de ascendencia mexicana nacidas en Estados Unidos; utilícese únicamente para describir a personas que se autoidentifiquen como chicanas. No se debe confundir con latinos/a/x o hispanos.
alternative label: Chicana intersex people
alternative label: Chicano intersex people
alternative label: Chicanx intersex people
alternative label: Intersex Chicanas
alternative label: Intersex Chicanos
alternative label: Intersex Chicanx people
alternative label: Intersex Chicanxs
alternative label: Personas intersex chicanas
alternative label: Chicanas intersex
alternative label: Chicanos intersex
alternative label: Chicanxs intersex||
broader: Chicano/a/x LGBTQ+ people
change note: Version 4.2.0
has top concept: LGBTQ+ people
in scheme: v3
preferred label: Personas intersexuales chicanas

Hispanic lesbians
type: Concept
issued: 2022-05-16
modified: 2025-02-23
comment: Lesbians who are from or descended from Spain or other regions formerly colonized by Spain that are primarily Spanish-speaking. Only use for individuals who self-identify as Hispanic; do not conflate with Latino/a/x or Chicano/a/x.
comment: Lesbianas que hablan español, son de países de habla hispana y/o descienden de culturas de habla hispana; utilícese únicamente para personas que se autoidentifiquen como hispanas. No debe combinarse con Latino/a/x o Chicano/a/x.
alternative label: Lesbian Hispanics
alternative label: Hispanas lesbianas
broader: Hispanic LGBTQ+ people
change note: Version 4.2.0
has top concept: LGBTQ+ people
in scheme: v3
preferred label: Lesbianas hispanas

Hispanic gay men
type: Concept
issued: 2022-05-16
modified: 2025-02-23
comment: Gay men who are from or descended from Spain or other regions formerly colonized by Spain that are primarily Spanish-speaking. Only use for individuals who self-identify as Hispanic; do not conflate with Latino/a/x or Chicano/a/x.
comment: Hombres gay que hablan español, son de países de habla hispana y/o descienden de culturas de habla hispana; utilícese únicamente para personas que se autoidentifiquen como hispanas. No debe combinarse con Latino/a/x o Chicano/a/x.
alternative label: Gay Hispanic men
alternative label: Gay Hispanics
alternative label: Hombres hispanos gay
alternative label: Hispanos gay
broader: Hispanic LGBTQ+ people
change note: Version 4.2.0
has top concept: LGBTQ+ people
in scheme: v3
preferred label: Hombres gay hispanos

Hispanic bisexual people
type: Concept
issued: 2022-05-16
modified: 2025-02-23
comment: Bisexual people who are from or descended from Spain or other regions formerly colonized by Spain that are primarily Spanish-speaking. Only use for individuals who self-identify as Hispanic; do not conflate with Latino/a/x or Chicano/a/x.
comment: Personas bisexuales que hablan español, son de países de habla hispana y/o descienden de culturas de habla hispana; utilícese únicamente para personas que se autoidentifiquen como hispanas. No debe combinarse con Latino/a/x o Chicano/a/x.
alternative label: Bisexual Hispanic people
alternative label: Bisexual Hispanics
alternative label: Bisexuales hispanos
alternative label: Personas hispanas bisexuales
broader: Hispanic LGBTQ+ people
change note: Version 4.2.0
has top concept: LGBTQ+ people
in scheme: v3
preferred label: Personas bisexuales hispanas

Hispanic transgender people
type: Concept
issued: 2022-05-16
modified: 2025-02-23
comment: Trans people who are from or descended from Spain or other regions formerly colonized by Spain that are primarily Spanish-speaking. Only use for individuals who self-identify as Hispanic; do not conflate with Latino/a/x or Chicano/a/x.
comment: Personas transgénero que hablan español, son de países de habla hispana y/o descienden de culturas de habla hispana; utilícese únicamente para personas que se autoidentifiquen como hispanas. No debe combinarse con Latino/a/x o Chicano/a/x.
alternative label: Transgender Hispanic people
alternative label: Transgender Hispanics
alternative label: Personas hispanas transgénero
alternative label: Hispanos transgénero
broader: Hispanic LGBTQ+ people
change note: Version 4.2.0
has top concept: LGBTQ+ people
in scheme: v3
preferred label: Personas transgénero hispanas

Hispanic queer people
type: Concept
issued: 2022-05-16
modified: 2025-02-23
comment: Queer people who are from or descended from Spain or other regions formerly colonized by Spain that are primarily Spanish-speaking. Only use for individuals who self-identify as Hispanic; do not conflate with Latino/a/x or Chicano/a/x.
comment: Personas queer que hablan español, son de países de habla hispana y/o descienden de culturas de habla hispana; utilícese únicamente para personas que se autoidentifiquen como hispanas. No debe combinarse con Latino/a/x o Chicano/a/x.
alternative label: Queer Hispanic people
alternative label: Queer Hispanics
preferred label: Personas queer hispanas
alternative label: Hispanos queer
broader: Hispanic LGBTQ+ people
change note: Version 4.2.0
has top concept: LGBTQ+ people
in scheme: v3

Hispanic intersex people
type: Concept
issued: 2022-05-16
modified: 2025-02-23
comment: Intersex people who are from or descended from Spain or other regions formerly colonized by Spain that are primarily Spanish-speaking. Only use for individuals who self-identify as Hispanic; do not conflate with Latino/a/x or Chicano/a/x.
comment: Personas intersexuales que hablan español, son de países de habla hispana y/o descienden de culturas de habla hispana; utilícese únicamente para personas que se autoidentifiquen como hispanas. No debe combinarse con Latino/a/x o Chicano/a/x.
alternative label: Intersex Hispanic people
alternative label: Intersex Hispanics
alternative label: Intersex hispanas
alternative label: Personas hispanas intersex
alternative label: Personas intersex hispanas
broader: Hispanic LGBTQ+ people
change note: Version 4.2.0
has top concept: LGBTQ+ people
in scheme: v3
preferred label: Personas intersexuales hispanas

Intersex people in the workplace
type: Concept
issued: 2022-06-15
modified: 2025-02-23
comment: The presence of intersex people in the workplace, including acceptance of and issues faced by intersex workers.
comment: La presencia de personas intersex en el lugar de trabajo, incluida la aceptación de los trabajadores intersex y los problemas a los que se enfrentan.
broader: LGBTQ+ people in the workplace
change note: Version 4.2.0
has top concept: LGBTQ+ employment
in scheme: v3
preferred label: Personas intersex en el lugar trabajo

Asexual people in the workplace
type: Concept
issued: 2022-06-15
modified: 2025-02-23
comment: The presence of asexual people in the workplace, including acceptance of and issues faced by asexual workers.
comment: La presencia de personas asexuales en el lugar de trabajo, incluida la aceptación de los trabajadores asexuales y los problemas a los que se enfrentan.
broader: LGBTQ+ people in the workplace
change note: Version 4.2.0
has top concept: LGBTQ+ employment
in scheme: v3
preferred label: Personas asexuales en el lugar de trabajo

South Asian lesbians
type: Concept
issued: 2022-06-15
modified: 2025-02-23
comment: Lesbians who belong to or are descended from the ethnolinguistic groups of South Asia.
comment: Lesbianas que pertenecen a o descienden de los grupos etnolingüísticos del sur de Asia.
alternative label: Lesbian South Asian people
alternative label: Lesbian South Asians
broader: South Asian LGBTQ+ people
change note: Version 4.2.0
has top concept: LGBTQ+ people
in scheme: v3
preferred label: Lesbianas sudasiáticas

South Asian gay men
type: Concept
issued: 2022-06-15
modified: 2025-02-23
comment: Gay men who belong to or are descended from the ethnolinguistic groups of South Asia.
comment: Hombres gay que a pertenecen o descienden de los grupos etnolingüísticos del sur de Asia.
alternative label: Gay South Asian men
alternative label: Gay South Asians
alternative label: Hombres sudasiáticos gay
broader: South Asian LGBTQ+ people
change note: Version 4.2.0
has top concept: LGBTQ+ people
in scheme: v3
preferred label: Hombres gay sudasiáticos

South Asian bisexual people
type: Concept
issued: 2022-06-15
modified: 2025-02-23
comment: Bisexual people who belong to or are descended from the ethnolinguistic groups of South Asia.
comment: Personas bisexuales que a pertenecen o descienden de los grupos etnolingüísticos del sur de Asia.
alternative label: Bisexual South Asian men
alternative label: Bisexual South Asians
alternative label: Personas sudasiáticas bisexuales
broader: South Asian LGBTQ+ people
change note: Version 4.2.0
has top concept: LGBTQ+ people
in scheme: v3
preferred label: Personas bisexuales sudasiáticas

South Asian queer people
type: Concept
issued: 2022-06-15
modified: 2025-02-23
comment: Queer people who belong to or are descended from the ethnolinguistic groups of South Asia.
comment: Personas queer que pertenecen a o descienden de los grupos etnolingüísticos del sur de Asia.
alternative label: Queer South Asian people
alternative label: Queer South Asians
alternative label: Sudasiáticos queer
alternative label: Personas sudasiáticas queer
broader: South Asian LGBTQ+ people
change note: Version 4.2.0
has top concept: LGBTQ+ people
in scheme: v3
preferred label: Personas queer sudasiáticas

South Asian intersex people
type: Concept
issued: 2022-06-15
modified: 2025-02-23
comment: Intersex people who belong to or are descended from the ethnolinguistic groups of South Asia.
comment: Personas intersexuales que pertenecen a o descienden de los grupos etnolingüísticos del sur de Asia.
alternative label: Intersex South Asian people
alternative label: Intersex South Asians
alternative label: Personas intersex sudasiáticas
broader: South Asian LGBTQ+ people
change note: Version 4.2.0
has top concept: LGBTQ+ people
in scheme: v3
preferred label: Personas intersexuales sudasiáticas

South Asian transgender people
type: Concept
issued: 2022-06-15
modified: 2025-02-23
comment: Transgender people who belong to or are descended from the ethnolinguistic groups of South Asia.
comment: Personas transgénero que pertenecen a o descienden de los grupos etnolingüísticos del sur de Asia.
alternative label: Transgender South Asian people
alternative label: Transgender South Asians
alternative label: Sudasiáticos transgénero
alternative label: Personas sudasiáticas transgénero
broader: South Asian LGBTQ+ people
change note: Version 4.2.0
has top concept: LGBTQ+ people
in scheme: v3
preferred label: Personas transgénero sudasiáticas

South Asian asexual people
type: Concept
issued: 2022-06-15
modified: 2025-02-23
comment: Asexual people who belong to or are descended from the ethnolinguistic groups of South Asia.
comment: Personas asexuales que pertenecen a o descienden de los grupos etnolingüísticos del sur de Asia.
alternative label: Asexual South Asian people
alternative label: Asexual South Asians
alternative label: Personas sudasiáticas asexuales
broader: South Asian LGBTQ+ people
change note: Version 4.2.0
has top concept: LGBTQ+ people
in scheme: v3
preferred label: Personas asexuales sudasiáticas

Indian lesbians
type: Concept
issued: 2022-06-15
modified: 2025-02-23
comment: Lesbians who were born in India or are of Indian descent. Do not conflate with the Indigenous peoples of the United States.
comment: Lesbianas que nacieron en la India o son de ascendencia india. No se debe confundir con los pueblos indígenas de los Estados Unidos.
alternative label: Lesbian Indians
alternative label: Lesbianas de India
alternative label: Indias lesbianas
broader: Indian LGBTQ+ people
change note: Version 4.2.0
has top concept: LGBTQ+ people
in scheme: v3
preferred label: Lesbianas indias

Indian gay men
type: Concept
issued: 2022-06-15
modified: 2025-02-23
comment: Gay men who were born in India or are of Indian descent. Do not conflate with the Indigenous peoples of the United States.
comment: Hombres gay que nacieron en la India o son de ascendencia india. No se debe confundir con los pueblos indígenas de los Estados Unidos.
alternative label: Gay Indian men
alternative label: Gay Indians
alternative label: Hombres gay de India
alternative label: Indios gay
broader: Indian LGBTQ+ people
change note: Version 4.2.0
has top concept: LGBTQ+ people
in scheme: v3
preferred label: Hombres gay indios

Indian bisexual people
type: Concept
issued: 2022-06-15
modified: 2025-02-23
comment: Bisexual people who were born in India or are of Indian descent. Do not conflate with the Indigenous peoples of the United States.
comment: Personas bisexuales que nacieron en la India o son de ascendencia india. No se debe confundir con los pueblos indígenas de los Estados Unidos.
alternative label: Bisexual Indian people
alternative label: Bisexual Indians
alternative label: Personas bisexuales de India
alternative label: Bisexuales indios
broader: Indian LGBTQ+ people
change note: Version 4.2.0
has top concept: LGBTQ+ people
in scheme: v3
preferred label: Personas bisexuales indias

Indian queer people
type: Concept
issued: 2022-06-15
modified: 2025-02-23
comment: Queer people who were born in India or are of Indian descent. Do not conflate with the Indigenous peoples of the United States.
comment: Personas queer que nacieron en la India o son de ascendencia india. No se debe confundir con los pueblos indígenas de los Estados Unidos.
alternative label: Queer Indian people
alternative label: Queer Indians
alternative label: Personas queer de India
alternative label: Personas indias queer
broader: Indian LGBTQ+ people
change note: Version 4.2.0
has top concept: LGBTQ+ people
in scheme: v3
preferred label: Personas queer indias

Indian intersex people
type: Concept
issued: 2022-06-15
modified: 2025-02-23
comment: Intersex people who were born in India or are of Indian descent. Do not conflate with the Indigenous peoples of the United States.
comment: Personas intersexuales que nacieron en la India o son de ascendencia india. No se debe confundir con los pueblos indígenas de los Estados Unidos.
alternative label: Intersex Indian people
alternative label: Intersex Indians
alternative label: Personas intersex de India
alternative label: Indios intersex
alternative label: Personas intersex indias
broader: Indian LGBTQ+ people
change note: Version 4.2.0
has top concept: LGBTQ+ people
in scheme: v3
preferred label: Personas intersexuales indias

Indian transgender people
type: Concept
issued: 2022-06-15
modified: 2025-02-23
comment: Transgender people who were born in India or are of Indian descent. Do not conflate with the Indigenous peoples of the United States.
comment: Personas transgénero que nacieron en la India o son de ascendencia india. No se debe confundir con los pueblos indígenas de los Estados Unidos.
alternative label: Transgender Indian people
alternative label: Transgender Indians
alternative label: Personas transgénero de India
alternative label: Personas indias transgénero
broader: Indian LGBTQ+ people
change note: Version 4.2.0
has top concept: LGBTQ+ people
in scheme: v3
preferred label: Personas transgénero indias

Indian asexual people
type: Concept
issued: 2022-06-15
modified: 2025-02-23
comment: Asexual people who were born in India or are of Indian descent. Do not conflate with the Indigenous peoples of the United States.
comment: Personas asexuales que nacieron en la India o son de ascendencia india. No se debe confundir con los pueblos indígenas de los Estados Unidos.
alternative label: Asexual Indian people
alternative label: Asexual Indians
alternative label: Personas asexuales de India
alternative label: Asexuales indios
broader: Indian LGBTQ+ people
change note: Version 4.2.0
has top concept: LGBTQ+ people
in scheme: v3
preferred label: Personas asexuales indias

LGBTQ+ incest survivors
type: Concept
issued: 2022-06-27
modified: 2025-02-23
comment: LGBTQ+ people who have experienced and survived incest; follow the individual's preference for "victims" or "survivors" whenever possible.
comment: Personas LGBTQ+ que han sufrido y sobrevivido al incesto; siga la preferencia de la persona sobre el uso de "víctimas" o "sobrevivientes" siempre que sea posible.
alternative label: Incest survivors (LGBTQ)
alternative label: LGBTQ+ survivors of incest
alternative label: Survivors of incest (LGBTQ)
broader: LGBTQ+ incest victims
change note: Version 4.2.0
has top concept: LGBTQ+ people
in scheme: v3
preferred label: Sobrevivientes LGBTQ+ de incesto

Assamese lesbians
type: Concept
issued: 2022-06-27
modified: 2025-02-23
comment: Lesbians who are a part of the socio-ethnic Assamese peoples, speak the Assamese language, or reside in the Indian state of Assam.
comment: Lesbianas que forman parte de los pueblos socioétnicos asameses, hablan la lengua asamesa o residen en el estado indio de Assam.
alternative label: Lesbian Asomiya
alternative label: Asamesas lesbianas
broader: Assamese LGBTQ+ people
change note: Version 4.2.0
has top concept: LGBTQ+ people
in scheme: v3
preferred label: Lesbianas asamesas

Assamese gay men
type: Concept
issued: 2022-06-27
modified: 2025-02-23
comment: Gay men who are a part of the socio-ethnic Assamese peoples, speak the Assamese language, or reside in the Indian state of Assam.
comment: Hombres gay que forman parte de los pueblos socioétnicos asameses, hablan la lengua asamesa o residen en el estado indio de Assam.
alternative label: Assamese gays
alternative label: Gay Asomiya
alternative label: Gay Assamese men
alternative label: Hombres asameses gay
alternative label: Asameses gay
broader: Assamese LGBTQ+ people
change note: Version 4.2.0
has top concept: LGBTQ+ people
in scheme: v3
preferred label: Hombres gay asameses

Assamese bisexual people
type: Concept
issued: 2022-06-27
modified: 2025-02-23
comment: Bisexual people who are a part of the socio-ethnic Assamese peoples, speak the Assamese language, or reside in the Indian state of Assam.
comment: Personas bisexuales que forman parte de los pueblos socioétnicos asameses, hablan la lengua asamesa o residen en el estado indio de Assam.
alternative label: Bisexual Asomiya
alternative label: Bisexual Assamese people
alternative label: Personas asamesas bisexuales
alternative label: Asameses bisexuales
alternative label: Asamesas bisexuales
broader: Assamese LGBTQ+ people
change note: Version 4.2.0
has top concept: LGBTQ+ people
in scheme: v3
preferred label: Personas bisexuales asamesas

Assamese queer people
type: Concept
issued: 2022-06-27
modified: 2025-02-23
comment: Queer people who are a part of the socio-ethnic Assamese peoples, speak the Assamese language, or reside in the Indian state of Assam.
comment: Personas queer que forman parte de los pueblos socioétnicos asameses, hablan la lengua asamesa o residen en el estado indio de Assam.
alternative label: Queer Asomiya
alternative label: Queer Assamese people
alternative label: Personas asamesas queer
alternative label: Asamesas queer
alternative label: Asameses queer
broader: Assamese LGBTQ+ people
change note: Version 4.2.0
has top concept: LGBTQ+ people
in scheme: v3
preferred label: Personas queer asamesas

Assamese intersex people
type: Concept
issued: 2022-06-27
modified: 2025-02-23
comment: Intersex people who are a part of the socio-ethnic Assamese peoples, speak the Assamese language, or reside in the Indian state of Assam.
comment: Personas intersexuales que forman parte de los pueblos socioétnicos asameses, hablan la lengua asamesa o residen en el estado indio de Assam.
alternative label: Intersex Asomiya
alternative label: Intersex Assamese people
alternative label: Personas asamesas intersex
alternative label: Asameses intersex
alternative label: Personas intersex asamesas
alternative label: Asamesas intersex
broader: Assamese LGBTQ+ people
change note: Version 4.2.0
has top concept: LGBTQ+ people
in scheme: v3
preferred label: Personas intersexuales asamesas

Assamese transgender people
type: Concept
issued: 2022-06-27
modified: 2025-02-23
comment: Transgender people who are a part of the socio-ethnic Assamese peoples, speak the Assamese language, or reside in the Indian state of Assam.
comment: Personas transgénero que forman parte de los pueblos socioétnicos asameses, hablan la lengua asamesa o residen en el estado indio de Assam.
alternative label: Transgender Asomiya
alternative label: Transgender assamese people
alternative label: Personas asamesas transgénero
alternative label: Asamesas transgénero
alternative label: Asameses transgénero
broader: Assamese LGBTQ+ people
change note: Version 4.2.0
has top concept: LGBTQ+ people
in scheme: v3
preferred label: Personas transgénero asamesas

Assamese asexual people
type: Concept
issued: 2022-06-27
modified: 2025-02-23
comment: Asexual people who are a part of the socio-ethnic Assamese peoples, speak the Assamese language, or reside in the Indian state of Assam.
comment: Personas asexuales que forman parte de los pueblos socioétnicos asameses, hablan la lengua asamesa o residen en el estado indio de Assam.
alternative label: Asexual Asomiya
alternative label: Asexual Assamese people
alternative label: Personas asamesas asexuales
alternative label: Asameses asexuales
alternative label: Asamesas asexuales
broader: Assamese LGBTQ+ people
change note: Version 4.2.0
has top concept: LGBTQ+ people
in scheme: v3
preferred label: Personas asexuales asamesas

Awadhi lesbians
type: Concept
issued: 2022-06-27
modified: 2025-02-23
comment: Lesbians who speak the Awadhi dialect and reside in or are descended from those who resided in the Awadh region of Uttar Pradesh.
comment: Lesbianas que hablan el dialecto awadi, residen o descienden de quienes residieron en la región awadi de Uttar Pradesh, en el norte de India.
alternative label: Lesbian Awadhis
alternative label: Awadi lesbianas
broader: Awadhi LGBTQ+ people
change note: Version 4.2.0
has top concept: LGBTQ+ people
in scheme: v3
preferred label: Lesbianas awadi

Awadhi gay men
type: Concept
issued: 2022-06-27
modified: 2025-02-23
comment: Gay men who speak the Awadhi dialect and reside in or are descended from those who resided in the Awadh region of Uttar Pradesh.
comment: Hombres gay que hablan el dialecto awadi, residen o descienden de quienes residieron en Uttar Pradesh, en el norte de India.
alternative label: Gay Awadhi men
alternative label: Gay Awadhis
alternative label: Hombres awadi gay
broader: Awadhi LGBTQ+ people
change note: Version 4.2.0
has top concept: LGBTQ+ people
in scheme: v3
preferred label: Hombres gay awadi

Awadhi bisexual people
type: Concept
issued: 2022-06-27
modified: 2025-02-23
comment: Bisexual people who speak the Awadhi dialect and reside in or are descended from those who resided in the Awadh region of Uttar Pradesh.
comment: Personas bisexuales que hablan el dialecto awadi, residen o o descienden de quienes residieron en la región awadi de Uttar Pradesh, en el norte de India.
alternative label: Bisexual Awadhi people
alternative label: Bisexual Awadhis
alternative label: Personas awadi bisexual
alternative label: Bisexuales awadi
broader: Awadhi LGBTQ+ people
change note: Version 4.2.0
has top concept: LGBTQ+ people
in scheme: v3
preferred label: Personas bisexuales awadi

Awadhi queer people
type: Concept
issued: 2022-06-27
modified: 2025-02-23
comment: Queer people who speak the Awadhi dialect and reside in or are descended from those who resided in the Awadh region of Uttar Pradesh.
comment: Personas queer que hablan el dialecto awadi, residen o descienden de quienes residieron en la región awadi de Uttar Pradesh, en el norte de India.
alternative label: Queer Awadhi people
alternative label: Queer Awadhis
alternative label: Personas awadi queer
broader: Awadhi LGBTQ+ people
change note: Version 4.2.0
has top concept: LGBTQ+ people
in scheme: v3
preferred label: Personas queer awadi

Awadhi transgender people
type: Concept
issued: 2022-06-27
modified: 2025-02-23
comment: Transgender people who speak the Awadhi dialect and reside in or are descended from those who resided in the Awadh region of Uttar Pradesh.
comment: Personas transgénero que hablan el dialecto awadi, residen o descienden de quienes residieron en la región awadi de Uttar Pradesh, en el norte de India.
alternative label: Transgender Awadhi people
alternative label: Transgender Awadhis
alternative label: Personas awadi transgénero
broader: Awadhi LGBTQ+ people
change note: Version 4.2.0
has top concept: LGBTQ+ people
in scheme: v3
preferred label: Personas transgénero awadi

Awadhi intersex people
type: Concept
issued: 2022-06-27
modified: 2025-02-23
comment: Intersex people who speak the Awadhi dialect and reside in or are descended from those who resided in the Awadh region of Uttar Pradesh.
comment: Personas intersexuales que hablan el dialecto awadi, residen o descienden de quienes residieron en región awadi de Uttar Pradesh, en el norte de India.
alternative label: Intersex Awadhi people
alternative label: Intersex Awadhis
alternative label: Personas awadi intersex
alternative label: Intersex awadi
alternative label: Personas intersex awadi
broader: Awadhi LGBTQ+ people
change note: Version 4.2.0
has top concept: LGBTQ+ people
in scheme: v3
preferred label: Personas intersexuales awadi

Awadhi asexual people
type: Concept
issued: 2022-06-27
modified: 2025-02-23
comment: Asexual people who speak the Awadhi dialect and reside in or are descended from those who resided in the Awadh region of Uttar Pradesh.
comment: Personas asexuales que hablan el dialecto awadi, residen o descienden de quienes residieron en la región awadi de Uttar Pradesh, en el norte de India.
alternative label: Asexual Awadhi people
alternative label: Asexual Awadhis
alternative label: Personas awadi asexual
alternative label: Asexuales awadi
broader: Awadhi LGBTQ+ people
change note: Version 4.2.0
has top concept: LGBTQ+ people
in scheme: v3
preferred label: Personas asexuales awadi

Bhojpuri lesbians
type: Concept
issued: 2022-06-27
modified: 2025-02-23
comment: Lesbians who speak the Bhojpuri language and live in or are descended from those who inhabited the Bhojpuri-Purvanchal region of India and Nepal.
comment: Lesbianas que hablan el idioma bhojpuri y viven, pertenecen o son descendientes de quienes habitaron la región de Bhojpuri-Purvanchal de India y Nepal.
alternative label: Lesbian Bhojpuriyas
alternative label: Bhojpuri lesbianas
broader: Bhojpuri LGBTQ+ people
change note: Version 4.2.0
has top concept: LGBTQ+ people
in scheme: v3
preferred label: Lesbianas bhojpuri

Bhojpuri gay men
type: Concept
issued: 2022-06-27
modified: 2025-02-23
comment: Gay men who speak the Bhojpuri language and live in or are descended from those who inhabited the Bhojpuri-Purvanchal region of India and Nepal.
comment: Hombres gay que hablan el idioma bhojpuri y viven, pertenecen o son descendientes de quienes habitaron la región de Bhojpuri-Purvanchal de India y Nepal.
alternative label: Gay Bhojpuri people
alternative label: Gay Bhojpuriyas
alternative label: Hombres gay bhojpuriyas
alternative label: Bhojpuriyas gay
alternative label: Bhojpuri gay
broader: Bhojpuri LGBTQ+ people
change note: Version 4.2.0
has top concept: LGBTQ+ people
in scheme: v3
preferred label: Hombres gay bhojpuri

Bhojpuri bisexual people
type: Concept
issued: 2022-06-27
modified: 2025-02-23
comment: Bisexual people who speak the Bhojpuri language and live in or are descended from those who inhabited the Bhojpuri-Purvanchal region of India and Nepal.
comment: Personas bisexuales que hablan el idioma bhojpuri y viven, pertenecen o son descendientes de quienes habitaron la región de Bhojpuri-Purvanchal de India y Nepal.
alternative label: Bisexual Bhojpuri people
alternative label: Bisexual Bhojpuriyas
alternative label: Bisexuales bhojpuriyas
alternative label: Bhojpuriyas bisexuales
alternative label: Bisexuales bhojpuri
alternative label: Bhojpuri bisexuales
broader: Bhojpuri LGBTQ+ people
change note: Version 4.2.0
has top concept: LGBTQ+ people
in scheme: v3
preferred label: Personas bisexuales bhojpuri

Bhojpuri queer people
type: Concept
issued: 2022-06-27
modified: 2025-02-23
comment: Queer people who speak the Bhojpuri language and live in or are descended from those who inhabited the Bhojpuri-Purvanchal region of India and Nepal.
comment: Personas queer que hablan el idioma bhojpuri y viven, pertenecen o son descendientes de quienes habitaron la región de Bhojpuri-Purvanchal de India y Nepal.
alternative label: Queer Bhojpuri people
alternative label: Queer Bhojpuriyas
alternative label: Personas bhojpuri queer
alternative label: Bhojpuriyas queer
broader: Bhojpuri LGBTQ+ people
change note: Version 4.2.0
has top concept: LGBTQ+ people
in scheme: v3
preferred label: Personas queer bhojpuri

Bhojpuri transgender people
type: Concept
issued: 2022-06-27
modified: 2025-02-23
comment: Transgender people who speak the Bhojpuri language and live in or are descended from those who inhabited the Bhojpuri-Purvanchal region of India and Nepal.
comment: Personas transgénero que hablan el idioma bhojpuri y viven, pertenecen o son descendientes de quienes habitaron la región de Bhojpuri-Purvanchal de India y Nepal.
alternative label: Transgender Bhojpuri people
alternative label: Transgender Bhojpuriyas
alternative label: Personas bhojpuri transgénero
alternative label: Bhojpuriyas transgénero
broader: Bhojpuri LGBTQ+ people
change note: Version 4.2.0
has top concept: LGBTQ+ people
in scheme: v3
preferred label: Personas transgénero bhojpuri

Bhojpuri intersex people
type: Concept
issued: 2022-06-27
modified: 2025-02-23
comment: Intersex people who speak the Bhojpuri language and live in or are descended from those who inhabited the Bhojpuri-Purvanchal region of India and Nepal.
comment: Personas intersexuales que hablan el idioma bhojpuri y viven, pertenecen o son descendientes de quienes habitaron la región de Bhojpuri-Purvanchal de India y Nepal.
alternative label: Intersex Bhojpuri people
alternative label: Intersex Bhojpuriyas
alternative label: Personas intersex bhojpuri
alternative label: Bhojpuriyas intersex
broader: Bhojpuri LGBTQ+ people
change note: Version 4.2.0
has top concept: LGBTQ+ people
in scheme: v3
preferred label: Personas intersexuales bhojpuri

Bhojpuri asexual people
type: Concept
issued: 2022-06-27
modified: 2025-02-23
comment: Asexual people who speak the Bhojpuri language and live in or are descended from those who inhabited the Bhojpuri-Purvanchal region of India and Nepal.
comment: Personas asexuales que hablan el idioma bhojpuri y viven, pertenecen o son descendientes de quienes habitaron la región de Bhojpuri-Purvanchal de India y Nepal.
alternative label: Asexual Bhojpuri people
alternative label: Asexual Bhojpuriyas
alternative label: Asexuales bhojpuri
alternative label: Bhojpuri asexuales
alternative label: Asexuales bhojpuriyas
alternative label: Bhojpuriyas asexuales
broader: Bhojpuri LGBTQ+ people
change note: Version 4.2.0
has top concept: LGBTQ+ people
in scheme: v3
preferred label: Personas asexuales bhojpuri

Bengali lesbians
type: Concept
issued: 2022-06-27
modified: 2025-02-23
comment: Lesbians who speak the Bengali language or are of Bengali descent.
comment: Lesbianas que hablan el idioma bengalí o son de ascendencia bengalí. Correferenciar con lesbianas bangladesíes cuando una persona es tanto de etnia bengalí como de nacionalidad bangladesí.
alternative label: Lesbian Bengalis
alternative label: Bengalíes lesbianas
broader: Bengali LGBTQ+ people
change note: Version 4.2.0
has top concept: LGBTQ+ people
in scheme: v3
preferred label: Lesbianas bengalíes

Bengali gay men
type: Concept
issued: 2022-06-27
modified: 2025-02-23
comment: Gay men who speak the Bengali language or are of Bengali descent.
comment: Hombres gay que hablan el idioma bengalí o son de ascendencia bengalí. Correferenciar con hombres gay de Bangladesh cuando una persona es tanto de etnia bengalí como de nacionalidad bangladesí.
alternative label: Gay Bengali people
alternative label: Gay Bengalis
alternative label: Bengalíes gay
broader: Bengali LGBTQ+ people
change note: Version 4.2.0
has top concept: LGBTQ+ people
in scheme: v3
preferred label: Hombres gay bengalíes

Bengali bisexual people
type: Concept
issued: 2022-06-27
modified: 2025-02-23
comment: Bisexual people who speak the Bengali language or are of Bengali descent.
comment: Personas bisexuales que hablan el idioma bengalí y son de ascendencia bengalí. Correferenciar con personas bisexuales de Bangladesh cuando una persona es tanto de etnia bengalí como de nacionalidad bangladesí.
alternative label: Bisexual Bengali people
alternative label: Bisexual Bengalis
alternative label: Personas bengalíes bisexuales
alternative label: Bengalíes bisexuales
broader: Bengali LGBTQ+ people
change note: Version 4.2.0
has top concept: LGBTQ+ people
in scheme: v3
preferred label: Personas bisexuales bengalíes

Bengali queer people
type: Concept
issued: 2022-06-27
modified: 2025-02-23
comment: Queer people who speak the Bengali language or are of Bengali descent.
comment: Personas queer que hablan el idioma bengalí y son de ascendencia bengalí. Correferenciar con personas queer de Bangladesh cuando una persona es tanto de etnia bengalí como de nacionalidad bangladesí.
alternative label: Queer Bengali people
alternative label: Queer Bengalis
alternative label: Personas bengalíes queer
alternative label: Bengalíes queer
broader: Bengali LGBTQ+ people
change note: Version 4.2.0
has top concept: LGBTQ+ people
in scheme: v3
preferred label: Personas queer bengalíes

Bengali transgender people
type: Concept
issued: 2022-06-27
modified: 2025-02-23
comment: Transgender people who speak the Bengali language or are of Bengali descent.
comment: Personas transgénero que hablan el idioma bengalí y son de ascendencia bengalí. Correferenciar con personas transgénero de Bangladesh cuando una persona es tanto de etnia bengalí como de nacionalidad bangladesí.
alternative label: Transgender Bengali people
alternative label: Transgender Bengalis
alternative label: Personas bengalíes transgénero
alternative label: Bengalíes transgénero
broader: Bengali LGBTQ+ people
change note: Version 4.2.0
has top concept: LGBTQ+ people
in scheme: v3
preferred label: Personas transgénero bengalíes

Bengali intersex people
type: Concept
issued: 2022-06-27
modified: 2025-02-23
comment: Intersex people who speak the Bengali language or are of Bengali descent.
comment: Personas intersexuales que hablan el idioma bengalí y son de ascendencia bengalí. Correferenciar con personas intersex de Bangladesh cuando una persona es tanto de etnia bengalí como de nacionalidad bangladesí.
alternative label: Intersex Bengali people
alternative label: Intersex Bengalis
alternative label: Personas bengalíes intersex
alternative label: Bengalíes intersex
alternative label: Personas intersex bengalíes
broader: Bengali LGBTQ+ people
change note: Version 4.2.0
has top concept: LGBTQ+ people
in scheme: v3
preferred label: Personas intersexuales bengalíes

Bengali asexual people
type: Concept
issued: 2022-06-27
modified: 2025-02-23
comment: Asexual people who speak the Bengali language or are of Bengali descent.
comment: Personas asexuales que hablan el idioma bengalí y son de ascendencia bengalí. Correferenciar con personas asexuales de Bangladesh cuando una persona es tanto de etnia bengalí como de nacionalidad bangladesí.
alternative label: Asexual Bengali people
alternative label: Asexual Bengalis
alternative label: Personas bengalíes asexuales
alternative label: Bengalíes asexuales
broader: Bengali LGBTQ+ people
change note: Version 4.2.0
has top concept: LGBTQ+ people
in scheme: v3
preferred label: Personas asexuales bengalíes

Bhil lesbians
type: Concept
issued: 2022-06-27
modified: 2025-02-23
comment: Lesbians who speak the Bhil language and belong to or are descended from the Bhil tribal group.
comment: Lesbianas que hablan el idioma bhil y pertenecen o son descendientes del grupo tribal Bhil.
alternative label: Bheel lesbians
alternative label: Lesbian Bhils
alternative label: Bhils lesbianas
broader: Bhil LGBTQ+ people
change note: Version 4.2.0
has top concept: LGBTQ+ people
in scheme: v3
preferred label: Lesbianas bhil

Bhil gay men
type: Concept
issued: 2022-06-27
modified: 2025-02-23
comment: Gay men who speak the Bhil language and belong to or are descended from the Bhil tribal group.
comment: Hombres gay que hablan el idioma bhil y pertenecen o son descendientes del grupo tribal bhil.
alternative label: Bheel gay men
alternative label: Gay Bhil people
alternative label: Gay Bhils
alternative label: Bhils gay
broader: Bhil LGBTQ+ people
change note: Version 4.2.0
has top concept: LGBTQ+ people
in scheme: v3
preferred label: Hombres gay bhil

Bhil bisexual people
type: Concept
issued: 2022-06-27
modified: 2025-02-23
comment: Bisexual people who speak the Bhil language and belong to or are descended from the Bhil tribal group.
comment: Personas bisexuales que hablan el idioma bhil y pertenecen o son descendientes del grupo tribal bhil.
alternative label: Bheel bisexual people
alternative label: Bisexual Bhil people
alternative label: Bisexual Bhils
alternative label: Personas bhils bisexuales
alternative label: Bhils bisexuales
broader: Bhil LGBTQ+ people
change note: Version 4.2.0
has top concept: LGBTQ+ people
in scheme: v3
preferred label: Personas bisexuales bhil

Bhil queer people
type: Concept
issued: 2022-06-27
modified: 2025-02-23
comment: Queer people who speak the Bhil language and belong to or are descended from the Bhil tribal group.
comment: Personas queer que hablan el idioma bhil y pertenecen o son descendientes del grupo tribal bhil.
alternative label: Bhils queer
broader: Bhil LGBTQ+ people
change note: Version 4.2.0
has top concept: LGBTQ+ people
in scheme: v3
preferred label: Personas queer bhil
preferred label: Bheel queer people
preferred label: Queer Bhil people
preferred label: Queer Bhils

Bhil transgender people
type: Concept
issued: 2022-06-27
modified: 2025-02-23
comment: Transgender people who speak the Bhil language and belong to or are descended from the Bhil tribal group.
comment: Personas transgénero que hablan el idioma bhil y pertenecen o son descendientes del grupo tribal bhil.
alternative label: Bheel transgender people
alternative label: Transgender Bhil people
alternative label: Transgender Bhils
alternative label: Personas bhils transgénero
alternative label: Bhils transgénero
broader: Bhil LGBTQ+ people
change note: Version 4.2.0
has top concept: LGBTQ+ people
in scheme: v3
preferred label: Personas transgénero bhil

Bhil intersex people
type: Concept
issued: 2022-06-27
modified: 2025-02-23
comment: Intersex people who speak the Bhil language and belong to or are descended from the Bhil tribal group.
comment: Personas intersexuales que hablan el idioma bhil y pertenecen o son descendientes del grupo tribal bhil.
alternative label: Bheel intersex people
alternative label: Intersex Bhil people
alternative label: Intersex Bhils
alternative label: Personas bhils intersex
alternative label: Intersexuales bhils
alternative label: Personas intersex bhils
broader: Bhil LGBTQ+ people
change note: Version 4.2.0
has top concept: LGBTQ+ people
in scheme: v3
preferred label: Personas intersexuales bhil

Bhil asexual people
type: Concept
issued: 2022-06-27
modified: 2025-02-23
comment: Asexual people who speak the Bhil language and belong to or are descended from the Bhil tribal group.
comment: Personas asexuales que hablan el idioma bhil y pertenecen o son descendientes del grupo tribal bhil.
alternative label: Asexual Bhil people
alternative label: Asexual Bhils
alternative label: Bheel asexual people
alternative label: Personas bhil asexuales
alternative label: Bhils asexuales
broader: Bhil LGBTQ+ people
change note: Version 4.2.0
has top concept: LGBTQ+ people
in scheme: v3
preferred label: Personas asexuales bhil

Chakma lesbians
type: Concept
issued: 2022-06-27
modified: 2025-02-23
comment: Lesbians who belong to or are descended from the Chakma tribal group.
comment: Lesbianas que que pertenecen o son descendientes del grupo tribal chakma.
alternative label: Chakmas lesbianas
broader: Chakma LGBTQ+ people
change note: Version 4.2.0
has top concept: LGBTQ+ people
in scheme: v3
preferred label: Lesbianas chakma

Chakma gay men
type: Concept
issued: 2022-06-27
modified: 2025-02-23
comment: Gay men who belong to or are descended from the Chakma tribal group.
comment: Hombres gay que pertenecen o son descendientes del grupo tribal chakma.
alternative label: Gay Chakma people
alternative label: Chakmas gay
broader: Chakma LGBTQ+ people
change note: Version 4.2.0
has top concept: LGBTQ+ people
in scheme: v3
preferred label: Hombres gay chakma

Chakma bisexual people
type: Concept
issued: 2022-06-27
modified: 2025-02-23
comment: Bisexual people who belong to or are descended from the Chakma tribal group.
comment: Personas bisexuales que pertenecen o son descendientes del grupo tribal chakma.
alternative label: Bisexual Chakma people
alternative label: Personas chakma bisexuales
broader: Chakma LGBTQ+ people
change note: Version 4.2.0
has top concept: LGBTQ+ people
in scheme: v3
preferred label: Personas bisexuales chakma

Chakma queer people
type: Concept
issued: 2022-06-27
modified: 2025-02-23
comment: Queer people who belong to or are descended from the Chakma tribal group.
comment: Personas queer que pertenecen o son descendientes del grupo tribal chakma.
alternative label: Queer Chakma people
alternative label: Personas chakma queer
broader: Chakma LGBTQ+ people
change note: Version 4.2.0
has top concept: LGBTQ+ people
in scheme: v3
preferred label: Personas queer chakma

Chakma intersex people
type: Concept
issued: 2022-06-27
modified: 2025-02-23
comment: Intersex people who belong to or are descended from the Chakma tribal group.
comment: Personas intersexuales que pertenecen o son descendientes del grupo tribal chakma.
alternative label: Intersex Chakma people
alternative label: Personas intersex chakma
broader: Chakma LGBTQ+ people
change note: Version 4.2.0
has top concept: LGBTQ+ people
in scheme: v3
preferred label: Personas intersexuales chakma

Chakma transgender people
type: Concept
issued: 2022-06-27
modified: 2025-02-23
comment: Transgender people who belong to or are descended from the Chakma tribal group.
comment: Personas transgénero que pertenecen o son descendientes del grupo tribal chakma.
alternative label: Transgender Chakma people
alternative label: Personas chakma transgénero
broader: Chakma LGBTQ+ people
change note: Version 4.2.0
has top concept: LGBTQ+ people
in scheme: v3
preferred label: Personas transgénero chakma

Chakma asexual people
type: Concept
issued: 2022-06-27
modified: 2025-02-23
comment: Asexual people who belong to or are descended from the Chakma tribal group.
comment: Personas asexuales que pertenecen o son descendientes del grupo tribal chakma.
alternative label: Asexual Chakma people
alternative label: Personas chakma asexuales
broader: Chakma LGBTQ+ people
change note: Version 4.2.0
has top concept: LGBTQ+ people
in scheme: v3
preferred label: Personas asexuales chakma

Kho lesbians
type: Concept
issued: 2022-06-27
modified: 2025-02-23
comment: Lesbians who belong to or are descended from the people indigenous to the Chitral and Ghizer districts of modern-day Pakistan.
comment: Lesbianas que pertenecen a o son descendientes de las personas nativas de los distritos de Chitral y Ghizer del actual Pakistán.
alternative label: Chitrali lesbians
broader: Kho LGBTQ+ people
change note: Version 4.2.0
has top concept: LGBTQ+ people
in scheme: v3
preferred label: Lesbianas kho

Kho gay men
type: Concept
issued: 2022-06-27
modified: 2025-02-23
comment: Gay men who belong to or are descended from the people indigenous to the Chitral and Ghizer districts of modern-day Pakistan.
comment: Hombres gay que pertenecen a o son descendientes de las personas nativas de los distritos de Chitral y Ghizer del actual Pakistán.
alternative label: Chitrali gay men
alternative label: Gay Chitrali men
alternative label: Gay Kho men
broader: Kho LGBTQ+ people
change note: Version 4.2.0
has top concept: LGBTQ+ people
in scheme: v3
preferred label: Hombres gay kho

Kho bisexual people
type: Concept
issued: 2022-06-27
modified: 2025-02-23
comment: Bisexual individuals who belong to or are descended from the people indigenous to the Chitral and Ghizer districts of modern-day Pakistan.
comment: Personas bisexuales que pertenecen a o son descendientes de las personas nativas de los distritos de Chitral y Ghizer del actual Pakistán.
alternative label: Bisexual Chitrali people
alternative label: Bisexual Kho people
alternative label: Chitrali bisexual people
broader: Kho LGBTQ+ people
change note: Version 4.2.0
has top concept: LGBTQ+ people
in scheme: v3
preferred label: Personas bisexuales kho

Kho transgender people
type: Concept
issued: 2022-06-27
modified: 2025-02-23
comment: Transgender individuals who belong to or are descended from the people indigenous to the Chitral and Ghizer districts of modern-day Pakistan.
comment: Personas transgénero que pertenecen a o son descendientes de las personas nativas de los distritos de Chitral y Ghizer del actual Pakistán.
alternative label: Chitrali transgender people
alternative label: Transgender Chitrali people
alternative label: Transgender Kho people
broader: Kho LGBTQ+ people
change note: Version 4.2.0
has top concept: LGBTQ+ people
in scheme: v3
preferred label: Personas transgénero kho

Kho queer people
type: Concept
issued: 2022-06-27
modified: 2025-02-23
comment: Queer individuals who belong to or are descended from the people indigenous to the Chitral and Ghizer districts of modern-day Pakistan.
comment: Personas queer que pertenecen a o son descendientes de las personas nativas de los distritos de Chitral y Ghizer del actual Pakistán.
alternative label: Chitrali queer people
alternative label: Queer Chitrali people
alternative label: Queer Kho people
broader: Kho LGBTQ+ people
change note: Version 4.2.0
has top concept: LGBTQ+ people
in scheme: v3
preferred label: Personas queer kho

Kho intersex people
type: Concept
issued: 2022-06-27
modified: 2025-02-23
comment: Intersex individuals who belong to or are descended from the people indigenous to the Chitral and Ghizer districts of modern-day Pakistan.
comment: Personas intersexuales que pertenecen a o son descendientes de las personas nativas de los distritos de Chitral y Ghizer del actual Pakistán.
alternative label: Chitrali intersex people
alternative label: Intersex Chitrali people
alternative label: Intersex Kho people
alternative label: Personas intersex kho
broader: Kho LGBTQ+ people
change note: Version 4.2.0
has top concept: LGBTQ+ people
in scheme: v3
preferred label: Personas intersexuales kho

Kho asexual people
type: Concept
issued: 2022-06-27
modified: 2025-02-23
comment: Asexual individuals who belong to or are descended from the people indigenous to the Chitral and Ghizer districts of modern-day Pakistan.
comment: Personas asexuales que pertenecen a o son descendientes de las personas nativas de los distritos de Chitral y Ghizer del actual Pakistán.
alternative label: Asexual Chitrali people
alternative label: Asexual Kho people
alternative label: Chitrali asexual people
broader: Kho LGBTQ+ people
change note: Version 4.2.0
has top concept: LGBTQ+ people
in scheme: v3
preferred label: Personas asexuales kho

Maldivian lesbians
type: Concept
issued: 2022-06-27
modified: 2025-02-23
comment: Lesbians who belong to or are descended from the people native to the Maldives (including the island of Minicoy) and speak the Maldivian language.
comment: Lesbianas que pertenecen a o son descendientes de las personas nativas de las Maldivas (incluyendo la isla Minicoy) y que hablan el idioma maldivo.
alternative label: Dhivehin lesbians
alternative label: Lesbian Maldivians
alternative label: Personas maldivas lesbianas
broader: Maldivian LGBTQ+ people
change note: Version 4.2.0
has top concept: LGBTQ+ people
in scheme: v3
preferred label: Lesbianas maldivas

Maldivian gay men
type: Concept
issued: 2022-06-27
modified: 2025-02-23
comment: Gay men who belong to or are descended from the people native to the Maldives (including the island of Minicoy) and speak the Maldivian language.
comment: Hombres gay que pertenecen a o son descendientes de las personas nativas de las Maldivas (incluyendo la isla Minicoy) y que hablan el idioma maldivo.
alternative label: Dhivehin gay men
alternative label: Gay Dhivehin people
alternative label: Gay Maldivian men
alternative label: Gay Maldivians
alternative label: Hombres maldivos gay
broader: Maldivian LGBTQ+ people
change note: Version 4.2.0
has top concept: LGBTQ+ people
in scheme: v3
preferred label: Hombres gay maldivos

Maldivian bisexual people
type: Concept
issued: 2022-06-27
modified: 2025-02-23
comment: Bisexual individuals who belong to or are descended from the people native to the Maldives (including the island of Minicoy) and speak the Maldivian language.
comment: Personas bisexuales que pertenecen a o son descendientes de las personas nativas de las Maldivas (incluyendo la isla Minicoy) y que hablan el idioma maldivo.
alternative label: Bisexual Dhivehin people
alternative label: Bisexual Maldivian people
alternative label: Bisexual Maldivians
alternative label: Dhivehin bisexual people
alternative label: Personas maldivas bisexuales
broader: Maldivian LGBTQ+ people
change note: Version 4.2.0
has top concept: LGBTQ+ people
in scheme: v3
preferred label: Personas bisexuales maldivas

Maldivian queer people
type: Concept
issued: 2022-06-27
modified: 2025-02-23
comment: Queer individuals who belong to or are descended from the people native to the Maldives (including the island of Minicoy) and speak the Maldivian language.
comment: Personas queer que pertenecen a o son descendientes de las personas nativas de las Maldivas (incluyendo la isla Minicoy) y que hablan el idioma maldivo.
alternative label: Dhivehin queer people
alternative label: Queer Dhivehin people
alternative label: Queer Maldivian people
alternative label: Queer Maldivians
alternative label: Personas maldivas queer
broader: Maldivian LGBTQ+ people
change note: Version 4.2.0
has top concept: LGBTQ+ people
in scheme: v3
preferred label: Personas queer maldivas

Maldivian transgender people
type: Concept
issued: 2022-06-27
modified: 2025-02-23
comment: Transgender individuals who belong to or are descended from the people native to the Maldives (including the island of Minicoy) and speak the Maldivian language.
comment: Personas transgénero que pertenecen a o son descendientes de las personas nativas de las Maldivas (incluyendo la isla Minicoy) y que hablan el idioma maldivo.
alternative label: Dhivehin transgender people
alternative label: Transgender Dhivehin people
alternative label: Transgender Maldivian people
alternative label: Transgender Maldivians
alternative label: Personas maldivas transgénero
broader: Maldivian LGBTQ+ people
change note: Version 4.2.0
has top concept: LGBTQ+ people
in scheme: v3
preferred label: Personas transgénero maldivas

Maldivian intersex people
type: Concept
issued: 2022-06-27
modified: 2025-02-23
comment: Intersex individuals who belong to or are descended from the people native to the Maldives (including the island of Minicoy) and speak the Maldivian language.
comment: Personas intersexuales que pertenecen a o son descendientes de las personas nativas de las Maldivas (incluyendo la isla Minicoy) y que hablan el idioma maldivo.
alternative label: Dhivehin intersex people
alternative label: Intersex Dhivehin people
alternative label: Intersex Maldivians
alternative label: Personas intersex maldivas
broader: Maldivian LGBTQ+ people
change note: Version 4.2.0
has top concept: LGBTQ+ people
in scheme: v3
preferred label: Personas intersexuales maldivas

Maldivian asexual people
type: Concept
issued: 2022-06-27
modified: 2025-02-23
comment: Asexual individuals who belong to or are descended from the people native to the Maldives (including the island of Minicoy) and speak the Maldivian language.
comment: Personas asexuales que pertenecen a o son descendientes de las personas nativas de las Maldivas (incluyendo la isla Minicoy) y que hablan el idioma maldivo.
alternative label: Asexual Dhivehin people
alternative label: Asexual Maldivian people
alternative label: Asexual Maldivians
alternative label: Dhivehin asexual people
alternative label: Personas maldivas asexuales
broader: Maldivian LGBTQ+ people
change note: Version 4.2.0
has top concept: LGBTQ+ people
in scheme: v3
preferred label: Personas asexuales maldivas

Dogra lesbians
type: Concept
issued: 2022-06-27
modified: 2025-02-23
comment: Lesbians who are of the Dogra people of India and Pakistan and speak the Dogri language.
comment: Lesbianas que pertenecen al pueblo dogra de India y Pakistán, y hablan el idioma dogrí.
alternative label: Lesbian Dogras
broader: Dogra LGBTQ+ people
change note: Version 4.2.0
has top concept: LGBTQ+ people
in scheme: v3
preferred label: Lesbianas dogra

Dogra gay men
type: Concept
issued: 2022-06-27
modified: 2025-02-23
comment: Gay men who are of the Dogra people of India and Pakistan and speak the Dogri language.
comment: Hombres gay que pertenecen al pueblo dogra de India y Pakistán, y hablan el idioma dogrí.
alternative label: Gay Dogra men
alternative label: Gay Dogras
broader: Dogra LGBTQ+ people
change note: Version 4.2.0
has top concept: LGBTQ+ people
in scheme: v3
preferred label: Hombres gay dogra

Dogra bisexual people
type: Concept
issued: 2022-06-27
modified: 2025-02-23
comment: Bisexual people who are of the Dogra people of India and Pakistan and speak the Dogri language.
comment: Personas bisexuales que pertenecen al pueblo dogra de India y Pakistán, y hablan el idioma dogrí.
alternative label: Bisexual Dogra people
alternative label: Bisexual Dogras
broader: Dogra LGBTQ+ people
change note: Version 4.2.0
has top concept: LGBTQ+ people
in scheme: v3
preferred label: Personas bisexuales dogra

Dogra queer people
type: Concept
issued: 2022-06-27
modified: 2025-02-23
comment: Queer people who are of the Dogra people of India and Pakistan and speak the Dogri language.
comment: Personas queer que son de las personas dogra de India y Pakistán, y hablan el idioma dogrí.
alternative label: Queer Dogra people
alternative label: Queer Dogras
broader: Dogra LGBTQ+ people
change note: Version 4.2.0
has top concept: LGBTQ+ people
in scheme: v3
preferred label: Personas queer dogra

Dogra transgender people
type: Concept
issued: 2022-06-27
modified: 2025-02-23
comment: Transgender people who are of the Dogra people of India and Pakistan and speak the Dogri language.
comment: Personas transgénero que son de las personas dogra de India y Pakistán, y hablan el idioma dogrí.
alternative label: Transgender Dogra people
alternative label: Transgender Dogras
broader: Dogra LGBTQ+ people
change note: Version 4.2.0
has top concept: LGBTQ+ people
in scheme: v3
preferred label: Personas transgénero dogra

Dogra intersex people
type: Concept
issued: 2022-06-27
modified: 2025-02-23
comment: Intersex people who are of the Dogra people of India and Pakistan and speak the Dogri language.
comment: Personas intersexuales que pertenecen al pueblo dogra de India y Pakistán, y hablan el idioma dogrí.
alternative label: Intersex Dogra people
alternative label: Intersex Dogras
alternative label: Personas intersex dogra
broader: Dogra LGBTQ+ people
change note: Version 4.2.0
has top concept: LGBTQ+ people
in scheme: v3
preferred label: Personas intersexuales dogra

Dogra asexual people
type: Concept
issued: 2022-06-27
modified: 2025-02-23
comment: Asexual people who are of the Dogra people of India and Pakistan and speak the Dogri language.
comment: Personas asexuales que pertenecen al pueblo dogra de India y Pakistán, y hablan el idioma dogrí.
alternative label: Asexual Dogra people
alternative label: Asexual Dogras
broader: Dogra LGBTQ+ people
change note: Version 4.2.0
has top concept: LGBTQ+ people
in scheme: v3
preferred label: Personas asexuales dogra

Garhwali lesbians
type: Concept
issued: 2022-06-27
modified: 2025-02-23
comment: Lesbians who belong to or are descended from the people native to Garhwal in Uttarakhand and who speak Garhwali.
comment: Lesbianas que pertenecen a o son descendientes de las personas nativas de Garhwal en Uttarakhand y que hablan garhwali.
alternative label: Lesbian Garhwalis
broader: Garhwali LGBTQ+ people
change note: Version 4.2.0
has top concept: LGBTQ+ people
in scheme: v3
preferred label: Lesbianas garhwali

Garhwali gay men
type: Concept
issued: 2022-06-27
modified: 2025-02-23
comment: Gay men who belong to or are descended from the people native to Garhwal in Uttarakhand and who speak Garhwali.
comment: Hombres gay que pertenecen a o son descendientes de las personas nativas de Garhwal en Uttarakhand y que hablan garhwali.
alternative label: Gay Garhwali men
alternative label: Gay Garhwalis
broader: Garhwali LGBTQ+ people
change note: Version 4.2.0
has top concept: LGBTQ+ people
in scheme: v3
preferred label: Hombres gay garhwali

Garhwali bisexual people
type: Concept
issued: 2022-06-27
modified: 2025-02-23
comment: Bisexual people who belong to or are descended from the people native to Garhwal in Uttarakhand and who speak Garhwali.
comment: Personas bisexuales que pertenecen a o son descendientes de las personas nativas de Garhwal en Uttarakhand y que hablan garhwali.
alternative label: Bisexual Garhwali people
alternative label: Bisexual Garhwalis
alternative label: Bisexuales garhwali
broader: Garhwali LGBTQ+ people
change note: Version 4.2.0
has top concept: LGBTQ+ people
in scheme: v3
preferred label: Personas bisexuales garhwali

Garhwali queer people
type: Concept
issued: 2022-06-27
modified: 2025-02-23
comment: Queer people who belong to or are descended from the people native to Garhwal in Uttarakhand and who speak Garhwali.
comment: Personas queer que pertenecen a o son descendientes de las personas nativas de Garhwal en Uttarakhand y que hablan garhwali.
alternative label: Queer Garhwali people
alternative label: Queer Garhwalis
broader: Garhwali LGBTQ+ people
change note: Version 4.2.0
has top concept: LGBTQ+ people
in scheme: v3
preferred label: Personas queer garhwali

Garhwali transgender people
type: Concept
issued: 2022-06-27
modified: 2025-02-23
comment: Transgender people who belong to or are descended from the people native to Garhwal in Uttarakhand and who speak Garhwali.
comment: Personas transgénero que pertenecen a o son descendientes de las personas nativas de Garhwal en Uttarakhand y que hablan garhwali.
alternative label: Transgender Garhwali people
alternative label: Transgender Garhwalis
broader: Garhwali LGBTQ+ people
change note: Version 4.2.0
has top concept: LGBTQ+ people
in scheme: v3
preferred label: Personas transgénero garhwali

Garhwali intersex people
type: Concept
issued: 2022-06-27
modified: 2025-02-23
comment: Intersex people who belong to or are descended from those native to Garhwal in Uttarakhand and who speak Garhwali.
comment: Personas intersexuales que pertenecen a o son descendientes de las personas nativas de Garhwal en Uttarakhand y que hablan garhwali.
alternative label: Intersex Garhwali people
alternative label: Intersex Garhwalis
alternative label: Personas intersex garhwali
broader: Garhwali LGBTQ+ people
change note: Version 4.2.0
has top concept: LGBTQ+ people
in scheme: v3
preferred label: Personas intersexuales garhwali

Garhwali asexual people
type: Concept
issued: 2022-06-27
modified: 2025-02-23
comment: Asexual people who belong to or are descended from those native to Garhwal in Uttarakhand and who speak Garhwali.
comment: Personas asexuales que pertenecen o son descendientes de las personas nativas de Garhwal en Uttarakhand y hablan garhwali.
alternative label: Asexual Garhwali people
alternative label: Asexual Garhwalis
alternative label: Asexuales garhwali
alternative label: Personas garhwali asexuales
broader: Garhwali LGBTQ+ people
change note: Version 4.2.0
has top concept: LGBTQ+ people
in scheme: v3
preferred label: Personas asexuales garhwali

Fujoshi
type: Concept
issued: 2022-07-04
modified: 2025-02-23
comment: Japanese word that literally translates to "rotten girl" and is used to describe young women who enjoy media or fanworks focused on romantic or sexual relationships between men. Some fans self-identify as fujoshis, typically as a form of playful self-deprecation, but it can also be considered derogatory.
comment: Palabra japonesa que se traduce literalmente como "niña podrida" y se utiliza para describir a mujeres jóvenes que disfrutan de los medios o de las obras de fans centradas en las relaciones románticas o sexuales entre hombres. Algunos fanáticos se autoidentifican como fujoshis, generalmente como una forma de autodesprecio juguetón, pero también puede considerarse despectivo.
broader: Yaoi fandom
change note: Version 4.2.0
has top concept: Subcultures
in scheme: v3

Slash manips
type: Concept
issued: 2022-07-04
modified: 2025-02-23
comment: Fan-created photo manipulations or deepfakes depicting sexual or romantic relationships between characters from various media properties. Typically erotic or pornographic in nature. Historically used for male-male couples only, but is now used more broadly; includes femslash manips.
broader: Slash fanworks
change note: Version 4.2.0
has top concept: Subcultures
in scheme: v3

Parents of non-binary people
type: Concept
issued: 2022-07-19
modified: 2025-02-23
comment: Individuals who have one or more non-binary child.
comment: Personas actual como padres de una o más personas no binarias. Para padres que son non binarios, utilice el término "madres y padres no binarios"
alternative label: Non-binary people's parents
alternative label: Nonbinary people's parents
alternative label: Parents of nonbinary people
alternative label: Madres de personas no binarias
alternative label: Padres de personas no binarias
broader: Parents of LGBTQ+ people
change note: Version 4.2.0
has top concept: Family members
in scheme: v3
preferred label: Madres y padres de personas no binarias

Gujarati lesbians
type: Concept
issued: 2022-07-20
modified: 2025-02-23
comment: Lesbians who reside in or are descended from those indigenous to the Indian state of Gujarat.
comment: Lesbianas que residen en o son descendientes de las personas indígenas del estado indio de Gujarat.
alternative label: Lesbian Gujaratis
broader: Gujarati LGBTQ+ people
change note: Version 4.2.0
has top concept: LGBTQ+ people
in scheme: v3
preferred label: Lesbianas guyaratí

Gujarati gay men
type: Concept
issued: 2022-07-20
modified: 2025-02-23
comment: Gay men who reside in or are descended from those indigenous to the Indian state of Gujarat.
comment: Hombres gay que residen en o son descendientes de las personas indígenas del estado indio de Gujarat.
alternative label: Gay Gujarati men
alternative label: Gay Gujaratis
broader: Gujarati LGBTQ+ people
change note: Version 4.2.0
has top concept: LGBTQ+ people
in scheme: v3
preferred label: Hombres gay guyaratí

Gujarati bisexual people
type: Concept
issued: 2022-07-20
modified: 2025-02-23
comment: Bisexual people who reside in or are descended from those indigenous to the Indian state of Gujarat.
comment: Personas bisexuales que residen en o son descendientes de las personas indígenas del estado indio de Gujarat.
alternative label: Bisexual Gujarati people
alternative label: Bisexual Gujaratis
broader: Gujarati LGBTQ+ people
change note: Version 4.2.0
has top concept: LGBTQ+ people
in scheme: v3
preferred label: Personas bisexuales guyaratí

Gujarati transgender people
type: Concept
issued: 2022-07-20
modified: 2025-02-23
comment: Transgender people who reside in or are descended from those indigenous to the Indian state of Gujarat.
comment: Personas transgénero que residen en o son descendientes de las personas indígenas del estado indio de Gujarat.
alternative label: Trangender Gujaratis
alternative label: Transgender Gujarati people
broader: Gujarati LGBTQ+ people
change note: Version 4.2.0
has top concept: LGBTQ+ people
in scheme: v3
preferred label: Personas transgénero guyaratí

Gujarati asexual people
type: Concept
issued: 2022-07-20
modified: 2025-02-23
comment: Asexual people who reside in or are descended from those indigenous to the Indian state of Gujarat.
comment: Personas asexuales que residen en o son descendientes de las personas indígenas del estado indio de Gujarat.
alternative label: Asexual Gujarati people
alternative label: Asexual Gujaratis
broader: Gujarati LGBTQ+ people
change note: Version 4.2.0
has top concept: LGBTQ+ people
in scheme: v3
preferred label: Personas asexuales guyaratí

Gujarati queer people
type: Concept
issued: 2022-07-20
modified: 2025-02-23
comment: Queer people who reside in or are descended from those indigenous to the Indian state of Gujarat.
comment: Personas queer que residen en o son descendientes de las personas indígenas del estado indio de Gujarat.
alternative label: Queer Gujarati people
alternative label: Queer Gujaratis
broader: Gujarati LGBTQ+ people
change note: Version 4.2.0
has top concept: LGBTQ+ people
in scheme: v3
preferred label: Personas queer guyaratí

Gujarati intersex people
type: Concept
issued: 2022-07-20
modified: 2025-02-23
comment: Intersex people who reside in or are descended from those indigenous to the Indian state of Gujarat.
comment: Personas intersexuales que residen en o son descendientes de las personas indígenas del estado indio de Gujarat.
alternative label: Intersex Gujarati people
alternative label: Intersex Gujaratis
alternative label: Personas intersex guyaratí
broader: Gujarati LGBTQ+ people
change note: Version 4.2.0
has top concept: LGBTQ+ people
in scheme: v3
preferred label: Personas intersexuales guyaratí

Haryanvi lesbians
type: Concept
issued: 2022-07-28
modified: 2025-02-23
comment: Lesbians who are indigenous to or descended from those indigenous to what is now the Indian state of Haryana. This term can also apply to those who currently reside in Haryana.
comment: Lesbianas que son indígenas o son descendientes de personas indígenas de lo que hoy es el estado de Haryana. Este término también es aplicable a quienes actualmente residen en Haryana.
alternative label: Lesbian Haryanvis
broader: Haryanvi LGBTQ+ people
change note: Version 4.2.0
has top concept: LGBTQ+ people
in scheme: v3
preferred label: Lesbianas haryanvi

Haryanvi gay men
type: Concept
issued: 2022-07-28
modified: 2025-02-23
comment: Gay men who are indigenous to or descended from those indigenous to what is now the Indian state of Haryana. This term can also apply to those who currently reside in Haryana.
comment: Hombres gay que son indígenas o son descendientes de personas indígenas de lo que hoy es el estado de Haryana. Este término también es aplicable a quienes actualmente residen en Haryana.
alternative label: Gay Haryanvi men
alternative label: Gay Haryanvis
broader: Haryanvi LGBTQ+ people
change note: Version 4.2.0
has top concept: LGBTQ+ people
in scheme: v3
preferred label: Hombres haryanvi

Haryanvi bisexual people
type: Concept
issued: 2022-07-28
modified: 2025-02-23
comment: Bisexual people who are indigenous to or descended from those indigenous to what is now the Indian state of Haryana. This term can also apply to those who currently reside in Haryana.
comment: Personas bisexuales que son indígenas o son descendientes de personas indígenas de lo que hoy es el estado de Haryana. Este término también es aplicable a quienes actualmente residen en Haryana.
alternative label: Bisexual Haryanvi people
alternative label: Bisexual Haryanvis
broader: Haryanvi LGBTQ+ people
change note: Version 4.2.0
has top concept: LGBTQ+ people
in scheme: v3
preferred label: Personas bisexuales haryanvi

Haryanvi transgender people
type: Concept
issued: 2022-07-28
modified: 2025-02-23
comment: Transgender people who are indigenous to or descended from those indigenous to what is now the Indian state of Haryana. This term can also apply to those who currently reside in Haryana.
comment: Personas transgénero que son indígenas o son descendientes de personas indígenas de lo que hoy es el estado de Haryana. Este término también es aplicable a quienes actualmente residen en Haryana.
alternative label: Transgender Haryanvi people
alternative label: Transgender Haryanvis
broader: Haryanvi LGBTQ+ people
change note: Version 4.2.0
has top concept: LGBTQ+ people
in scheme: v3
preferred label: Personas transgénero haryanvi

Haryanvi queer people
type: Concept
issued: 2022-07-28
modified: 2025-02-23
comment: Queer people who are indigenous to or descended from those indigenous to what is now the Indian state of Haryana. This term can also apply to those who currently reside in Haryana.
comment: Personas queer que son indígenas o son descendientes de personas indígenas de lo que hoy es el estado de Haryana. Este término también es aplicable a quienes actualmente residen en Haryana.
alternative label: Queer Haryanvi people
alternative label: Queer Haryanvis
broader: Haryanvi LGBTQ+ people
change note: Version 4.2.0
has top concept: LGBTQ+ people
in scheme: v3
preferred label: Personas queer haryanvi

Haryanvi intersex people
type: Concept
issued: 2022-07-28
modified: 2025-02-23
comment: Intersex people who are indigenous to or descended from those indigenous to what is now the Indian state of Haryana. This term can also apply to those who currently reside in Haryana.
comment: Personas intersexuales que son indígenas o son descendientes de personas indígenas de lo que hoy es el estado de Haryana. Este término también es aplicable a quienes actualmente residen en Haryana.
alternative label: Intersex Haryanvi people
alternative label: Intersex Haryanvis
alternative label: Personas intersex haryanvi
broader: Haryanvi LGBTQ+ people
change note: Version 4.2.0
has top concept: LGBTQ+ people
in scheme: v3
preferred label: Personas intersexuales haryanvi

Haryanvi asexual people
type: Concept
issued: 2022-07-28
modified: 2025-02-23
comment: Asexual people who are indigenous to or descended from those indigenous to what is now the Indian state of Haryana. This term can also apply to those who currently reside in Haryana.
comment: Personas asexuales que son indígenas o son descendientes de personas indígenas de lo que hoy es el estado de Haryana. Este término también es aplicable a quienes actualmente residen en Haryana.
alternative label: Asexual Haryanvi people
alternative label: Asexual Haryanvis
broader: Haryanvi LGBTQ+ people
change note: Version 4.2.0
has top concept: LGBTQ+ people
in scheme: v3
preferred label: Personas asexuales haryanvi

Kalash lesbians
type: Concept
issued: 2022-07-28
modified: 2025-02-23
comment: Lesbians who belong to the indigenous Kalasha people and reside in the Chitral District of Khyber-Pakhtunkhwa province in Pakistan.
comment: Lesbianas que pertenecen al pueblo indígena kalasha y residen en el distrito Chitral de la provincia Khyber-Pakhtunkhwa en Pakistán.
alternative label: Lesbian Kalasha
broader: Kalash LGBTQ+ people
change note: Version 4.2.0
has top concept: LGBTQ+ people
in scheme: v3
preferred label: Lesbianas kalash

Kalash gay men
type: Concept
issued: 2022-07-28
modified: 2025-02-23
comment: Gay men who belong to the indigenous Kalasha people and reside in the Chitral District of Khyber-Pakhtunkhwa province in Pakistan.
comment: Hombres gay que pertenecen a el pueblo indígena Kalasha y residen en el distrito Chitral de la provincia Khyber-Pakhtunkhwa en Pakistan.
alternative label: Gay Kalash men
alternative label: Gay Kalasha men
broader: Kalash LGBTQ+ people
change note: Version 4.2.0
has top concept: LGBTQ+ people
in scheme: v3
preferred label: Hombres gay kalash

Kalash bisexual people
type: Concept
issued: 2022-07-28
modified: 2025-02-23
comment: Bisexual people who belong to the indigenous Kalasha people and reside in the Chitral District of Khyber-Pakhtunkhwa province in Pakistan.
comment: Personas bisexuales que pertenecen a el pueblo indígena Kalasha y residen en el distrito Chitral de la provincia Khyber-Pakhtunkhwa en Pakistan.
alternative label: Bisexual Kalash people
alternative label: Kalasha bisexual people
broader: Kalash LGBTQ+ people
change note: Version 4.2.0
has top concept: LGBTQ+ people
in scheme: v3
preferred label: Personas bisexuales kalash

Kalash transgender people
type: Concept
issued: 2022-07-28
modified: 2025-02-23
comment: Transgender people who belong to the indigenous Kalasha people and reside in the Chitral District of Khyber-Pakhtunkhwa province in Pakistan.
comment: Personas transgénero que pertenecen al pueblo indígena kalasha y residen en el distrito Chitral de la provincia Khyber-Pakhtunkhwa en Pakistán.
alternative label: Transgender Kalash people
alternative label: Transgender Kalasha
broader: Kalash LGBTQ+ people
change note: Version 4.2.0
has top concept: LGBTQ+ people
in scheme: v3
preferred label: Personas transgénero kalash

Kalash queer people
type: Concept
issued: 2022-07-28
modified: 2025-02-23
comment: Queer people who belong to the indigenous Kalasha people and reside in the Chitral District of Khyber-Pakhtunkhwa province in Pakistan.
comment: Personas queer que pertenecen al pueblo indígena kalasha y residen en el distrito Chitral de la provincia Khyber-Pakhtunkhwa en Pakistán.
alternative label: Queer Kalash people
alternative label: Queer Kalasha
broader: Kalash LGBTQ+ people
change note: Version 4.2.0
has top concept: LGBTQ+ people
in scheme: v3
preferred label: Personas queer kalash

Kalash intersex people
type: Concept
issued: 2022-07-28
modified: 2025-02-23
comment: Intersex people who belong to the indigenous Kalasha people and reside in the Chitral District of Khyber-Pakhtunkhwa province in Pakistan.
comment: Personas intersexuales que pertenecen a el pueblo indígena Kalasha y residen en el distrito Chitral de la provincia Khyber-Pakhtunkhwa en Pakistan.
alternative label: Intersex Kalash people
alternative label: Intersex Kalasha
alternative label: Personas intersex kalash
broader: Kalash LGBTQ+ people
change note: Version 4.2.0
has top concept: LGBTQ+ people
in scheme: v3
preferred label: Personas intersexuales kalash

Kalash asexual people
type: Concept
issued: 2022-07-28
modified: 2025-02-23
comment: Asexual people who belong to the indigenous Kalasha people and reside in the Chitral District of Khyber-Pakhtunkhwa province in Pakistan.
comment: Personas asexuales que pertenecen a el pueblo indígena Kalasha y residen en el distrito Chitral de la provincia Khyber-Pakhtunkhwa en Pakistan.
alternative label: Asexual Kalash people
alternative label: Asexual Kalasha
broader: Kalash LGBTQ+ people
change note: Version 4.2.0
has top concept: LGBTQ+ people
in scheme: v3
preferred label: Personas asexuales kalash

Lesbian history
type: Concept
issued: 2022-11-08
modified: 2025-02-23
comment: Past events or accounts of the past concerning lesbians, or people who might be perceived as lesbian if they were alive today.
comment: Eventos pasados ​​o relatos del pasado relacionados con lesbianas, o con personas que podrían ser percibidas como lesbianas si estuvieran vivas hoy.
alternative label: Historia lesbiana
broader: LGBTQ+ history
change note: Version 4.2.0
has top concept: LGBTQ+ history
in scheme: v3
preferred label: Historia lésbica

Gay history
type: Concept
issued: 2022-11-08
modified: 2025-02-23
comment: Past events or accounts of the past concerning gay men, or men who might be perceived as gay if they were alive today.
comment: Eventos pasados ​​o relatos del pasado relacionados con hombres gay, o hombres que podrían ser percibidos como gay si estuvieran vivos hoy.
broader: LGBTQ+ history
change note: Version 4.2.0
has top concept: LGBTQ+ history
in scheme: v3
preferred label: Historia gay

Bisexual history
type: Concept
issued: 2022-11-08
modified: 2025-02-23
comment: Past events or accounts of the past concerning bisexual people, or people who might be perceived as bisexual if they were alive today.
comment: Personas bisexuales con pérdida auditiva significativa o total que pueden o no considerarse S/sordas.
alternative label: Personas bisexuales con dificultades de audición
alternative label: Personas bisexuales con dificultades auditivas
broader: LGBTQ+ history
change note: Version 4.2.0
has top concept: LGBTQ+ history
in scheme: v3
preferred label: Personas bisexuales con problemas de audición

Transgender history
type: Concept
issued: 2022-11-08
modified: 2025-02-23
comment: Past events or accounts of the past concerning transgender people, or people who might be perceived as transgender if they were alive today.
comment: Eventos pasados ​​o relatos del pasado relacionados con personas transgénero, o personas que podrían ser percibidas como transgénero si estuvieran vivas hoy.
broader: LGBTQ+ history
change note: Version 4.2.0
has top concept: LGBTQ+ history
in scheme: v3
preferred label: Historia transgénero

Queer history
type: Concept
issued: 2022-11-08
modified: 2025-02-23
comment: Past events or accounts of the past concerning queer people, or people who might be perceived as queer if they were alive today.
comment: Eventos pasados ​​o relatos del pasado relacionados con personas queer, o personas que podrían ser percibidas como queer si estuvieran vivas hoy.
broader: LGBTQ+ history
change note: Version 4.2.0
has top concept: LGBTQ+ history
in scheme: v3
preferred label: Historia queer

Intersex history
type: Concept
issued: 2022-11-08
modified: 2025-02-23
comment: Past events or accounts of the past concerning intersex people, or people who might be perceived as intersex if they were alive today.
comment: Eventos pasados ​​o relatos del pasado relacionados con personas intersex, o personas que podrían ser percibidas como intersex si estuvieran vivas hoy.
broader: LGBTQ+ history
change note: Version 4.2.0
has top concept: LGBTQ+ history
in scheme: v3
preferred label: Historia intersex

Asexual history
type: Concept
issued: 2022-11-08
modified: 2025-02-23
comment: Past events or accounts of the past concerning asexual people, or people who might be perceived as asexual if they were alive today.
comment: Eventos pasados o relatos del pasado relacionados con personas asexuales o con personas que podrían ser percibidas como asexuales si estuvieran vivas hoy.
alternative label: Ace history
alternative label: Historia ace
broader: LGBTQ+ history
change note: Version 4.2.0
has top concept: LGBTQ+ history
in scheme: v3
preferred label: Historia asexual

Non-binary history
type: Concept
issued: 2022-11-08
modified: 2025-02-23
comment: Past events or accounts of the past concerning non-binary people, or people who might be perceived as non-binary if they were alive today.
comment: Eventos pasados ​​o relatos del pasado relacionados con personas no binarias, o personas que podrían ser percibidas como no binarias si estuvieran vivas hoy.
alternative label: Nonbinary history
alternative label: Historia no-binaria
broader: LGBTQ+ history
change note: Version 4.2.0
has top concept: LGBTQ+ history
in scheme: v3
preferred label: Historia no binaria

Mothers of queer people
type: Concept
issued: 2022-11-10
modified: 2025-02-23
comment: Individuals who assume the role of mother to a queer person or queer people; use only for individuals who self-identify as mothers.
comment: Personas que asumen el rol de madre de una persona o personas queer; utilícese únicamente para personas que se autoidentifiquen como madres.
alternative label: Moms of queer people
alternative label: Queer people's moms
alternative label: Queer people's mothers
alternative label: Mamás de personas queer
broader: Mothers of LGBTQ+ people
change note: Version 4.2.0
has top concept: Family members
in scheme: v3
preferred label: Madres de personas queer

Yan daudu
type: Concept
issued: 2022-11-10
modified: 2025-02-23
comment: Nigerian term that directly translates to "feminine men" but cannot be easily understood through Euro-American understandings of gender. The term has been used to describe people who may identify variously as feminine men, gay men, both male and female (or third gender), and/or trans. While some people self-identify as yan daudu, others consider the term a slur. Only use to describe individuals who self-identify as yan daudu.
comment: Término nigeriano que se traduce directamente como "hombres femeninos" pero que no puede entenderse fácilmente a través de la interpretación euroamericana del género. El término se ha utilizado para describir a personas que pueden identificarse de diversas formas como hombres femeninos, hombres gay, tanto masculinos como femeninos (o de tercer género) y/o trans. Mientras que algunas personas seautoidentifican como yan daudu, otras consideran el término un insulto. Utilícese únicamente para describir a personas que seautoidentifican como yan daudu.
broader: Non-Euro-American gender and sexual identities
change note: Version 4.2.0
has top concept: Gender
in scheme: v3

Piblings
type: Concept
issued: 2022-11-10
modified: 2025-02-23
comment: Gender-neutral term used to refer to the siblings or siblings-in-law of one's parents; an alternative to "aunts" or "uncles."
comment: Término de género neutro utilizado para referirse a los hermanos o cuñados de los padres; una alternativa a "tías" o "tíos".
alternative label: Tixs ||
broader: Family members
change note: Version 4.2.0
has top concept: Family members
in scheme: v3
preferred label: Tíes

Niblings
type: Concept
issued: 2022-11-10
modified: 2025-02-23
comment: Gender-neutral term used to refer to the children of one's sibling; an alternative to "nephews" or "nieces."
comment: Término de género neutro utilizado para referirse a los hijos de un hermano; una alternativa a "sobrinos" o "sobrinas".
alternative label: Sobrines
broader: Family members
change note: Version 4.2.0
has top concept: Family members
in scheme: v3
preferred label: Sobrinxs

Kashmiri lesbians
type: Concept
issued: 2022-11-15
modified: 2025-02-23
comment: Lesbians who live in or are descended from those native to the Kashmir Valley in the Indian subcontinent.
comment: Lesbianas que viven en o son descendientes de las personas nativas del valle de Cachemira en el subcontinente indio.
alternative label: Lesbian Kashmiris
broader: Kashmiri LGBTQ+ people
change note: Version 4.2.0
has top concept: LGBTQ+ people
in scheme: v3
preferred label: Lesbianas cachemires

Kashmiri gay men
type: Concept
issued: 2022-11-15
modified: 2025-02-23
comment: Gay men who live in or are descended from those native to the Kashmir Valley in the Indian subcontinent.
comment: Hombres gay que viven en o son descendientes de las personas nativas del valle de Cachemira en el subcontinente indio.
alternative label: Gay Kashmiri men
alternative label: Gay Kashmiris
broader: Kashmiri LGBTQ+ people
change note: Version 4.2.0
has top concept: LGBTQ+ people
in scheme: v3
preferred label: Hombres gay cachemires

Kashmiri bisexual people
type: Concept
issued: 2022-11-15
modified: 2025-02-23
comment: Bisexual people who live in or are descended from those native to the Kashmir Valley in the Indian subcontinent.
comment: Personas bisexuales que viven en o son descendientes de las personas nativas del valle de Cachemira en el subcontinente indio.
alternative label: Bisexual Kashmiri people
alternative label: Bisexual Kashmiris
broader: Kashmiri LGBTQ+ people
change note: Version 4.2.0
has top concept: LGBTQ+ people
in scheme: v3
preferred label: Personas bisexuales cachemires

Kashmiri queer people
type: Concept
issued: 2022-11-15
modified: 2025-02-23
comment: Queer people who live in or are descended from those native to the Kashmir Valley in the Indian subcontinent.
comment: Personas queer que viven en o son descendientes de las personas nativas del valle de Cachemira en el subcontinente indio.
alternative label: Queer Kashmiri people
alternative label: Queer Kashmiris
broader: Kashmiri LGBTQ+ people
change note: Version 4.2.0
has top concept: LGBTQ+ people
in scheme: v3
preferred label: Personas queer cachemires

Kashmiri transgender people
type: Concept
issued: 2022-11-15
modified: 2025-02-23
comment: Transgender people who live in or are descended from those native to the Kashmir Valley in the Indian subcontinent.
comment: Personas transgénero que viven en o son descendientes de las personas nativas del valle de Cachemira en el subcontinente indio.
alternative label: Transgender Kashmiri people
alternative label: Transgender Kashmiris
broader: Kashmiri LGBTQ+ people
change note: Version 4.2.0
has top concept: LGBTQ+ people
in scheme: v3
preferred label: Personas transgénero cachemires

Kashmiri intersex people
type: Concept
issued: 2022-11-15
modified: 2025-02-23
comment: Intersex people who live in or are descended from those native to the Kashmir Valley in the Indian subcontinent.
comment: Personas intersexuales que viven en o son descendientes de las personas nativas del valle de Cachemira en el subcontinente indio.
alternative label: Intersex Kashmiri people
alternative label: Intersex Kashmiris
alternative label: Personas intesex cachemires
broader: Kashmiri LGBTQ+ people
change note: Version 4.2.0
has top concept: LGBTQ+ people
in scheme: v3
preferred label: Personas intesexuales cachemires

Kashmiri asexual people
type: Concept
issued: 2022-11-15
modified: 2025-02-23
comment: Asexual people who live in or are descended from those native to the Kashmir Valley in the Indian subcontinent.
comment: Personas asexuales que viven en o son descendientes de las personas nativas del valle de Cachemira en el subcontinente indio.
alternative label: Asexual Kashmiri people
alternative label: Asexual Kashmiris
broader: Kashmiri LGBTQ+ people
change note: Version 4.2.0
has top concept: LGBTQ+ people
in scheme: v3
preferred label: Personas asexuales cachemires

Konkan lesbians
type: Concept
issued: 2022-11-15
modified: 2025-02-23
comment: Lesbians who are from or descended from those native to the Konkan region of the Indian subcontinent, and who speak any of the dialects of the Konkani language.
comment: Lesbianas que pertenecen a o son descendientes de las personas nativas de la región Konkan del subcontinente indio, y que hablan cualquiera de los dialectos de la lengua konkani.
alternative label: Lesbian Konkane
alternative label: Lesbian Konkani
broader: Konkan LGBTQ+ people
change note: Version 4.2.0
has top concept: LGBTQ+ people
in scheme: v3
preferred label: Lesbianas konkani

Konkan gay men
type: Concept
issued: 2022-11-15
modified: 2025-02-23
comment: Gay men who are from or descended from those native to the Konkan region of the Indian subcontinent, and who speak any of the dialects of the Konkani language.
comment: Hombres gay que pertenecen a o son descendientes de las personas nativas de la región Konkan del subcontinente indio, y que hablan cualquiera de los dialectos de la lengua konkani.
alternative label: Gay Konkani men
alternative label: Gay Konkano men
broader: Konkan LGBTQ+ people
change note: Version 4.2.0
has top concept: LGBTQ+ people
in scheme: v3
preferred label: Hombres gay konkani

Konkan bisexual people
type: Concept
issued: 2022-11-15
modified: 2025-02-23
comment: Bisexual people who are from or descended from those native to the Konkan region of the Indian subcontinent, and who speak any of the dialects of the Konkani language.
comment: Personas bisexuales que pertenecen a o son descendientes de las personas nativas de la región Konkan del subcontinente indio, y que hablan cualquiera de los dialectos de la lengua konkani.
alternative label: Bisexual Konkani
broader: Konkan LGBTQ+ people
change note: Version 4.2.0
has top concept: LGBTQ+ people
in scheme: v3
preferred label: Personas bisexuales konkani

Konkan queer people
type: Concept
issued: 2022-11-15
modified: 2025-02-23
comment: Queer people who are from or descended from those native to the Konkan region of the Indian subcontinent, and who speak any of the dialects of the Konkani language.
comment: Personas queer que pertenecen a o son descendientes de las personas nativas de la región Konkan del subcontinente indio, y que hablan cualquiera de los dialectos de la lengua konkani.
alternative label: Queer Konkani
broader: Konkan LGBTQ+ people
change note: Version 4.2.0
has top concept: LGBTQ+ people
in scheme: v3
preferred label: Personas queer konkani

Konkan transgender people
type: Concept
issued: 2022-11-15
modified: 2025-02-23
comment: Transgender people who are from or descended from those native to the Konkan region of the Indian subcontinent, and who speak any of the dialects of the Konkani language.
comment: Personas transgénero que pertenecen a o son descendientes de las personas nativas de la región Konkan del subcontinente indio, y que hablan cualquiera de los dialectos de la lengua konkani.
alternative label: Transgender Konkani
broader: Konkan LGBTQ+ people
change note: Version 4.2.0
has top concept: LGBTQ+ people
in scheme: v3
preferred label: Personas transgénero konkani

Konkan intersex people
type: Concept
issued: 2022-11-15
modified: 2025-02-23
comment: Intersex people who are from or descended from those native to the Konkan region of the Indian subcontinent, and who speak any of the dialects of the Konkani language.
comment: Personas intersexuales que pertenecen a o son descendientes de las personas nativas de la región Konkan del subcontinente indio, y que hablan cualquiera de los dialectos de la lengua konkani.
alternative label: Intersex Konkani
alternative label: Personas intersex konkani
broader: Konkan LGBTQ+ people
change note: Version 4.2.0
has top concept: LGBTQ+ people
in scheme: v3
preferred label: Personas intersexuales konkani

Konkan asexual people
type: Concept
issued: 2022-11-15
modified: 2025-02-23
comment: Asexual people who are from or descended from those native to the Konkan region of the Indian subcontinent, and who speak any of the dialects of the Konkani language.
comment: Personas asexuales que pertenecen a o son descendientes de las personas nativas de la región Konkan del subcontinente indio, y que hablan cualquiera de los dialectos de la lengua konkani.
alternative label: Asexual Konkani
broader: Konkan LGBTQ+ people
change note: Version 4.2.0
has top concept: LGBTQ+ people
in scheme: v3
preferred label: Personas asexuales konkani

Kumaoni lesbians
type: Concept
issued: 2022-11-15
modified: 2025-02-23
comment: Lesbians who live mostly in Kumaon region in the Indian Himalayas. They might also speak the Kumaoni language as their first language.
comment: Lesbianas que viven principalmente en la región de Kumaon, en el Himalaya indio. También pueden hablar la lengua kumaoni como su primera lengua.
alternative label: Kumain lesbians
alternative label: Kumaiye lesbians
broader: Kumaoni LGBTQ+ people
change note: Version 4.2.0
has top concept: LGBTQ+ people
in scheme: v3
preferred label: Lesbianas kumaoni

Kumaoni gay men
type: Concept
issued: 2022-11-15
modified: 2025-02-23
comment: Gay men who live mostly in Kumaon region in the Indian Himalayas. They might also speak the Kumaoni language as their first language.
comment: Hombres gay que viven principalmente en la región de Kumaon, en el Himalaya indio. También pueden hablar la lengua kumaoni como su primera lengua.
alternative label: Kumain gay men
alternative label: Kumaiye gay men
broader: Kumaoni LGBTQ+ people
change note: Version 4.2.0
has top concept: LGBTQ+ people
in scheme: v3
preferred label: Hombres gay kumaoni

Kumaoni bisexual people
type: Concept
issued: 2022-11-15
modified: 2025-02-23
comment: Bisexual people who live mostly in Kumaon region in the Indian Himalayas. They might also speak the Kumaoni language as their first language.
comment: Personas bisexuales que viven principalmente en la región de Kumaon, en el Himalaya indio. También pueden hablar la lengua kumaoni como su primera lengua.
alternative label: Kumain bisexual people
alternative label: Kumaiye bisexual people
broader: Kumaoni LGBTQ+ people
change note: Version 4.2.0
has top concept: LGBTQ+ people
in scheme: v3
preferred label: Personas bisexuales kumaoni

Kumaoni transgender people
type: Concept
issued: 2022-11-15
modified: 2025-02-23
comment: Transgender people who live mostly in Kumaon region in the Indian Himalayas. They might also speak the Kumaoni language as their first language.
comment: Personas transgénero que viven principalmente en la región de Kumaon, en el Himalaya indio. También pueden hablar la lengua kumaoni como su primera lengua.
alternative label: Kumain transgender people
alternative label: Kumaiye transgender people
broader: Kumaoni LGBTQ+ people
change note: Version 4.2.0
has top concept: LGBTQ+ people
in scheme: v3
preferred label: Personas transgénero kumaoni

Kumaoni queer people
type: Concept
issued: 2022-11-15
modified: 2025-02-23
comment: Queer people who live mostly in Kumaon region in the Indian Himalayas. They might also speak the Kumaoni language as their first language.
comment: Personas queer que viven principalmente en la región de Kumaon, en el Himalaya indio. También pueden hablar la lengua kumaoni como su primera lengua.
alternative label: Kumain queer people
alternative label: Kumaiye queer people
broader: Kumaoni LGBTQ+ people
change note: Version 4.2.0
has top concept: LGBTQ+ people
in scheme: v3
preferred label: Personas queer kumaoni

Kumaoni intersex people
type: Concept
issued: 2022-11-15
modified: 2025-02-23
comment: Intersex people who live mostly in Kumaon region in the Indian Himalayas. They might also speak the Kumaoni language as their first language.
comment: Personas intersexuales que viven principalmente en la región de Kumaon, en el Himalaya indio. También pueden hablar la lengua kumaoni como su primera lengua.
alternative label: Kumain intersex people
alternative label: Kumaiye intersex people
alternative label: Personas intersex kumaoni
broader: Kumaoni LGBTQ+ people
change note: Version 4.2.0
has top concept: LGBTQ+ people
in scheme: v3
preferred label: Personas intersexuales kumaoni

Kumaoni asexual people
type: Concept
issued: 2022-11-15
modified: 2025-02-23
comment: Asexual people who live mostly in Kumaon region in the Indian Himalayas. They might also speak the Kumaoni language as their first language.
comment: Personas asexuales que viven principalmente en la región de Kumaon, en el Himalaya indio. También pueden hablar la lengua kumaoni como su primera lengua.
alternative label: Kumain asexual people
alternative label: Kumaiye asexual people
broader: Kumaoni LGBTQ+ people
change note: Version 4.2.0
has top concept: LGBTQ+ people
in scheme: v3
preferred label: Personas asexuales kumaoni

Kutchi lesbians
type: Concept
issued: 2022-11-15
modified: 2025-02-23
comment: Lesbians who are from or are descended from those native to the the Kutch district of the Indian state of Gujarat and the Sindh region of Pakistan.
comment: Lesbianas que pertenecen a o son descendientes de las personas nativas del distrito Konkan del estado indio de Guyarat y la región Sind de Pakistán.
alternative label: Lesbian Kutchi people
broader: Kutchi LGBTQ+ people
change note: Version 4.2.0
has top concept: LGBTQ+ people
in scheme: v3
preferred label: Lesbianas kutchi

Kutchi gay men
type: Concept
issued: 2022-11-15
modified: 2025-02-23
comment: Gay men who are from or are descended from those native to the the Kutch district of the Indian state of Gujarat and the Sindh region of Pakistan.
comment: Hombres gay que pertenecen a o son descendientes de las personas nativas del distrito Konkan del estado indio de Guyarat y la región Sind de Pakistán.
alternative label: Gay Kutchi men
broader: Kutchi LGBTQ+ people
change note: Version 4.2.0
has top concept: LGBTQ+ people
in scheme: v3
preferred label: Hombres gay kutchi

Kutchi bisexual people
type: Concept
issued: 2022-11-15
modified: 2025-02-23
comment: Bisexual people who are from or are descended from those native to the the Kutch district of the Indian state of Gujarat and the Sindh region of Pakistan.
comment: Personas bisexuales que pertenecen a o son descendientes de las personas nativas del distrito Konkan del estado indio de Guyarat y la región Sind de Pakistán.
alternative label: Bisexual Kutchi people
broader: Kutchi LGBTQ+ people
change note: Version 4.2.0
has top concept: LGBTQ+ people
in scheme: v3
preferred label: Personas bisexuales kutchi

Kutchi queer people
type: Concept
issued: 2022-11-15
modified: 2025-02-23
comment: Queer people who are from or are descended from those native to the the Kutch district of the Indian state of Gujarat and the Sindh region of Pakistan.
comment: Personas queer que pertenecen a o son descendientes de las personas nativas del distrito Konkan del estado indio de Guyarat y la región Sind de Pakistán.
alternative label: Queer Kutchi people
broader: Kutchi LGBTQ+ people
change note: Version 4.2.0
has top concept: LGBTQ+ people
in scheme: v3
preferred label: Personas queer kutchi

Kutchi intersex people
type: Concept
issued: 2022-11-15
modified: 2025-02-23
comment: Intersex people who are from or are descended from those native to the the Kutch district of the Indian state of Gujarat and the Sindh region of Pakistan.
comment: Personas intersexuales que pertenecen a o son descendientes de las personas nativas del distrito Konkan del estado indio de Guyarat y la región Sind de Pakistán.
alternative label: Intersex Kutchi people
alternative label: Personas intersex kutchi
broader: Kutchi LGBTQ+ people
change note: Version 4.2.0
has top concept: LGBTQ+ people
in scheme: v3
preferred label: Personas intersexuales kutchi

Kutchi transgender people
type: Concept
issued: 2022-11-15
modified: 2025-02-23
comment: Transgender people who are from or are descended from those native to the the Kutch district of the Indian state of Gujarat and the Sindh region of Pakistan.
comment: Personas transgénero que pertenecen a o son descendientes de las personas nativas del distrito Konkan del estado indio de Guyarat y la región Sind de Pakistán.
alternative label: Transgender Kutchi people
broader: Kutchi LGBTQ+ people
change note: Version 4.2.0
has top concept: LGBTQ+ people
in scheme: v3
preferred label: Personas transgénero kutchi

Kutchi asexual people
type: Concept
issued: 2022-11-15
modified: 2025-02-23
comment: Asexual people who are from or are descended from those native to the Kutch district of the Indian state of Gujarat and the Sindh region of Pakistan.
comment: Personas asexuales que pertenecen a o son descendientes de las personas nativas del distrito Konkan del estado indio de Guyarat y la región Sind de Pakistán.
alternative label: Asexual Kutchi people
broader: Kutchi LGBTQ+ people
change note: Version 4.2.0
has top concept: LGBTQ+ people
in scheme: v3
preferred label: Personas asexuales kutchi

Two-Spirit history
type: Concept
issued: 2022-11-15
modified: 2025-02-23
comment: Past events or accounts of the past concerning Two-Spirit people, or people who might be perceived as Two-Spirit if they were alive today.
comment: Eventos pasados o relatos del pasado relacionados con personas dos espíritus o con personas que podrían ser percibidas como dos espíritus si estuvieran vivas hoy.
alternative label: 2S history
alternative label: Two Spirit history
alternative label: Two Spirited history
alternative label: Two-Spirited history
broader: LGBTQ+ history
change note: Version 4.2.0
has top concept: LGBTQ+ history
in scheme: v3
preferred label: Historia dos espíritus

LGBTQ+ people of the African diaspora
type: Concept
issued: 2022-11-15
modified: 2025-04-24
comment: LGBTQ+ people of native African ancestry living outside of the continent of Africa. While this term is commonly used to describe descendants of Africans who were enslaved and forcibly transported to the Americas via the transatlantic slave trade between the 16th and 19th centuries, it can also be used to refer to descendants of Africans who voluntarily immigrated to other parts of the world. Do not conflate with Black LGBTQ+ people or African American LGBTQ+ people. Follow the individual's preference whenever possible.
comment: Personas LGBTQ+ de ascendencia africana nativa que viven fuera del continente africano. Si bien este término se utiliza comúnmente para describir a quienes descienden de personas africanas que fueron esclavizadas y forzosamente transportadas a América a través de la trata transatlántica de esclavos entre los siglos XVI y XIX, también se puede utilizar para referirse quienes descienden de personas africanas que emigraron voluntariamente a otras partes del mundo. No lo combine ni confunda con personas negras LGBTQ+ o personas afroamericanas LGBTQ+. Siga las preferencias de la persona siempre que sea posible.
change note: Version 4.2.0
in scheme: v3
preferred label: Personas LGBTQ+ de la diáspora africana

African American asexual people
type: Concept
issued: 2022-12-13
modified: 2025-02-23
comment: Asexual people of African descent born in the United States or asexual people born in African countries who live in or have a strong connection to the United States. Use for individuals who self-identity as African American. Follow the individual’s preference for African American or Black whenever possible.
comment: Personas asexuales de ascendencia africana nacidas en los Estados Unidos o personas asexuales nacidas en países africanos que viven o tienen una conexión fuerte con los Estados Unidos. Utilícese para personas que se autoidentifiquen como afroamericanas.
alternative label: African American ace people
alternative label: Asexual African American people
alternative label: Asexual African Americans
alternative label: Afroamericanos asexuales
alternative label: Afroamericanos ace
alternative label: Afroamericanas asexuales
alternative label: Afroamericanas ace
alternative label: Personas ace afroamericanas
alternative label: Personas afroamericanas asexuales
broader: African American LGBTQ+ people
change note: Version 4.2.0
has top concept: LGBTQ+ people
in scheme: v3
preferred label: Personas asexuales afroamericanas

Adopted LGBTQ+ people
type: Concept
issued: 2022-12-13
modified: 2025-02-23
comment: LGBTQ+ people who were adopted, whether or not by LGBTQ+ parents.
comment: Personas LGBTQ+ que fueron adoptadas, ya sea o no por padres LGBTQ+
alternative label: Adopted people (LGBTQ)
alternative label: LGBTQ+ adopted people
alternative label: Personas adoptadas (LGBTQ)
broader: LGBTQ+ people
change note: Version 4.2.0
has top concept: LGBTQ+ people
in scheme: v3
preferred label: Personas LGBTQ+ adoptadas

Bisexual fathers
type: Concept
issued: 2022-12-13
modified: 2025-02-23
comment: Bisexual people who are fathers.
comment: Obras escritas que incluyan elementos mágicos o fantásticos; utilícese en referencia a ficción fantástica centrada en personajes o temas bisexuales.
alternative label: Bisexual dads
broader: LGBTQ+ fathers
change note: Version 4.2.0
has top concept: Family members
in scheme: v3
preferred label: Ficción fantástica bisexual

Gay fathers
type: Concept
issued: 2022-12-13
modified: 2025-02-23
comment: Gay men who are fathers.
comment: Hombres gay que son padres.
alternative label: Gay dads
alternative label: Papás gay
broader: LGBTQ+ fathers
change note: Version 4.2.0
has top concept: Family members
in scheme: v3
preferred label: Padres gay

Lesbian fathers
type: Concept
issued: 2022-12-13
modified: 2025-02-23
comment: Lesbians who are fathers. This includes non-binary people who have children and identify as fathers, as well as trans women who had children before transitioning and still identify as fathers to those children. Do not use to describe lesbian parents unless they self-identify as fathers.
comment: Lesbianas que son padres. Esto incluye a las personas no binarias que tienen hijos y se autoidentifican como padres, así como a las mujeres trans que tuvieron hijos antes de transicionar y aún se autoidentifican como padres de esos niños. No debe utilizarse para describir a padres lesbianos a menos que se autoidentifiquen como padres.
alternative label: Lesbian dads
alternative label: Papás lesbianos
broader: LGBTQ+ fathers
change note: Version 4.2.0
has top concept: Family members
in scheme: v3
preferred label: Padres lesbianos

Queer fathers
type: Concept
issued: 2022-12-13
modified: 2025-02-23
comment: Queer people who are fathers.
comment: Personas queer que son padres.
alternative label: Queer dads
alternative label: Papás queer
broader: LGBTQ+ fathers
change note: Version 4.2.0
has top concept: Family members
in scheme: v3
preferred label: Padres queer

Bisexual mothers
type: Concept
issued: 2022-12-13
modified: 2025-02-23
comment: Bisexual people who are mothers.
comment: Mujeres bisexuales que forman parte de la escena BDSM y asumen el rol de ama en las relaciones sexuales con una dinámica ama/esclava.
alternative label: Bisexual moms
broader: LGBTQ+ mothers
change note: Version 4.2.0
has top concept: Family members
in scheme: v3
preferred label: Amas bisexuales

Gay mothers
type: Concept
issued: 2022-12-13
modified: 2025-02-23
comment: Gay men who are mothers. This includes trans men who had children before transitioning and still identify as mothers to those children. Do not use to describe gay parents unless they self-identify as mothers.
comment: Hombres gay que tienen condiciones de salud a largo plazo que requieren atención médica continua y/o impactan o limitan significativamente la vida diaria; algunas, pero no todas, las personas con enfermedades crónicas se consideran discapacitadas.
alternative label: Gay moms
alternative label: Enfermos crónicos gay
alternative label: Hombres enfermos crónicos gay
broader: LGBTQ+ mothers
change note: Version 4.2.0
has top concept: Family members
in scheme: v3
preferred label: Hombres gay con enfermedades crónicas

Lesbian mothers
type: Concept
issued: 2022-12-13
modified: 2025-02-23
comment: Lesbians who are mothers.
comment: Lesbianas que son madres.
alternative label: Lesbian moms
alternative label: Mamás lesbianas
broader: LGBTQ+ mothers
change note: Version 4.2.0
has top concept: Family members
in scheme: v3
preferred label: Madres lesbianas

Queer mothers
type: Concept
issued: 2022-12-13
modified: 2025-02-23
comment: Queer people who are mothers.
comment: Personas queer que son madres.
alternative label: Queer moms
alternative label: Mamás queer
broader: LGBTQ+ mothers
change note: Version 4.2.0
has top concept: Family members
in scheme: v3
preferred label: Madres queer

Siblings of LGBTQ+ people
type: Concept
issued: 2022-12-13
modified: 2025-02-23
comment: People who share a sibling relationship with one or more LGBTQ+ person. For siblings who are themselves LGBTQ+, use the term "LGBTQ+ siblings."
comment: Personas que comparten una relación de hermanos con una o más personas LGBTQ+. Para hermanos que son LGBTQ+, utilice el término "hermanos LGBTQ+".
alternative label: Hermanas de personas LGBTQ+
alternative label: Hermanxs de personas LGBTQ+
broader: Siblings
change note: Version 4.2.0
has top concept: Family members
in scheme: v3
preferred label: Hermanos de personas LGBTQ+

Grandchildren of LGBTQ+ people
type: Concept
issued: 2022-12-13
modified: 2025-02-23
comment: People who have one or more LGBTQ+ grandparent. For grandchildren who are themselves LGBTQ+, use the term "LGBTQ+ grandchildren."
comment: Personas que tienen uno o más abuelos LGBTQ+. Para los nietos que son LGBTQ+, utilice el término "nietos LGBTQ+".
broader: Grandchildren
change note: Version 4.2.0
has top concept: Family members
in scheme: v3
preferred label: Nietos de personas LGBTQ+

Grandparents of LGBTQ+ people
type: Concept
issued: 2022-12-13
modified: 2025-02-23
comment: People who have one or more LGBTQ+ grandchild. For grandparents who are themselves LGBTQ+, use the term "LGBTQ+ grandparents."
comment: Personas que tienen uno o más nietos LGBTQ+. Para los abuelos que son LGBTQ+, utilice el término "abuelos LGBTQ+".
broader: Grandparents
change note: Version 4.2.0
has top concept: Family members
in scheme: v3
preferred label: Abuelos de personas LGBTQ+

Family members of LGBTQ+ people
type: Concept
issued: 2022-12-13
modified: 2025-02-23
comment: People who have one or more LGBTQ+ family member. For family members who are themselves LGBTQ+, use the term "LGBTQ+ family members."
comment: Personas que tienen uno o más familiares LGBTQ+. Para miembros de la familia que son LGBTQ+, utilícese el término "miembros LGBTQ+ de la familia".
alternative label: Familares de personas LGBTQ+
broader: Family members
change note: Version 4.2.0
has top concept: Family members
in scheme: v3
preferred label: Miembros de familia de personas LGBTQ+

Lesbian partners
type: Concept
issued: 2022-12-13
modified: 2025-02-23
comment: Lesbians who are the romantic, sexual, or play partners of another person or people.
comment: Lesbianas que son compañeras románticas, sexuales o de juego de otra persona o personas.
broader: LGBTQ+ partners
change note: Version 4.2.0
has top concept: LGBTQ+ families
in scheme: v3
preferred label: Parejas lesbianas

Gay partners
type: Concept
issued: 2022-12-13
modified: 2025-02-23
comment: Gay men who are the romantic, sexual, or play partners of another person or people.
comment: Hombres gay que son padres.
alternative label: Papás gay
broader: LGBTQ+ partners
change note: Version 4.2.0
has top concept: LGBTQ+ families
in scheme: v3
preferred label: Padres gay

Bisexual partners
type: Concept
issued: 2022-12-13
modified: 2025-02-23
comment: Bisexual people who are the romantic, sexual, or play partners of another person or people.
comment: Personas bisexuales que son miembros de religiones politeístas u otras religiones fuera de la cultura dominante que típicamente incorporan el culto a la naturaleza y/o lo sagrado femenino, como la Wicca, el druidismo, el paganismo, etc. Utilícese para describir a las personas bisexuales que se autoidentifican como paganas.
broader: LGBTQ+ partners
change note: Version 4.2.0
has top concept: LGBTQ+ families
in scheme: v3
preferred label: Paganos bisexuales

Transgender partners
type: Concept
issued: 2022-12-13
modified: 2025-02-23
comment: Transgender people who are the romantic, sexual, or play partners of another person or people.
comment: Personas transgénero que son parejas románticas, sexuales o de juego de otra persona o personas.
broader: LGBTQ+ partners
change note: Version 4.2.0
has top concept: LGBTQ+ families
in scheme: v3
preferred label: Parejas transgénero

Queer partners
type: Concept
issued: 2022-12-13
modified: 2025-02-23
comment: Queer people who are the romantic, sexual, or play partners of another person or people.
comment: Personas queer que son parejas románticas, sexuales o de juego de otra persona o personas.
broader: LGBTQ+ partners
change note: Version 4.2.0
has top concept: LGBTQ+ families
in scheme: v3
preferred label: Parejas queer

Police raids on LGBTQ+ meeting places
type: Concept
issued: 2023-01-13
modified: 2025-02-23
comment: Unexpected and unannounced entry into and searches of meeting places owned or frequented by LGBTQ+ people, including individuals' residences, businesses, and other institutions, by law enforcement officers with the aim of using surprise to seize evidence or arrest suspects. Police raids may be undertaken legally using a search warrant or through exigent circumstances, such as probable cause, though the latter is highly subjective and civilians often have little resources to appeal illegal raids.
comment: Redadas policiales en lugares de encuentro afiliados o relacionados con comunidades o identidades LGBTQ+, ya sea la residencia de una persona, un negocio u otra institución.
broader: Police raids on LGBTQ+-related establishments
change note: Version 4.2.0
has top concept: Harassment
in scheme: v3
preferred label: Redadas policiales en espacios de encuentro LGBTQ+

Criminalization of cross-dressing
type: Concept
issued: 2023-01-13
modified: 2025-02-23
comment: Criminalization of any expression of gender considered to be cross-dressing in a given sociocultural context.
comment: La criminalización de cualquier expresión de género considerada transformismo en un determinado contexto sociocultural.
broader: Criminalization of gender non-conformity
change note: Version 4.2.0
has top concept: Law
in scheme: v3
preferred label: Criminalización del transformismo

Shootings of LGBTQ+ people by police
type: Concept
issued: 2023-01-13
modified: 2025-02-23
comment: Shooting of LGBTQ+ individuals or individuals perceived as being LGBTQ+ by police officers.
comment: Disparos contra personas LGBTQ+ o personas percibidas como LGBTQ+ por agentes de la policía.
alternative label: Tiroteos contra personas LGBTQ+ por parte de la policía
broader: Police violence toward LGBTQ+ people
change note: Version 4.2.0
has top concept: Anti-LGBTQ+ violence
in scheme: v3
preferred label: Disparos contra personas LGBTQ+ por parte de la policía

Aromantic comics
type: Concept
issued: 2023-01-14
modified: 2025-02-23
comment: Works consisting of sequential images often accompanied by text; use in reference to comics focusing on aromantic characters or themes.
comment: Obras que consisten de imágenes secuenciales, a menudo acompañadas de texto; utilícese en referencia a cómics que se centran en personajes o temas arrománticos.
alternative label: Historietas arrománticas
broader: LGBTQ+ comics
change note: Version 4.2.0
has top concept: Subcultures
in scheme: v3
preferred label: Cómics arrománticos

Intersex comics
type: Concept
issued: 2023-01-17
modified: 2025-02-23
comment: Works consisting of sequential images often accompanied by text; use in reference to comics focusing on intersexual characters or themes.
comment: Obras que consisten en imágenes secuenciales, a menudo acompañadas de texto; utilícese en referencia a cómics que se centran en personajes o temas intersex.
alternative label: Historietas intersex
broader: LGBTQ+ comics
change note: Version 4.2.0
has top concept: Subcultures
in scheme: v3
preferred label: Cómics intersex

Intersex poetry
type: Concept
issued: 2023-01-17
modified: 2025-02-23
comment: Literary work, typically written in verse, that focuses on intersex characters, themes, or identity.
comment: Obras literarias, típicamente escritas en verso, que se centran en personajes, temas o identidades intersex.
broader: LGBTQ+ poetry
change note: Version 4.2.0
has top concept: Subcultures
in scheme: v3
preferred label: Poesía intersex

Asexual comics
type: Concept
issued: 2023-01-17
modified: 2025-02-23
comment: Works consisting of sequential images often accompanied by text; use in reference to comics focusing on asexual characters or themes.
comment: Obras que consisten de imágenes secuenciales, a menudo acompañadas de texto; utilícese en referencia a los cómics centrados en personajes o temas asexuales.
alternative label: Historietas asexuales
broader: LGBTQ+ comics
change note: Version 4.2.0
has top concept: Subcultures
in scheme: v3
preferred label: Cómics asexuales

Demisexual comics
type: Concept
issued: 2023-01-17
modified: 2025-02-23
comment: Works consisting of sequential images often accompanied by text; use in reference to comics focusing on demisexual characters or themes.
comment: Obras que consisten en imágenes secuenciales, a menudo acompañadas de texto; utilícese en referencia a cómics que se centran en personajes o temas demisexuales.
alternative label: Historietas demisexuales
broader: LGBTQ+ comics
change note: Version 4.2.0
has top concept: Subcultures
in scheme: v3
preferred label: Cómics demisexuales

Asexual erotic literature
type: Concept
issued: 2023-01-17
modified: 2025-02-23
comment: Literary works that have erotic or sexual elements; use in reference to erotic literature focusing on asexual characters or themes.
comment: Obras literarias que tienen elementos eróticos o sexuales; utilícese en referencia a la literatura erótica centrada en personajes o temas asexuales.
broader: LGBTQ+ erotic literature
change note: Version 4.2.0
has top concept: Erotica
in scheme: v3
preferred label: Literatura erótica asexual

Intersex erotic literature
type: Concept
issued: 2023-01-17
modified: 2025-02-23
comment: Literary works that have erotic or sexual elements; use in reference to erotic literature focusing on intersex characters or themes.
comment: Obras literarias que tengan elementos eróticos o sexuales; utilícese en referencia a la literatura erótica que se centra en personajes o temas intersex.
broader: LGBTQ+ erotic literature
change note: Version 4.2.0
has top concept: Erotica
in scheme: v3
preferred label: Literatura erótica intersex

Demisexual erotic literature
type: Concept
issued: 2023-01-17
modified: 2025-02-23
comment: Literary works that have erotic or sexual elements; use in reference to erotic literature focusing on demisexual characters or themes.
comment: Obras literarias que tengan elementos eróticos o sexuales; utilícese en referencia a la literatura erótica que se centra en personajes o temas demisexuales.
broader: LGBTQ+ erotic literature
change note: Version 4.2.0
has top concept: Erotica
in scheme: v3
preferred label: Literatura erótica demisexual

Asexual graphic novels
type: Concept
issued: 2023-01-24
modified: 2025-02-23
comment: Works consisting of sequential images often accompanied by text that generally contain stand-alone stories; used in reference to graphic novels focusing on asexual characters or themes.
comment: Obras que consisten en imágenes secuenciales, a menudo acompañadas de texto, que generalmente contienen historias independientes; utilícese en referencia a novelas gráficas que se centran en personajes o temas asexuales.
broader: LGBTQ+ graphic novels
change note: Version 4.2.0
has top concept: Subcultures
in scheme: v3
preferred label: Novelas gráficas asexuales

Demisexual graphic novels
type: Concept
issued: 2023-01-24
modified: 2025-02-23
comment: Works consisting of sequential images often accompanied by text that generally contain stand-alone stories; used in reference to graphic novels focusing on demisexual characters or themes.
comment: Obras que consisten en imágenes secuenciales, a menudo acompañadas de texto que generalmente contienen historias independientes; utilícese en referencia a novelas gráficas que se centran en personajes o temas demisexuales.
broader: LGBTQ+ graphic novels
change note: Version 4.2.0
has top concept: Subcultures
in scheme: v3
preferred label: Novelas gráficas demisexuales

Aromantic graphic novels
type: Concept
issued: 2023-01-24
modified: 2025-02-23
comment: Works consisting of sequential images often accompanied by text that generally contain stand-alone stories; used in reference to graphic novels focusing on aromantic characters or themes.
comment: Obras que consisten de imágenes secuenciales, a menudo acompañadas de texto, que suelen contener historias independientes; utilícese en referencia a las novelas gráficas centradas en personajes o temas arrománticos.
broader: LGBTQ+ graphic novels
change note: Version 4.2.0
has top concept: Subcultures
in scheme: v3
preferred label: Novelas gráficas arrománticas

Intersex graphic novels
type: Concept
issued: 2023-01-24
modified: 2025-02-23
comment: Works consisting of sequential images often accompanied by text that generally contain stand-alone stories; used in reference to graphic novels focusing on intersex characters or themes.
comment: Obras que consisten en imágenes secuenciales, a menudo acompañadas de texto que generalmente contienen historias independientes; utilizado en referencia a novelas gráficas que se centran en personajes o temas intersex.
broader: LGBTQ+ graphic novels
change note: Version 4.2.0
has top concept: Subcultures
in scheme: v3
preferred label: Novelas gráficas intersex

Asexual short stories
type: Concept
issued: 2023-01-24
modified: 2025-02-23
comment: Written literary works that are short in length and detail a self-contained incident or concept; use in reference to short stories focusing on asexual characters or themes.
comment: Obras literarias escritas que son breves y detallan un incidente o concepto autónomo; utilícese en referencia a historias cortas que se centren en personajes o temas asexuales.
broader: LGBTQ+ short stories
change note: Version 4.2.0
has top concept: Subcultures
in scheme: v3
preferred label: Cuentos cortos asexuales

Aromantic short stories
type: Concept
issued: 2023-01-24
modified: 2025-02-23
comment: Written literary works that are short in length and detail a self-contained incident or concept; use in reference to short stories focusing on aromantic characters or themes.
comment: Obras literarias escritas de corta extensión que detallan un incidente o concepto autocontenido; utilícese en referencia a relatos cortos centrados en personajes o temas arománticos.
alternative label: Relatos arrománticos
broader: LGBTQ+ short stories
change note: Version 4.2.0
has top concept: Subcultures
in scheme: v3
preferred label: Cuentos cortos arrománticos

Intersex short stories
type: Concept
issued: 2023-01-24
modified: 2025-02-23
comment: Written literary works that are short in length and detail a self-contained incident or concept; use in reference to short stories focusing on intersex characters or themes.
comment: Obras literarias escritas que son breves y detallan un incidente o concepto autónomo; utilícese en referencia a cuentos cortos que se centren en personajes o temas intersex.
alternative label: Relatos intersex
broader: LGBTQ+ short stories
change note: Version 4.2.0
has top concept: Subcultures
in scheme: v3
preferred label: Cuentos cortos intersex

Transgender films
type: Concept
issued: 2023-03-17
modified: 2025-02-23
comment: Motion pictures, or movies, created by transgender directors, depicting transgender people, or that are regarded as important within transgender culture.
comment: Películas creadas por directores transgénero, que representan a personas transgénero, o personas consideradas importantes dentro de la cultura transgénero.
broader: LGBTQ+ films
change note: Version 4.2.0
has top concept: Subcultures
in scheme: v3
preferred label: Películas transgénero

Queer films
type: Concept
issued: 2023-03-17
modified: 2025-02-23
comment: Motion pictures, or movies, created by queer directors, depicting queer people, or that are regarded as important within queer culture.
comment: Películas creadas por directores queer, que representan a personas queer o personas consideradas importantes dentro de la cultura queer.
broader: LGBTQ+ films
change note: Version 4.2.0
has top concept: Subcultures
in scheme: v3
preferred label: Películas queer

Bisexual films
type: Concept
issued: 2023-03-17
modified: 2025-02-23
comment: Motion pictures, or movies, created by bisexual directors, depicting bisexual people, or that are regarded as important within bisexual culture.
comment: Obras escritas que describen eventos o personas imaginadas; utilícese en referencia a obras de ficción que se centran en personajes o temas bisexuales.
broader: LGBTQ+ films
change note: Version 4.2.0
has top concept: Subcultures
in scheme: v3
preferred label: Ficción bisexual

Aromantic erotic literature
type: Concept
issued: 2023-03-20
modified: 2025-02-23
comment: Literary works with erotic or sexual elements; use in reference to erotic literature focusing on aromantic characters or themes.
comment: Obras literarias con elementos eróticos o sexuales; utilícese en referencia a la literatura erótica centrada en personajes o temas arrománticos.
broader: LGBTQ+ erotic literature
change note: Version 4.2.0
has top concept: Erotica
in scheme: v3
preferred label: Literatura erótica arromántica

Aromantic history
type: Concept
issued: 2023-03-23
modified: 2025-02-23
comment: Past events or accounts of the past concerning aromantic people, or people who might be perceived as aromantic if they were alive today.
comment: Hechos o relatos del pasado relacionados con personas arrománticas, o personas que pudiesen ser percibidas como arrománticas si vivieran hoy en día.
broader: LGBTQ+ history
change note: Version 4.2.0
has top concept: LGBTQ+ history
in scheme: v3
preferred label: Historia arromántica

Asexual horror fiction
type: Concept
issued: 2023-03-23
modified: 2025-02-23
comment: Written works of fiction intended to frighten, scare, or disgust; use in reference to horror fiction focusing on asexual characters or themes.
comment: Obras de ficción escritas con la intención de asustar, atemorizar o provocar disgusto; utilícese en referencia a la ficción de horror centrada en personajes o temas asexuales.
broader: LGBTQ+ horror fiction
change note: Version 4.2.0
has top concept: Subcultures
in scheme: v3
preferred label: Ficción de horror asexual

Demisexual history
type: Concept
issued: 2023-03-26
modified: 2025-02-23
comment: Past events or accounts of the past concerning demisexual people, or people who might be perceived as demisexual if they were alive today.
comment: Eventos pasados ​​o relatos del pasado relacionados con personas demisexuales, o personas que podrían ser percibidas como demisexuales si estuvieran vivas hoy.
broader: LGBTQ+ history
change note: Version 4.2.0
has top concept: LGBTQ+ history
in scheme: v3
preferred label: Historia demisexual

Megasexual erotic literature
type: Concept
issued: 2023-03-29
modified: 2025-02-23
comment: Literary works with erotic or sexual elements; use in reference to erotic literature focusing on megasexual characters or themes.
comment: Obras literarias con elementos eróticos o sexuales; utilícese en referencia a la literatura erótica que se centra en personajes o temas megasexuales.
broader: LGBTQ+ erotic literature
change note: Version 4.2.0
has top concept: Erotica
in scheme: v3
preferred label: Literatura erótica megasexual

Megasexual fantasy fiction
type: Concept
issued: 2023-03-29
modified: 2025-02-23
comment: Written works that include magical or fantastical elements; use in reference to fantasy fiction focusing on megasexual characters or themes.
comment: Obras escritas que incluyan elementos mágicos o fantásticos; utilícese en referencia a la ficción fantástica centrada en personajes o temas megasexuales.
broader: LGBTQ+ fantasy fiction
change note: Version 4.2.0
has top concept: Subcultures
in scheme: v3
preferred label: Ficción fantástica megasexual

Megasexual horror fiction
type: Concept
issued: 2023-03-29
modified: 2025-02-23
comment: Written works of fiction intended to frighten, scare, or disgust; use in reference to horror fiction focusing on megasexual characters or themes.
comment: Obras de ficción escritas con la intención de asustar, atemorizar o provocar disgusto; utilícese en referencia a la ficción de horror centrada en personajes o temas megasexuales.
broader: LGBTQ+ horror fiction
change note: Version 4.2.0
has top concept: Subcultures
in scheme: v3
preferred label: Ficción de horror megasexual

Megasexual mystery and detective fiction
type: Concept
issued: 2023-03-29
modified: 2025-02-23
comment: Written literary works about the investigation of crime or the work of detectives; use in reference to mystery and detective fiction focusing on megasexual characters or themes.
comment: Obras literarias escritas sobre la investigación de crímenes o el trabajo de detectives; utilícese en referencia a la ficción de misterio y de detectives centrada en personajes y temas megasexuales.
broader: LGBTQ+ mystery and detective fiction
change note: Version 4.2.0
has top concept: Subcultures
in scheme: v3
preferred label: Ficción megasexual de misterio y de detetectives

Megasexual romance fiction
type: Concept
issued: 2023-03-29
modified: 2025-02-23
comment: Written literary work focusing on romantic relationships and love between people; use in reference to romance fiction focusing on megasexual characters or themes.
comment: Obras literarias escritas centradas en las relaciones románticas y el amor entre personas; utilícese en referencia a la ficción romántica centrada en personajes o temas megasexuales.
broader: LGBTQ+ romance fiction
change note: Version 4.2.0
has top concept: Subcultures
in scheme: v3
preferred label: Ficción romántica megasexual

Megasexual science fiction
type: Concept
issued: 2023-03-29
modified: 2025-02-23
comment: Written literary works about imaginative or futuristic concepts incorporating science, technology, space, time travel, and other speculative elements; use in reference to science fiction focusing on megasexual characters or themes.
comment: Obras literarias escritas sobre conceptos imaginativos o futuristas que incorporen la ciencia, la tecnología, el espacio, los viajes en el tiempo y otros elementos especulativos; utilícese en referencia a la ciencia ficción centrada en personajes o temas megasexuales.
broader: LGBTQ+ science fiction
change note: Version 4.2.0
has top concept: Subcultures
in scheme: v3
preferred label: Ciencia ficción megasexual

Megasexual short stories
type: Concept
issued: 2023-03-29
modified: 2025-02-23
comment: Written literary works that are short in length and detail a self-contained incident or concept; use in reference to short stories focusing on megasexual characters or themes.
comment: Obras literarias escritas que son breves y detallan un incidente o concepto autónomo; utilícese en referencia a cuentos cortos que se centren en personajes o temas megasexuales.
alternative label: Relatos megasexuales
broader: LGBTQ+ short stories
change note: Version 4.2.0
has top concept: Subcultures
in scheme: v3
preferred label: Cuentos cortos megasexuales

Megasexual comics
type: Concept
issued: 2023-03-29
modified: 2025-02-23
comment: Works consisting of sequential images often accompanied by text; use in reference to comics focusing on megasexual characters or themes.
comment: Obras que consisten en imágenes secuenciales, a menudo acompañadas de texto; utilícese en referencia a cómics que se centran en personajes o temas megasexuales.
alternative label: Historietas megasexuales
broader: LGBTQ+ comics
change note: Version 4.2.0
has top concept: Subcultures
in scheme: v3
preferred label: Cómics megasexuales

Megasexual history
type: Concept
issued: 2023-03-29
modified: 2025-02-23
comment: Past events or accounts of the past concerning megasexual people, or people who might be perceived as megasexual if they were alive today.
comment: Eventos pasados ​​o relatos del pasado relacionados con personas megasexuales, o personas que podrían ser percibidas como megasexuales si estuvieran vivas hoy.
broader: LGBTQ+ history
change note: Version 4.2.0
has top concept: LGBTQ+ history
in scheme: v3
preferred label: Historia megasexual

Romantic relationships
type: Concept
issued: 2023-04-11
modified: 2025-02-23
comment: Ongoing connections between two or more individuals involving romantic behaviors or activities.
comment: Conexiones continuas entre dos o más personas que involucran comportamientos o actividades románticas.
broader: Relationship satisfaction
change note: Version 4.2.0
has top concept: Relationship satisfaction
in scheme: v3
preferred label: Relaciones románticas

Greyromantic erotic literature
type: Concept
issued: 2023-04-11
modified: 2025-02-23
comment: Literary works with erotic or sexual elements; use in reference to erotic literature focusing on greyromantic erotic literature characters or themes.
comment: Obras literarias con elementos eróticos o sexuales; utilícese en referencia a la literatura erótica que se centra en personajes o temas grisrománticos.
broader: LGBTQ+ erotic literature
change note: Version 4.2.0
has top concept: Erotica
in scheme: v3
preferred label: Literatura erótica grisromántica

Greyromantic fantasy fiction
type: Concept
issued: 2023-04-11
modified: 2025-02-23
comment: Written works that include magical or fantastical elements; use in reference to fantasy fiction focusing on greyromantic characters or themes.
comment: Obras escritas que incluyan elementos mágicos o fantásticos; utilícese en referencia a la ficción fantástica centrada en personajes o temas grisrománticos.
broader: LGBTQ+ fantasy fiction
change note: Version 4.2.0
has top concept: Subcultures
in scheme: v3
preferred label: Ficción fantástica grisromántica

Greyromantic horror fiction
type: Concept
issued: 2023-04-11
modified: 2025-02-23
comment: Written works of fiction intended to frighten, scare, or disgust; use in reference to horror fiction focusing on greyromantic characters or themes.
comment: Obras de ficción escritas con la intención de asustar, atemorizar o provocar disgusto; utilícese en referencia a la ficción de horror centrada en personajes o temas grisrománticos.
broader: LGBTQ+ horror fiction
change note: Version 4.2.0
has top concept: Subcultures
in scheme: v3
preferred label: Ficción de horror grisromántica

Greyromantic mystery and detective fiction
type: Concept
issued: 2023-04-11
modified: 2025-02-23
comment: Written literary works about the investigation of crime or the work of detectives; use in reference to mystery and detective fiction focusing on greyromantic characters or themes.
comment: Obras literarias escritas sobre la investigación de crímenes o el trabajo de detectives; utilícese en referencia a la ficción de misterio y de detectives centrada en personajes y temas grisrománticos.
broader: LGBTQ+ mystery and detective fiction
change note: Version 4.2.0
has top concept: Subcultures
in scheme: v3
preferred label: Ficción grisromántica de misterio y de detectives

Greyromantic romance fiction
type: Concept
issued: 2023-04-11
modified: 2025-02-23
comment: Written literary work focusing on romantic relationships and love between people; use in reference to romance fiction focusing on greyromantic characters or themes.
comment: Obras literarias escritas centradas en las relaciones románticas y el amor entre personas; utilícese en referencia a la ficción romántica centrada en personajes o temas grisrománticos.
broader: LGBTQ+ romance fiction
change note: Version 4.2.0
has top concept: Subcultures
in scheme: v3
preferred label: Ficción romántica grisromántica

Greyromantic science fiction
type: Concept
issued: 2023-04-11
modified: 2025-02-23
comment: Written literary works about imaginative or futuristic concepts incorporating science, technology, space, time travel, and other speculative elements; use in reference to science fiction focusing on greyromantic characters or themes.
comment: Obras literarias escritas sobre conceptos imaginativos o futuristas que incorporan la ciencia, la tecnología, el espacio, los viajes en el tiempo y otros elementos especulativos; utilícese en referencia a la ciencia ficción centrada en personajes o temas grisrománticos.
broader: LGBTQ+ science fiction
change note: Version 4.2.0
has top concept: Subcultures
in scheme: v3
preferred label: Ciencia ficción grisromántica

Greyromantic short stories
type: Concept
issued: 2023-04-11
modified: 2025-02-23
comment: Written literary works that are short in length and detail a self-contained incident or concept; use in reference to short stories focusing on greyromantic characters or themes.
comment: Obras literarias escritas que son breves y detallan un incidente o concepto autónomo; utilícese en referencia a historias cortas que se centren en personajes o temas grisrománticos.
alternative label: Relatos grisrománticos
broader: LGBTQ+ short stories
change note: Version 4.2.0
has top concept: Subcultures
in scheme: v3
preferred label: Cuentos cortos grisrománticos

Greyromantic comics
type: Concept
issued: 2023-04-11
modified: 2025-02-23
comment: Works consisting of sequential images often accompanied by text; use in reference to comics focusing on greyromantic characters or themes.
comment: Obras que consisten en imágenes secuenciales, a menudo acompañadas de texto; utilícese en referencia a cómics que se centran en personajes o temas grisrománticos.
alternative label: Historietas grisrománticas
broader: LGBTQ+ comics
change note: Version 4.2.0
has top concept: Subcultures
in scheme: v3
preferred label: Cómics grisrománticos

Greyromantic history
type: Concept
issued: 2023-04-11
modified: 2025-02-23
comment: Past events or accounts of the past concerning greyromantic people, or people who might be perceived as greyromantic if they were alive today.
comment: Eventos pasados ​​o relatos del pasado relacionados con personas grisrománticas, o personas que podrían ser percibidas como grisrománticas si estuvieran vivas hoy.
broader: LGBTQ+ history
change note: Version 4.2.0
has top concept: LGBTQ+ history
in scheme: v3
preferred label: Historia grisromántica

Armenian gay men
type: Concept
issued: 2023-04-11
modified: 2025-02-23
comment: Gay men who are ethnically Armenian.
comment: Hombres gay de etnia armenia.
alternative label: Gay Armenians
alternative label: Armenios gay
broader: Armenian LGBTQ+ people
change note: Version 4.2.0
has top concept: LGBTQ+ people
in scheme: v3
preferred label: Hombres gay armenios

Armenian lesbians
type: Concept
issued: 2023-04-11
modified: 2025-02-23
comment: Lesbians who are ethnically Armenian.
comment: Lesbianas de etnia armenia.
alternative label: Lesbian Armenians
alternative label: Armenias lesbianas
broader: Armenian LGBTQ+ people
change note: Version 4.2.0
has top concept: LGBTQ+ people
in scheme: v3
preferred label: Lesbianas armenias

Armenian bisexual people
type: Concept
issued: 2023-04-11
modified: 2025-02-23
comment: Bisexual people who are ethnically Armenian.
comment: Personas bisexuales de etnia armenia.
alternative label: Bisexual Armenians
alternative label: Armenios bisexuales
alternative label: Armenias bisexuales
broader: Armenian LGBTQ+ people
change note: Version 4.2.0
has top concept: LGBTQ+ people
in scheme: v3
preferred label: Personas bisexuales armenias

Armenian queer people
type: Concept
issued: 2023-04-11
modified: 2025-02-23
comment: Queer people who are ethnically Armenian.
comment: Personas queer de etnia armenia.
alternative label: Queer Armenians
alternative label: Armenios queer
alternative label: Armenias queer
broader: Armenian LGBTQ+ people
change note: Version 4.2.0
has top concept: LGBTQ+ people
in scheme: v3
preferred label: Personas queer armenias

Armenian transgender people
type: Concept
issued: 2023-04-11
modified: 2025-02-23
comment: Transgender people who are ethnically Armenian.
comment: Personas transgénero de etnia armenia
alternative label: Transgender Armenians
alternative label: Armenios transgénero
alternative label: Armenias transgénero
broader: Armenian LGBTQ+ people
change note: Version 4.2.0
has top concept: LGBTQ+ people
in scheme: v3
preferred label: Personas transgénero armenias

Armenian intersex people
type: Concept
issued: 2023-04-11
modified: 2025-02-23
comment: Intersex people who are ethnically Armenian.
comment: Personas intersexuales de etnia armenia.
alternative label: Intersex Armenians
alternative label: Armenios intersex
alternative label: Armenias intersex
alternative label: Personas intersex armenias
broader: Armenian LGBTQ+ people
change note: Version 4.2.0
has top concept: LGBTQ+ people
in scheme: v3
preferred label: Personas intersexuales armenias

Armenian asexual people
type: Concept
issued: 2023-04-11
modified: 2025-02-23
comment: Asexual people who are ethnically Armenian.
comment: Personas asexuales de etnia armenia.
alternative label: Asexual Armenians
alternative label: Armenios asexuales
alternative label: Armenias asexuales
broader: Armenian LGBTQ+ people
change note: Version 4.2.0
has top concept: LGBTQ+ people
in scheme: v3
preferred label: Personas asexuales armenias

Intersex films
type: Concept
issued: 2023-04-12
modified: 2025-02-23
comment: Motion pictures, or movies, created by intersex directors, depicting intersex people, or that are regarded as important within intersex culture.
comment: Películas creadas por directores intersex, que representen a personas intersex, o personas consideradas importantes dentro de la cultura intersex.
broader: LGBTQ+ films
change note: Version 4.2.0
has top concept: Subcultures
in scheme: v3
preferred label: Películas intersex

Aromantic films
type: Concept
issued: 2023-04-12
modified: 2025-02-23
comment: Motion pictures, or movies, created by aromantic directors, depicting aromantic people, or that are regarded as important within aromantic culture.
comment: Películas o películas creadas por directores arrománticos, que representan a personas arrománticas o que se consideran importantes dentro de la cultura arromántica.
broader: LGBTQ+ films
change note: Version 4.2.0
has top concept: Subcultures
in scheme: v3
preferred label: Películas arrománticas

Asexual films
type: Concept
issued: 2023-04-12
modified: 2025-02-23
comment: Motion pictures, or movies, created by asexual directors, depicting asexual people, or that are regarded as important within asexual culture.
comment: Películas o filmes creados por directores asexuales, que representan a personas asexuales o que se consideran importantes dentro de la cultura asexual.
broader: LGBTQ+ films
change note: Version 4.2.0
has top concept: Subcultures
in scheme: v3
preferred label: Películas asexuales

Demisexual films
type: Concept
issued: 2023-04-12
modified: 2025-02-23
comment: Motion pictures, or movies, created by demisexual directors, depicting demisexual people, or that are regarded as important within demisexual culture.
comment: Películas creadas por directores demisexuales, que representan a personas demisexuales o a personas consideradas importantes dentro de la cultura demisexual.
broader: LGBTQ+ films
change note: Version 4.2.0
has top concept: Subcultures
in scheme: v3
preferred label: Películas demisexuales

Non-binary graphic novels
type: Concept
issued: 2023-04-12
modified: 2025-02-23
comment: Works consisting of sequential images often accompanied by text that generally contain stand-alone stories; used in reference to graphic novels focusing on non-binary characters or themes.
comment: Obras que consisten en imágenes secuenciales, a menudo acompañadas de texto, que generalmente contienen historias independientes; utilícese en referencia a novelas gráficas que se centran en personajes o temas no binarios.
broader: LGBTQ+ graphic novels
change note: Version 4.2.0
has top concept: Subcultures
in scheme: v3
preferred label: Novelas gráficas no binarias

Non-binary erotic literature
type: Concept
issued: 2023-04-12
modified: 2025-02-23
comment: Literary works that have erotic or sexual elements; use in reference to erotic literature focusing on non-binary characters or themes.
comment: Obras literarias que tengan elementos eróticos o sexuales; utilícese en referencia a la literatura erótica que se centra en personajes o temas no binarios.
broader: LGBTQ+ erotic literature
change note: Version 4.2.0
has top concept: Erotica
in scheme: v3
preferred label: Literatura erótica no binaria

Non-binary porn films
type: Concept
issued: 2023-04-12
modified: 2025-02-23
comment: Erotic or sexually explicit films featuring non-binary people.
comment: Películas eróticas o sexualmente explícitas protagonizadas por personas no binarias.
alternative label: Películas pornografícas no binarias
broader: LGBTQ+ porn films
change note: Version 4.2.0
has top concept: Subcultures
in scheme: v3
preferred label: Películas porno no binaria

Non-binary short stories
type: Concept
issued: 2023-04-12
modified: 2025-02-23
comment: Written literary works that are short in length and detail a self-contained incident or concept; use in reference to short stories focusing on non-binary characters or themes.
comment: Obras literarias escritas que son breves y detallan un incidente o concepto autónomo; utilícese en referencia a cuentos cortos que se centren en personajes o temas no binarios.
alternative label: Relatos no binarios
broader: LGBTQ+ short stories
change note: Version 4.2.0
has top concept: Subcultures
in scheme: v3
preferred label: Cuentos cortos no binarios

Non-binary comics
type: Concept
issued: 2023-04-12
modified: 2025-02-23
comment: Works consisting of sequential images often accompanied by text; use in reference to comics focusing on non-binary characters or themes.
comment: Obras que consisten en imágenes secuenciales, a menudo acompañadas de texto; utilícese en referencia a cómics que se centran en personajes o temas no binarios.
alternative label: Historietas no binarias
broader: LGBTQ+ comics
change note: Version 4.2.0
has top concept: Subcultures
in scheme: v3
preferred label: Cómics no binarios

Non-binary poetry
type: Concept
issued: 2023-04-12
modified: 2025-02-23
comment: Literary work, typically written in verse, that focuses on non-binary characters, themes, or identity.
comment: Obras literarias, normalmente escritas en verso, que se centran en personajes, temas o identidades no binarias.
broader: LGBTQ+ poetry
change note: Version 4.2.0
has top concept: Subcultures
in scheme: v3
preferred label: Poesía no binaria

Known donors (Reproduction)
type: Concept
issued: 2023-04-14
modified: 2025-02-23
comment: Donors whose identities are known by the people to whom they donated gametes and/or the offspring born of that donation.
comment: Donantes cuyas identidades son conocidas por las personas a quienes donaron gametos y/o por la descendencia nacida de esa donación.
broader: Donors
change note: Version 4.2.0
has top concept: Donors
in scheme: v3
preferred label: Donantes conocidos (reproducción)

Open identity donors (Reproduction)
type: Concept
issued: 2023-04-14
modified: 2025-02-23
comment: Donors who donated their gametes with the understanding that their identity and/or contact information would be released to any offspring born of that donation. The age at which the offspring receives this information varies, following the donor's preference.
comment: Donantes que donaron sus gametos con el entendimiento de que su identidad y/o información de contacto se divulgarían a cualquier descendiente nacido de esa donación. La edad a la que el descendiente recibe esta información varía según la preferencia del donante.
alternative label: Identity release donors
alternative label: Willing-to-be-known donors
alternative label: Donantes con identidad revelada
broader: Donors
change note: Version 4.2.0
has top concept: Donors
in scheme: v3
preferred label: Donantes de identidad abierta (Reproducción)

Māhūkāne
type: Concept
issued: 2023-06-26
modified: 2025-02-23
comment: A term coined by the Kānaka Maoli (Native Hawaiian) queer community in the early 2000s that blends the term Māhū (for third gender indigenous people of Hawai'i and Tahiti who blend genders and often hold spiritual roles) and kāne (man).
comment: Término acuñado por la comunidad queer kānaka maoli (nativos hawaianos) a principios de la década del 2000 que mezcla el término "māhū" (para las personas indígenas del tercer género de Hawái y Tahití que mezclan géneros y a menudo desempeñan funciones espirituales) y "kāne" (hombre).
alternative label: Mahukane
broader: Māhū
change note: Version 4.2.0
has top concept: Gender
in scheme: v3

Māhūwahine
type: Concept
issued: 2023-06-26
modified: 2025-02-23
comment: A term coined by the Kānaka Maoli (Native Hawaiian) queer community in the early 2000s that blends the term Māhū (for third gender indigenous people of Hawai'i and Tahiti who blend genders and often hold spiritual roles) and wahine (woman).
comment: Término acuñado por la comunidad queer kānaka maoli (nativos hawaianos) a principios de la década del 2000 que mezcla el término "māhū" (para las personas indígenas del tercer género de Hawái y Tahití que mezclan géneros y a menudo desempeñan funciones espirituales) y "wahine" (mujer).
alternative label: Mahuwahine
broader: Māhū
change note: Version 4.2.0
has top concept: Gender
in scheme: v3

Lesbian neurodivergent people
type: Concept
issued: 2023-06-26
modified: 2026-03-05
comment: Lesbians with neurodevelopmental differences in areas such as cognition, sensory processing, emotionality, and sociality.
comment: Lesbianas cuyos cerebros procesan, aprenden y/o se comportan de manera diferente a lo que la sociedad considera típico. Algunas de estas diferencias neurológicas pueden presentarse como problemas de aprendizaje, trastornos médicos y otras condiciones.
alternative label: Neurodivergent lesbians
alternative label: Neuroatypical lesbians
alternative label: Lesbian neuroatypical people
broader: LGBTQ+ neurodivergent people
change note: Version 4.2.0
has top concept: LGBTQ+ people
in scheme: v3
preferred label: Lesbianas neurodivergentes

Lesbian autistic people
type: Concept
issued: 2023-06-26
modified: 2025-02-23
comment: Lesbians who are autistic.
comment: Lesbianas que son autistas.
alternative label: Lesbians with autism
alternative label: Lesbianas con autismo
alternative label: Autistas lesbianas
broader: LGBTQ+ autistic people
change note: Version 4.2.0
has top concept: LGBTQ+ people
in scheme: v3
preferred label: Personas lesbianas autistas

Gay comedians
type: Concept
issued: 2023-06-27
modified: 2025-02-23
comment: Gay people who seek to entertain an audience by making them laugh, through jokes, slapstick, employing prop comedy, or other amusing means.
comment: Hombres gay que buscan entretener a la audiencia haciéndolas reír, mediante bromas, payasadas, empleando comedia de utilería u otros medios divertidos.
alternative label: Gay comics (Persons)
alternative label: Cómicos gay
broader: LGBTQ+ comedians
change note: Version 4.2.0
has top concept: LGBTQ+ comedians
in scheme: v3
preferred label: Comediantes gay

Lesbian comedians
type: Concept
issued: 2023-06-27
modified: 2025-02-23
comment: Lesbians who seek to entertain an audience by making them laugh, through jokes, slapstick, employing prop comedy, or other amusing means.
comment: Lesbianas que buscan entretener a la audiencia haciéndola reír, mediante bromas, payasadas, empleando comedia de utilería u otros medios divertidos.
alternative label: Lesbian comics (Persons)
alternative label: Cómicas lesbianas (personas)
broader: LGBTQ+ comedians
change note: Version 4.2.0
has top concept: LGBTQ+ comedians
in scheme: v3
preferred label: Comediantes lesbianas

Bisexual comedians
type: Concept
issued: 2023-06-27
modified: 2025-02-23
comment: Bisexual people who seek to entertain an audience by making them laugh, through jokes, slapstick, employing prop comedy, or other amusing means.
comment: Personas bisexuales que buscan entretener a una audiencia haciéndolas reír, mediante bromas, payasadas, empleando comedia de utilería u otros medios de entretenimiento.
alternative label: Bisexual comics (Persons)
alternative label: Cómicos bisexuales
alternative label: Cómicas bisexuales
broader: LGBTQ+ comedians
change note: Version 4.2.0
has top concept: LGBTQ+ comedians
in scheme: v3
preferred label: Comediantes bisexuales

Transgender comedians
type: Concept
issued: 2023-06-27
modified: 2025-02-23
comment: Transgender people who seek to entertain an audience by making them laugh, through jokes, slapstick, employing prop comedy, or other amusing means.
comment: Personas transgénero que buscan entretener a una audiencia haciéndola reír, a través de bromas, payasadas, empleando comedia de utilería u otros medios divertidos.
alternative label: Transgender comics (Persons)
alternative label: Cómicos transgénero
broader: LGBTQ+ comedians
change note: Version 4.2.0
has top concept: LGBTQ+ comedians
in scheme: v3
preferred label: Comediantes transgénero

Queer comedians
type: Concept
issued: 2023-06-27
modified: 2025-02-23
comment: Queer people who seek to entertain an audience by making them laugh, through jokes, slapstick, employing prop comedy, or other amusing means.
comment: Personas queer que buscan entretener a una audiencia haciéndola reír, a través de bromas, payasadas, empleando comedia de utilería u otros medios divertidos.
alternative label: Queer comics (Persons)
alternative label: Cómicos queer
broader: LGBTQ+ comedians
change note: Version 4.2.0
has top concept: LGBTQ+ comedians
in scheme: v3
preferred label: Comediantes queer

Intersex comedians
type: Concept
issued: 2023-06-27
modified: 2025-02-23
comment: Intersex people who seek to entertain an audience by making them laugh, through jokes, slapstick, employing prop comedy, or other amusing means.
comment: Personas intersex que buscan entretener a la audiencia haciéndolas reír, mediante bromas, payasadas, empleando comedia de utilería u otros medios divertidos.
alternative label: Intersex comics (Persons)
alternative label: Cómicos intersex
broader: LGBTQ+ comedians
change note: Version 4.2.0
has top concept: LGBTQ+ comedians
in scheme: v3
preferred label: Comediantes intersex

Asexual comedians
type: Concept
issued: 2023-06-27
modified: 2025-02-23
comment: Asexual people who seek to entertain an audience by making them laugh, through jokes, slapstick, employing prop comedy, or other amusing means.
comment: Personas asexuales que buscan entretener a un público haciéndole reír, mediante chistes, payasadas, empleando comedia de atrezo u otros medios divertidos.
alternative label: Asexual comics (Persons)
alternative label: Cómicos asexuales
alternative label: Cómicas asexuales
broader: LGBTQ+ comedians
change note: Version 4.2.0
has top concept: LGBTQ+ comedians
in scheme: v3
preferred label: Comediantes asexuales

Intersex drama
type: Concept
issued: 2023-06-27
modified: 2025-02-23
comment: Works of fiction written to be performed; use in reference to dramatic works focusing on intersex characters or themes.
comment: Obras de ficción escritas para ser puestas en escena; utilícese en referencia a obras dramáticas que se centran en personajes o temas intersex.
broader: LGBTQ+ drama
change note: Version 4.2.0
has top concept: Subcultures
in scheme: v3
preferred label: Drama intersex

Intersex employment
type: Concept
issued: 2023-06-27
modified: 2025-02-23
comment: Employment of intersex people.
comment: Empleo de personas intersex.
broader: LGBTQ+ employment
change note: Version 4.2.0
has top concept: LGBTQ+ employment
in scheme: v3
preferred label: Empleo intersex

Parents of intersex people
type: Concept
issued: 2023-06-27
modified: 2025-02-23
comment: People who act as parents to one or more intersex person. For parents who are themselves intersex, use the term "intersex parents."
comment: Personas que actúan como padres de una o más personas intersexuales. Para padres que son intersexuales, utilice el término "madres y padres intersexuales".
alternative label: Intersex people's parents
alternative label: Padres de intersexuales
alternative label: Padres de personas intersex
broader: Parents of LGBTQ+ people
change note: Version 4.2.0
has top concept: Family members
in scheme: v3
preferred label: Madres y padres de personas intersexuales

Partners of intersex people
type: Concept
issued: 2023-06-27
modified: 2025-02-23
comment: People whose sexual, romantic, or play partner is intersex.
comment: Personas cuya pareja sexual, romántica o de juego es intersexual.
alternative label: Parejas de personas intersex
broader: Partners of LGBTQ+ people
change note: Version 4.2.0
has top concept: Partners
in scheme: v3
preferred label: Parejas de personas intersexuales

White intersex people
type: Concept
issued: 2023-06-27
modified: 2025-02-23
comment: Intersex people who are white.
comment: Personas intersexuales que son blancas.
alternative label: Intersex Caucasian people
alternative label: Intersex white people
alternative label: Personas caucásicas intersex
alternative label: Personas intersex blancas
broader: White LGBTQ+ people
change note: Version 4.2.0
has top concept: White LGBTQ+ people
in scheme: v3
preferred label: Personas intersexuales blancas

Intersex information centers
type: Concept
issued: 2023-06-27
modified: 2025-02-23
comment: Institutions providing education, support, and information about intersex issues and intersex communities to intersex people.
comment: Instituciones que brindan educación, apoyo e información sobre cuestiones intersex y comunidades intersex a personas intersex.
alternative label: Intersex information centres
broader: LGBTQ+ information centers
change note: Version 4.2.0
has top concept: LGBTQ+ centers
in scheme: v3
preferred label: Centros de información intersex

Intersex libraries
type: Concept
issued: 2023-06-27
modified: 2025-02-23
comment: Libraries that hold materials primarily pertaining to intersex people or intended for use by intersex people.
comment: Bibliotecas que contienen materiales principalmente relacionados con personas intersex o destinados a ser utilizados por personas intersex.
broader: LGBTQ+ libraries
change note: Version 4.2.0
has top concept: LGBTQ+ cultural heritage institutions
in scheme: v3
preferred label: Bibliotecas intersex

Intersex literary criticism
type: Concept
issued: 2023-06-27
modified: 2025-02-23
comment: The study, evaluation, and interpretation of literary works focusing on intersex characters or themes; can also include interpretation of literature through the lens and frameworks of intersex studies.
comment: El estudio, la evaluación y la interpretación de obras literarias centradas en personajes o temas intersex; también puede incluir la interpretación de la literatura a través del lente y los marcos teóricos de los estudios intersex.
broader: LGBTQ+ literary criticism
change note: Version 4.2.0
has top concept: LGBTQ+ literary criticism
in scheme: v3
preferred label: Crítica literaria intersex

Intersex people of color
type: Concept
issued: 2023-06-27
modified: 2025-02-23
comment: Primarily used in the United States, this term refers to intersex people who are not white and who identify as people of color.
comment: Personas intersex que no son blancas y que se autoidentifican como personas de color.
alternative label: Intersex people of colour
broader: LGBTQ+ people of color
change note: Version 4.2.0
has top concept: LGBTQ+ people
in scheme: v3
preferred label: Personas intersex de color

Asexual archives
type: Concept
issued: 2023-06-27
modified: 2025-02-23
comment: Collections of records and materials relating to asexual people or asexual communities; can include a variety of organizations and institutions from community to government archives.
comment: Colecciones de registros y materiales relacionados con personas asexuales o comunidades asexuales; puede incluir a una variedad de organizaciones e instituciones, desde archivos comunitarios hasta gubernamentales.
broader: LGBTQ+ archives
change note: Version 4.2.0
has top concept: LGBTQ+ cultural heritage institutions
in scheme: v3
preferred label: Archivos asexuales

Asexual artists
type: Concept
issued: 2023-06-27
modified: 2025-02-23
comment: Asexual people who practice any of various creative arts.
comment: Artistas conocidos por ser asexuales.
broader: LGBTQ+ artists
change note: Version 4.2.0
has top concept: LGBTQ+ people
in scheme: v3
preferred label: Artistas asexuales

Asexual bookshops
type: Concept
issued: 2023-06-27
modified: 2025-02-23
comment: Bookshops that sell materials intended for use by asexual people or addressing topics related to asexual experiences.
comment: Librerías que venden materiales dirigidos a personas asexuales o que abordan temas relacionados con experiencias asexuales.
broader: LGBTQ+ bookshops
change note: Version 4.2.0
has top concept: LGBTQ+ bookshops
in scheme: v3
preferred label: Librerías asexuales

Daughters of intersex people
type: Concept
issued: 2023-06-27
modified: 2025-02-23
comment: Daughters who have one or more intersex parent.
comment: Hijas que tienen uno o más padres intersexuales.
alternative label: Hijas de personas intersex
broader: Daughters of LGBTQ+ people
change note: Version 4.2.0
has top concept: Family members
in scheme: v3
preferred label: Hijas de personas intersexuales

Fathers of intersex people
type: Concept
issued: 2023-06-27
modified: 2025-02-23
comment: People who assume the role of father to intersex people. Only use to describe individuals who identify as fathers.
comment: Personas que asumen el rol de padre de personas intersexuales. Utilícese únicamente para describir a personas que se autoidentifiquen como padres.
alternative label: Padres de personas intersex
alternative label: Papás de personas intersexuales
alternative label: Papás de personas intersex
broader: Fathers of LGBTQ+ people
change note: Version 4.2.0
has top concept: Family members
in scheme: v3
preferred label: Padres de personas intersexuales

Jewish intersex people
type: Concept
issued: 2023-06-27
modified: 2025-02-23
comment: Intersex people who are Jewish.
comment: Personas intersexuales que son judías.
alternative label: Intersex Jews
alternative label: Judíos intersex
alternative label: Personas intersex judías
broader: Jewish LGBTQ+ people
change note: Version 4.2.0
has top concept: LGBTQ+ people
in scheme: v3
preferred label: Personas intersexuales judías

Asexual characters
type: Concept
issued: 2023-06-27
modified: 2025-02-23
comment: Characters in creative works who are asexual.
comment: Personajes asexuales en obras creativas.
broader: LGBTQ+ characters
change note: Version 4.2.0
has top concept: LGBTQ+ characters
in scheme: v3
preferred label: Personajes asexuales

Asexual community
type: Concept
issued: 2023-06-27
modified: 2025-02-23
comment: Groups of people who share the experience of being asexual.
comment: Grupos de personas que comparten la experiencia de la asexualidad.
broader: LGBTQ+ communities
change note: Version 4.2.0
has top concept: LGBTQ+ communities
in scheme: v3
preferred label: Comunidad asexual

Asexual community centers
type: Concept
issued: 2023-06-27
modified: 2025-02-23
comment: Spaces in which people from asexual communities meet for social, education, recreational, or organizing activities.
comment: Espacios donde las personas de comunidades asexuales se reúnen para actividades sociales, educativas, recreativas u organizativas.
broader: LGBTQ+ community centers
change note: Version 4.2.0
has top concept: LGBTQ+ centers
in scheme: v3
preferred label: Centros comunitarios asexuales
preferred label: Asexual community centres

Intersex archives
type: Concept
issued: 2023-06-27
modified: 2025-02-23
comment: Collections of records and materials relating to intersex people or intersex communities; can include a variety of organizations and institutions from community to government archives.
comment: Colecciones de registros y materiales relacionados con personas intersex o comunidades intersex; puede incluir una variedad de organizaciones e instituciones, desde archivos comunitarios hasta gubernamentales.
broader: LGBTQ+ archives
change note: Version 4.2.0
has top concept: LGBTQ+ cultural heritage institutions
in scheme: v3
preferred label: Archivos intersex

Intersex artists
type: Concept
issued: 2023-06-27
modified: 2025-02-23
comment: Intersex people who practice any of various creative arts.
comment: Artistas que son intersex.
broader: LGBTQ+ artists
change note: Version 4.2.0
has top concept: LGBTQ+ people
in scheme: v3
preferred label: Artistas intersex

Asexual couples
type: Concept
issued: 2023-06-27
modified: 2025-02-23
comment: Partnerships in which both people are asexual.
comment: Relaciones de pareja donde las dos personas son asexuales.
broader: LGBTQ+ couples
change note: Version 4.2.0
has top concept: Relationship satisfaction
in scheme: v3
preferred label: Parejas asexuales

Asexual daughters
type: Concept
issued: 2023-06-27
modified: 2025-02-23
comment: Daughters who identify as asexual.
comment: Hijas que se autoidentifican como asexuales.
broader: LGBTQ+ daughters
change note: Version 4.2.0
has top concept: LGBTQ+ people
in scheme: v3
preferred label: Hijas asexuales

Asexual sons
type: Concept
issued: 2023-06-28
modified: 2025-02-23
comment: Asexual people who are sons.
comment: Personas asexuales que son hijos.
broader: LGBTQ+ sons
change note: Version 4.2.0
has top concept: LGBTQ+ people
in scheme: v3
preferred label: Hijos asexuales

Asexual employment
type: Concept
issued: 2023-06-28
modified: 2025-02-23
comment: Employment of asexual people
comment: Empleo de personas asexuales.
broader: LGBTQ+ employment
change note: Version 4.2.0
has top concept: LGBTQ+ employment
in scheme: v3
preferred label: Empleo asexual

Asexual fathers
type: Concept
issued: 2023-06-28
modified: 2025-02-23
comment: Asexual people who are fathers.
comment: Personas asexuales que son padres.
alternative label: Papás asexuales
broader: LGBTQ+ fathers
change note: Version 4.2.0
has top concept: Family members
in scheme: v3
preferred label: Padres asexuales

Asexual information centers
type: Concept
issued: 2023-06-28
modified: 2025-02-23
comment: Institutions providing education, support, and information about asexual issues and asexual communities to asexual people.
comment: Instituciones que brindan educación, apoyo e información sobre temas asexuales y comunidades asexuales a personas asexuales.
alternative label: Asexual information centres
alternative label: Centros asexuales de información
broader: LGBTQ+ information centers
change note: Version 4.2.0
has top concept: LGBTQ+ centers
in scheme: v3
preferred label: Centros de información asexual

Asexual libraries
type: Concept
issued: 2023-06-28
modified: 2025-02-23
comment: Libraries that hold materials primarily pertaining to asexual people or intended for use by asexual people.
comment: Bibliotecas que contienen materiales principalmente relacionados con personas asexuales o destinados a ser utilizados por personas asexuales.
broader: LGBTQ+ libraries
change note: Version 4.2.0
has top concept: LGBTQ+ cultural heritage institutions
in scheme: v3
preferred label: Bibliotecas asexuales

Asexual movement
type: Concept
issued: 2023-06-28
modified: 2025-02-23
comment: Umbrella term for activism focused on the rights of asexual people and issues faced by asexual communities.
comment: Término general para el activismo centrado en los derechos de las personas asexuales y los problemas a los que se enfrentan las comunidades asexuales.
broader: LGBTQ+ movement
change note: Version 4.2.0
has top concept: Social movements
in scheme: v3
preferred label: Movimiento asexual

Asexual museums
type: Concept
issued: 2023-06-28
modified: 2025-02-23
comment: Institutions dedicated to the storage, exhibition, conservation, and preservation of materials relating to asexual people and asexual history.
comment: Instituciones dedicadas al almacenamiento, la exposición, la conservación y la preservación de materiales relacionados con las personas asexuales y la historia asexual.
broader: LGBTQ+ museums
change note: Version 4.2.0
has top concept: LGBTQ+ cultural heritage institutions
in scheme: v3
preferred label: Museos asexuales

Asexual partners
type: Concept
issued: 2023-06-28
modified: 2025-02-23
comment: Asexual people who are the romantic, sexual, or play partners of another person or people.
comment: Personas asexuales que son la pareja romántica, sexual o de juegos de otra persona o personas.
broader: LGBTQ+ partners
change note: Version 4.2.0
has top concept: LGBTQ+ families
in scheme: v3
preferred label: Parejas asexuales

Asexual people in the military
type: Concept
issued: 2023-06-28
modified: 2025-02-23
comment: Asexual people serving in state and national armed forces.
comment: Personas asexuales que sirven en las fuerzas armadas estatales y nacionales.
alternative label: Personas asexuales en las fuerzas armadas
broader: LGBTQ+ people in the military
change note: Version 4.2.0
has top concept: Legal status
in scheme: v3
preferred label: Personas asexuales en el ejército

Asexual people of color
type: Concept
issued: 2023-06-28
modified: 2025-02-23
comment: Primarily used in the United States, this term refers to asexual people who are not white and who identify as people of color.
comment: Personas asexuales que no son blancas y que se autoidentifican como personas de color.
alternative label: Asexual people of colour
broader: LGBTQ+ people of color
change note: Version 4.2.0
has top concept: LGBTQ+ people
in scheme: v3
preferred label: Personas asexuales de color

Asexual publishers
type: Concept
issued: 2023-06-28
modified: 2025-02-23
comment: Companies and organizations that publish materials for asexual communities or addressing asexual issues.
comment: Empresas y organizaciones que publican materiales para comunidades asexuales o que abordan asuntos asexuales.
broader: LGBTQ+ publishers
change note: Version 4.2.0
has top concept: LGBTQ+ publishers
in scheme: v3
preferred label: Editoriales asexuales

Asexual relationships
type: Concept
issued: 2023-06-28
modified: 2025-02-23
comment: Ongoing connections (romantic, sexual, or platonic) between two or more asexual people.
comment: Conexiones continuas (románticas, sexuales o platónicas) entre dos o más personas asexuales.
broader: Relationship satisfaction
change note: Version 4.2.0
has top concept: Relationship satisfaction
in scheme: v3
preferred label: Relaciones asexuales

Asexual rights
type: Concept
issued: 2023-06-28
modified: 2025-02-23
comment: Legal, social, or ethical principles of freedom or entitlement held by asexual people.
comment: Principios legales, sociales o éticos de la libertad o del derecho que tienen las personas asexuales.
broader: LGBTQ+ civil rights
change note: Version 4.2.0
has top concept: Human rights
in scheme: v3
preferred label: Derechos asexuales

Gay politicians
type: Concept
issued: 2023-06-28
modified: 2026-02-24
comment: Gay men who are candidates for public office, are currently holding public office, or have held political positions. Politicians can be elected by public election or otherwise appointed.
comment: Hombres o personas masc gay que son candidatos a cargos públicos, ejercen actualmente cargos públicos o han desempeñado cargos políticos. Los políticos pueden ser elegidos mediante elección pública o designados de otro modo.
alternative label: Gay public officials
alternative label: Oficiales públicos gay
broader: LGBTQ+ politicians
change note: Version 4.2.0
has top concept: LGBTQ+ politicians
in scheme: v3
preferred label: Políticos gay

Lesbian politicians
type: Concept
issued: 2023-06-28
modified: 2025-02-23
comment: Lesbians who are candidates for public office, are currently holding public office, or have held political positions. Politicians can be elected by public election or otherwise appointed.
comment: Lesbianas que sean candidatas a cargos públicos, ejerzan actualmente cargos públicos o hayan desempeñado cargos políticos. Las políticas pueden ser elegidas mediante elección pública o designadas de otro modo.
alternative label: Lesbian public officials
alternative label: Oficiales públicas lesbianas
broader: LGBTQ+ politicians
change note: Version 4.2.0
has top concept: LGBTQ+ politicians
in scheme: v3
preferred label: Políticas lesbianas

Bisexual politicians
type: Concept
issued: 2023-06-28
modified: 2025-02-23
comment: Bisexual people who are candidates for public office, are currently holding public office, or have held political positions. Politicians can be elected by public election or otherwise appointed.
comment: Obras literarias, normalmente escritas en verso, que se centran en personajes, temas o identidades bisexuales.
alternative label: Bisexual public officials
broader: LGBTQ+ politicians
change note: Version 4.2.0
has top concept: LGBTQ+ politicians
in scheme: v3
preferred label: Poesía bisexual

Queer politicians
type: Concept
issued: 2023-06-28
modified: 2025-02-23
comment: Queer people who are candidates for public office, are currently holding public office, or have held political positions. Politicians can be elected by public election or otherwise appointed.
comment: Personas queer que son candidatas a cargos públicos, ocupan actualmente cargos públicos o han ocupado cargos políticos. Los políticos pueden ser elegidos mediante elección pública o designados de otro modo.
alternative label: Queer public officials
alternative label: Oficiales públicos queer
broader: LGBTQ+ politicians
change note: Version 4.2.0
has top concept: LGBTQ+ politicians
in scheme: v3
preferred label: Políticos queer

Transgender politicians
type: Concept
issued: 2023-06-28
modified: 2025-02-23
comment: Transgender people who are candidates for public office, are currently holding public office, or have held political positions. Politicians can be elected by public election or otherwise appointed.
comment: Personas transgénero que son candidatos a cargos públicos, ocupan actualmente cargos públicos o han ocupado cargos políticos. Los políticos pueden ser elegidos mediante elección pública o designados de otro modo.
alternative label: Transgender public officials
alternative label: Oficiales públicos transgénero
broader: LGBTQ+ politicians
change note: Version 4.2.0
has top concept: LGBTQ+ politicians
in scheme: v3
preferred label: Políticos transgénero

Intersex politicians
type: Concept
issued: 2023-06-28
modified: 2025-02-23
comment: Intersex people who are candidates for public office, are currently holding public office, or have held political positions. Politicians can be elected by public election or otherwise appointed.
comment: Personas intersex que son candidatas a cargos públicos, que actualmente ocupan cargos públicos o han ocupado cargos políticos. Los políticos pueden ser elegidos mediante elección pública o designados de otro modo.
alternative label: Intersex public officials
alternative label: Oficiales públicos intersex
broader: LGBTQ+ politicians
change note: Version 4.2.0
has top concept: LGBTQ+ politicians
in scheme: v3
preferred label: Políticos intersex

Asexual politicians
type: Concept
issued: 2023-06-28
modified: 2025-02-23
comment: Asexual people who are candidates for public office, are currently holding public office, or have held political positions. Politicians can be elected by public election or otherwise appointed.
comment: Personas asexuales que son candidatas a cargos públicos, ocupan actualmente cargos públicos o han ocupado cargos políticos. Los políticos pueden ser elegidos por sufragio público o designados de otro modo.
alternative label: Asexual public officials
alternative label: Oficiales públicos asexuales
alternative label: Oficiales públicas asexuales
broader: LGBTQ+ politicians
change note: Version 4.2.0
has top concept: LGBTQ+ politicians
in scheme: v3
preferred label: Políticos asexuales

17-beta hydroxysteroid dehydrogenase 3 deficiency
type: Concept
issued: 2023-06-28
modified: 2025-02-23
comment: People with 17-beta hydroxysteroid dehydrogenase 3 deficiency, abbreviated as "17-beta," have XY chromosomes and testes, but their bodies do not have one of the enzymes needed to synthesize testosterone. Most people with 17-beta are born with a vulva and vagina, and their testes are most often undescended. Some people with 17-beta will be born with genitals that do not clearly resemble a typical penis or a typical vulva. Some will have a penis that may be smaller than typical (known as a micropenis), and the urethra may open on the underside of the penis rather than at the tip (known as hypospadias). In adolescence, people with 17-beta will often develop some secondary sex characteristics associated with a typical testosterone puberty.
comment: Las personas con deficiencia de 17-beta hidroxiesteroide deshidrogenasa 3, abreviada como "17-beta", tienen cromosomas XY y testículos, pero su sus cuerpos carecen de una de las enzimas necesarias para sintetizar la testosterona. La mayoría de las personas con 17-beta nacen con vulva y vagina, y sus testículos no suelen descender. Algunas personas con 17-beta nacen con genitales que no se parecen claramente a un pene típico o a una vulva típica. Algunas tendrán un pene más pequeño de lo normal (lo que se conoce como micropene) y la uretra puede abrirse en la parte inferior del pene en lugar de en la punta (lo que se conoce como hipospadias). En la adolescencia, las personas con 17-beta a menudo desarrollarán algunas características sexuales secundarias asociadas a una pubertad típica con testosterona.
alternative label: 17-beta
broader: Intersex variations
change note: Version 4.2.0
has top concept: Sex (Body)
in scheme: v3
preferred label: Deficiencia de 17-beta hidroxiesteroide deshidrogenasa 3

Ambiguous genitalia
type: Concept
issued: 2023-06-28
modified: 2025-02-23
comment: A term used to describe a birth variation in which the outer genitals do not have the typical appearance of those associated with either boys or girls. This is often the first sign many doctors and parents see that indicate their child has an intersex variation. Ambiguous genitalia can be caused by a variety of variations and rarely require immediate surgical intervention as long as the child is able to excrete and urinate without complications. Many intersex people find this term stigmatizing, so it should not be used unless the individual uses it to describe themselves.
comment: Término utilizado para describir una variación del nacimiento en la que los genitales externos no tienen la apariencia típica de los asociados con niños o niñas. Esta es a menudo la primera señal que ven muchos médicos y padres que indica que su hijo tiene una variación intersex. Los genitales ambiguos pueden deberse a una variedad de variaciones y rara vez requieren una intervención quirúrgica inmediata, siempre que el niño pueda excretar y orinar sin complicaciones. Muchas personas intersex encuentran este término estigmatizante, por lo que no debe usarse a menos que la persona lo use para describirse a sí misma.
broader: Intersex variations
change note: Version 4.2.0
has top concept: Sex (Body)
in scheme: v3
preferred label: Genitales ambiguos

Anorchia
type: Concept
issued: 2023-06-28
modified: 2025-02-23
comment: A person with anorchia has 46 XY chromosomes and is born without testes. As a result, they do not produce typical levels of testosterone. Someone with anorchia will usually have a typical-appearing penis and scrotum because these organs are already formed by the stage of fetal development when the testes disappear.
comment: Una persona con anorquia tiene 46 cromosomas XY y nace sin testículos. Como resultado, no producen niveles típicos de testosterona. Alguien con anorquia generalmente tiene un pene y un escroto de apariencia típica porque estos órganos ya están formados en la etapa de desarrollo fetal en la que desaparecen los testículos.
broader: Intersex variations
change note: Version 4.2.0
has top concept: Sex (Body)
in scheme: v3
preferred label: Anorquia

Aromatase deficiency
type: Concept
issued: 2023-06-28
modified: 2025-02-23
comment: People with aromatase deficiency do not have the enzyme responsible for converting androgens into estrogen. At birth, someone with aromatase deficiency and XX chromosomes may have a larger-than-typical clitoris and partially or completely fused labia (resembling the appearance of a scrotum). At puberty, they may not develop breasts, may not begin menstruating, and may develop some secondary sex characteristics associated with a typical testosterone puberty. They may also develop multiple cysts on their ovaries. People with XY chromosomes can also have aromatase deficiency, but they do not typically experience variations in their sex characteristics, though they may grow taller than is typical because estrogen is usually responsible for closing the bone growth plates.
comment: Las personas con deficiencia de aromatasa no tienen la enzima responsable de convertir los andrógenos en estrógeno. Al nacer, una persona con deficiencia de aromatasa y cromosomas XX puede tener un clítoris más grande de lo típico y labios vaginales parcial o completamente fusionados (que se asemejan a la apariencia de un escroto). En la pubertad, es posible que no desarrollen senos, que no comiencen a menstruar y que desarrollen algunas características sexuales secundarias asociadas con una pubertad típica de testosterona. También pueden desarrollar múltiples quistes en los ovarios. Las personas con cromosomas XY también pueden tener deficiencia de aromatasa, pero normalmente no experimentan variaciones en sus características sexuales, aunque pueden crecer más de lo normal porque el estrógeno suele ser responsable de cerrar las placas de crecimiento óseo.
broader: Intersex variations
change note: Version 4.2.0
has top concept: Sex (Body)
in scheme: v3
preferred label: Deficiencia de aromatasa

Aromatase excess syndrome
type: Concept
issued: 2023-06-28
modified: 2025-02-23
comment: People with aromatase excess have increased production of aromatase, which converts androgens (like testosterone) into estrogen. People with XY chromosomes and aromatase excess syndrome will therefore have more active estrogen in their bodies than is typical. As a result, they will often stop growing at a shorter height and/or develop breasts in adolescence along with features associated with a typical testosterone puberty. People with XX chromosomes can also have aromatase excess, but it doesn't usually cause their sex characteristics to vary from what is considered typical for those assigned female at birth, though they may also experience breast enlargement and short stature, along with menstrual irregularities.
comment: Las personas con exceso de aromatasa tienen una mayor producción de aromatasa, que convierte los andrógenos (como la testosterona) en estrógeno. Por lo tanto, las personas con cromosomas XY y síndrome de exceso de aromatasa tendrán estrógenos más activos en sus cuerpos de lo habitual. Como resultado, a menudo dejarán de crecer a una altura baja y/o desarrollarán senos en la adolescencia junto con características asociadas con una pubertad típica de testosterona. Las personas con cromosomas XX también pueden tener un exceso de aromatasa, pero esto no suele hacer que sus características sexuales varíen de lo que se considera típico para las personas asignadas al sexo femenino al nacer, aunque también pueden experimentar agrandamiento de los senos y baja estatura, junto con irregularidades menstruales.
alternative label: Familial gynecomastia
alternative label: Hyperestrogenism
broader: Intersex variations
change note: Version 4.2.0
has top concept: Sex (Body)
in scheme: v3
preferred label: Síndrome de exceso de la aromatasa

Bladder exstrophy
type: Concept
issued: 2023-06-28
modified: 2025-02-23
comment: People with bladder exstrophy are born with their urinary bladder exposed (through an open abdominal wall) or outside of the body. They may also have an open pelvis (resulting from the pubic bones not joining together), which causes genital differences. People with bladder exstrophy and XY chromosomes often have a shorter-than-typical penis with epispadias (meaning the urethra opens on the top surface of the penis instead of at the tip) and undescended testes. People with XX chromosomes and bladder exstrophy often have a urethra that is placed higher than usual, widely spaced labia (due to the wide spacing of their pubic bones), and a clitoris formed in two halves with a split in the middle.
comment: Las personas con extrofia vesical nacen con la vejiga urinaria expuesta (a través de una pared abdominal abierta) o fuera del cuerpo. También pueden tener la pelvis abierta (como resultado de que los huesos del pubis no se unieran), lo que provoca diferencias genitales. Las personas con extrofia vesical y cromosomas XY suelen tener un pene más corto de lo normal con epispadias (lo que significa que la uretra se abre en la superficie superior del pene en lugar de en la punta) y testículos no descendidos. Las personas con cromosomas XX y extrofia vesical a menudo tienen una uretra posicionada más alta de lo usual, labios vaginales muy espaciados (debido al gran espacio entre los huesos púbicos) y un clítoris formado en dos mitades con una división en el medio.
broader: Intersex variations
change note: Version 4.2.0
has top concept: Sex (Body)
in scheme: v3
preferred label: Extrofia vesical

Chimeras
type: Concept
issued: 2023-06-28
modified: 2025-02-23
comment: Chimeras, or people with chimerism, have two different sets of DNA. This happens when a person is pregnant with fraternal twins, but the embryos combine into one fetus.
comment: Quimeras, o personas con quimerismo, tienen dos tipos de ADN. Esto ocurre cuando una persona está embarazada con gemelos fraternos, pero los embriones se combinan en un solo feto.
alternative label: Human chimeras
alternative label: Quimeras humanas
broader: Intersex people
change note: Version 4.2.0
has top concept: LGBTQ+ people
in scheme: v3
preferred label: Quimeras

Chimerism
type: Concept
issued: 2023-06-28
modified: 2025-02-23
comment: Term used to describe the variation in which a person is born with two or more different sets of DNA. This can occur when multiple zygotes (such as fraternal twins) combine and develop into one fetus. Sex-chromosome discordant chimerism occurs when at least one embryo with XX chromosomes fuses with at least one embryo with XY chromosomes. A person who develops this way would have sets of both XX and XY chromosomes, or a chromosome pattern of 46XX/46XY, and could have a wide variety of different possible sex characteristics. Many people with chimerism and XX/XY chromosomes have both ovarian and testicular tissue, while others have only testes or only ovaries, and still others have gonadal dysgenesis. Some have noticeable genital differences and others do not.
comment: Término utilizado para describir la variación en la que una persona nace con dos o más tipos de ADN. Esto puede ocurrir cuando varios cigotos (como los gemelos fraternos) se combinan y forman un solo feto. El quimerismo discordante de cromosomas sexuales ocurre cuando al menos un embrión con cromosomas XX se fusiona con al menos un embrión con cromosomas XY. Una persona que se desarrolla de esta manera tendría conjuntos de cromosomas XX y XY, o un patrón cromosómico de 46XX/46XY, y podría tener una amplia variedad de posibles características sexuales diferentes. Muchas personas con quimerismo y cromosomas XX/XY tienen tejido ovárico y testicular, mientras que otras solo tienen testículos o solo ovarios, y otras tienen disgenesia gonadal. Algunos tienen diferencias genitales notables y otros no.
broader: Intersex variations
change note: Version 4.2.0
has top concept: Sex (Body)
in scheme: v3
preferred label: Quimerismo

Cloacal exstrophy
type: Concept
issued: 2023-06-28
modified: 2025-02-23
comment: People born with cloacal exstrophy are born with an open abdominal wall exposing their colon, bladder, and sometimes other abdominal organs. Their organs may also be positioned outside of the body at birth. The bladder is often split into two halves, and the colon and bladder may be connected. The anal opening may be blocked or not have been formed. The pubic bones do not join together, resulting in an open pelvis with noticeable genital differences. People with XY chromosomes and cloacal exstrophy may have a smaller-than-typical penis that is flat or split into two halves with an epispadic urethra (opening on the top of the penis rather than at the tip) and undescended testes. Someone with XX chromosomes and cloacal exstrophy usually has a clitoris that is split into two halves, and they may have two vaginal openings.
comment: Las personas que nacen con extrofia cloacal nacen con la pared abdominal abierta, exponiendo el colon, la vejiga y, a veces, otros órganos abdominales. Sus órganos también pueden estar ubicados fuera del cuerpo al nacer. La vejiga suele estar dividida en dos mitades, y el colon y la vejiga pueden estar conectados. La apertura anal puede estar bloqueada o no haberse formado. Los huesos púbicos no se unen, lo que resulta en una pelvis abierta con diferencias genitales notables. Las personas con cromosomas XY y extrofia cloacal pueden tener un pene más pequeño de lo usual, plano o dividido en dos mitades con una uretra epispádica (que se abre en la parte superior del pene en lugar de la punta) y testículos no descendidos. Alguien con cromosomas XX y extrofia cloacal suele tener un clítoris dividido en dos mitades y puede tener dos aperturas vaginales.
alternative label: Síndrome de OEIS
broader: Intersex variations
change note: Version 4.2.0
has top concept: Sex (Body)
in scheme: v3
preferred label: Extrofia cloacal

Complete androgen insensitivity syndrome
type: Concept
issued: 2023-06-28
modified: 2025-02-23
comment: People with complete androgen insensitivity syndrome (CAIS) have no response to androgens and are born with a vulva and clitoris, as well as a shorter-than-typical vagina and undescended testes. In adolescence, they will develop breasts and other features associated with a typical estrogen puberty due to the body’s natural conversion of testosterone to estrogen. However, people with CAIS do not menstruate because they do not have a uterus or ovaries.
comment: Las personas con síndrome de insensibilidad androgénica completa (CAIS) no responden a los andrógenos y nacen con vulva y clítoris, así como con una vagina más corta de lo usual y testículos no descendidos. En la adolescencia, desarrollarán senos y otras características asociadas con una pubertad típica de estrógeno debido a la conversión natural de testosterona en estrógeno por parte del cuerpo. Sin embargo, las personas con CAIS no menstrúan porque no tienen útero ni ovarios.
alternative label: CAIS
broader: Intersex variations
change note: Version 4.2.0
has top concept: Sex (Body)
in scheme: v3
preferred label: Síndrome de insensibilidad androgénica completa

Complete gonadal dysgenesis
type: Concept
issued: 2023-06-28
modified: 2025-02-23
comment: People with complete gonadal dysgenesis are born with XX or XY chromosomes and gonadal tissue that has not developed into testicles or ovaries (also known as streak gonads). They are generally born with a vulva and vagina, and they will not usually develop secondary sex characteristics at puberty because streak gonads do not produce hormones.
comment: Las personas con disgenesia gonadal completa nacen con cromosomas XX o XY y con tejido gonadal que no se ha desarrollado en testículos u ovarios (también conocido como gónadas rayadas). Tienden a nacer con vulva y vagina, y usualmente no desarrollan características sexuales secundarias en la pubertad porque las gónadas rayadas no producen hormonas.
alternative label: Pure gonadal dysgenesis
alternative label: Síndrome de Swyer
broader: Androgen insensitivity syndrome
change note: Version 4.2.0
has top concept: Sex (Body)
in scheme: v3
preferred label: Disgenesia gonadal completa

Congenital chordee
type: Concept
issued: 2023-06-28
modified: 2025-02-23
comment: People born with congenital chordee have a penis that curves upward or downward or bends to one side, usually due to bands of fibrous tissue that pull the penis in a particular direction. People with congenital chordee often have hypospadias, meaning that their urethral opening is not at the tip of the penis.
comment: Las personas que nacen con cuerda congénita tienen un pene que se curva hacia arriba o hacia abajo o se dobla hacia un lado, generalmente debido a bandas de tejido fibroso que tiran del pene en una dirección particular. Las personas con cuerda congénita suelen tener hipospadias, lo que significa que la apertura uretral no está en la punta del pene.
alternative label: Encordamiento peneano
alternative label: Cuerda congénita
alternative label: Curvatura peniana ventral
broader: Intersex variations
change note: Version 4.2.0
has top concept: Sex (Body)
in scheme: v3
preferred label: Chordee peneano

Cryptorchidism
type: Concept
issued: 2023-06-28
modified: 2025-02-23
comment: An intersex variation in which one or both of the testes do not descend from the abdomen into the scrotum. If both testes are undescended, this is known as "bilateral cryptorchidism," whereas "unilateral cryptorchidism" occurs when only one the testes does not descend.
comment: Una variación intersex en la que uno o ambos testículos no descienden del abdomen al escroto. Si ambos testículos no descienden, esto se conoce como "criptorquidia bilateral", mientras que la "criptorquidia unilateral" ocurre cuando solo uno de los testículos no desciende.
alternative label: Undescended testes
alternative label: Undescended testicles
alternative label: Testículos no descendidos
broader: Intersex variations
change note: Version 4.2.0
has top concept: Sex (Body)
in scheme: v3
preferred label: Criptorquidia

De la Chapelle syndrome
type: Concept
issued: 2023-06-28
modified: 2025-02-23
comment: De la Chapelle syndrome causes people with XX chromosomes to be born with a penis and testes. This usually happens because a particular gene typically seen on Y chromosomes (known as the SRY gene) ends up on one of their X chromosomes and causes their genitals and internal reproductive organs to develop as they typically would in someone with XY chromosomes. People with de la Chapelle might have testes that are smaller than typical or that are undescended, and they are often infertile. In adolescence, they may experience breast growth, and they might not develop the characteristics that are usually associated with a typical testosterone puberty.
comment: El síndrome de De la Chapelle provoca que las personas con cromosomas XX nazcan con pene y testículos. Esto suele suceder porque un gen particular que normalmente se ve en los cromosomas Y (conocido como el gen SRY) termina en uno de los cromosomas X y provoca que sus genitales y órganos reproductivos internos se desarrollen como lo harían normalmente en alguien con cromosomas XY. Las personas con De la Chapelle pueden tener testículos más pequeños de lo usual o que no han descendido y, a menudo, son infértiles. En la adolescencia, pueden experimentar crecimiento de los senos y es posible que no desarrollen las características que generalmente se asocian con una pubertad típica de testosterona.
alternative label: XX male syndrome
alternative label: Síndrome del varón XX
broader: Intersex variations
change note: Version 4.2.0
has top concept: Sex (Body)
in scheme: v3
preferred label: Síndrome de De la Chapelle

Epispadias
type: Concept
issued: 2023-06-28
modified: 2025-02-23
comment: People with epispadias are born with a urinary opening located on the upper surface of their penis rather than at the tip (similar to the more common variation hypospadias). People with vulvas can also be born with epispadias, in which case the urethral opening is wider and located higher than typical. The clitoris may also be split into two halves. Epispadias is usually present whenever bladder exstrophy or cloacal exstrophy develop, but epispadias can also occur by itself.
comment: Las personas con epispadias nacen con una apertura urinaria ubicada en la superficie superior del pene en lugar de en la punta (similar a la variación más común de hipospadias). Las personas con vulva también pueden nacer con epispadias, en cuyo caso la apertura uretral es más ancha y está situada más arriba de lo normal. El clítoris también puede dividirse en dos mitades. El epispadias suele estar presente cuando se desarrolla extrofia de la vejiga o extrofia cloacal, pero el epispadias también puede ocurrir por sí solo.
alternative label: Anaspadias
broader: Intersex variations
change note: Version 4.2.0
has top concept: Sex (Body)
in scheme: v3

Estrogen insensitivity syndrome
type: Concept
issued: 2023-06-28
modified: 2025-02-23
comment: People with estrogen insensitivity syndrome (EIS) have a genetic variation in which their bodies do not respond to estrogen. People with XX chromosomes and EIS are usually born with a vulva and vagina, may have a small uterus and enlarged ovaries that later develop multiple cysts, and may produce very high levels of estrogen that their bodies do not recognize. In adolescence, they will most likely not experience the changes associated with a typical estrogen puberty such as breast development or menstruation. They may instead develop pubic hair and acne due to the influence of androgens. People with XY chromosomes can also be born with EIS, and they may or may not experience variations in their other hormone production, testicular development, and development of secondary sex characteristics as a result.
comment: Las personas con síndrome de insensibilidad al estrógeno (SIE) tienen una variación genética en la que sus cuerpos no responden al estrógeno. Las personas con cromosomas XX y SIE generalmente nacen con vulva y vagina, pueden tener un útero pequeño y ovarios agrandados que luego desarrollan múltiples quistes y pueden producir niveles muy altos de estrógeno que sus cuerpos no reconocen. En la adolescencia, lo más probable es que no experimenten los cambios asociados con una pubertad típica con estrógenos, como el desarrollo de los senos o la menstruación. En cambio, pueden desarrollar vello púbico y acné debido a la influencia de los andrógenos. Las personas con cromosomas XY también pueden nacer con SIE y, como resultado, pueden o no experimentar variaciones en la producción de otras hormonas, el desarrollo testicular y el desarrollo de características sexuales secundarias.
alternative label: EIS
alternative label: SIA
broader: Intersex variations
change note: Version 4.2.0
has top concept: Sex (Body)
in scheme: v3
preferred label: Síndrome de insensibilidad a los estrógenos

Follicle-stimulating hormone insensitivity
type: Concept
issued: 2023-06-28
modified: 2025-02-23
comment: People with follicle-stimulating hormone (FSH) insensitivity have a genetic variation where their bodies do not respond to FSH. People with XX chromosomes and FSH insensitivity will usually be born with a vulva, vagina, and ovaries. Their ovaries may produce lower amounts of estrogen than is considered typical, and they may not produce fertile follicles (eggs). In adolescence, they may not develop secondary sex characteristics associated with a typical estrogen puberty and may not menstruate. People with XY chromosomes and FSH insensitivity may develop smaller-than-typical testes, may produce fewer sperm than usual, and may not be fertile.
comment: Las personas con insensibilidad a la hormona foliculoestimulante (FSH) tienen una variación genética por lo que su cuerpo no responde a la FSH. Las personas con cromosomas XX e insensibilidad a la FSH suelen nacer con vulva, vagina y ovarios. Sus ovarios pueden producir menores cantidades de estrógeno a las consideradas típicas y es posible que no produzcan folículos fértiles (óvulos). En la adolescencia, es posible que no desarrollen las características sexuales secundarias asociadas a una pubertad típica con estrógenos y que no menstrúen. Las personas con cromosomas XY e insensibilidad a la FSH pueden desarrollar testículos más pequeños de lo usual, producir menos espermatozoides de lo habitual y no ser fértiles.
alternative label: FSH
alternative label: FSH insensitivity
broader: Intersex variations
change note: Version 4.2.0
has top concept: Sex (Body)
in scheme: v3
preferred label: Insensibilidad a la hormona foliculoestimulante

Fraser syndrome
type: Concept
issued: 2023-06-28
modified: 2025-02-23
comment: People with Fraser syndrome are usually born with differences in the development of their eyelids, fingers, and toes. They may also have variations in their sex characteristics, such as a larger-than-typical clitoris or undescended testes. They may develop without one or both kidneys, and other parts of the urinary system can additionally be affected.
comment: Las personas con síndrome de Fraser suelen nacer con diferencias en el desarrollo de los párpados, los dedos de las manos y de los pies. También pueden tener variaciones en sus características sexuales, como un clítoris más grande de lo típico o testículos no descendidos. Pueden desarrollarse sin uno o ambos riñones, y otras partes del sistema urinario también pueden verse afectadas.
broader: Intersex variations
change note: Version 4.2.0
has top concept: Sex (Body)
in scheme: v3
preferred label: Síndrome de Fraser

Gonadectomy
type: Concept
issued: 2023-06-28
modified: 2025-02-23
comment: Surgical procedure to remove the gonads, including testes and ovaries.
comment: Procedimiento quirúrgico para extirpar las gónadas, incluidos los testículos y los ovarios.
broader: Bottom surgery
change note: Version 4.2.0
has top concept: Medical care
in scheme: v3
preferred label: Gonadectomía

Hyperandrogenism
type: Concept
issued: 2023-06-28
modified: 2025-02-23
comment: People with hyperandrogenism have higher-than-typical levels of testosterone and/or other androgens. In people with XX chromosomes, hyperandrogenism can result in the development of secondary sex characteristics that are associated with the influence of testosterone (such as facial and body hair) to varying degrees. Hyperandrogenism may or may not be the result of an underlying intersex variation, but it is common in several variations (including CAH and PCOS). People with hyperandrogenism who aren’t intersex will nonetheless often have many experiences in common with intersex people, such as encountering exclusion and discrimination in sex-segregated contexts like sports.
comment: Las personas con hiperandrogenismo tienen niveles de testosterona y/u otros andrógenos más altos de lo normal. En personas con cromosomas XX, el hiperandrogenismo puede resultar en el desarrollo de características sexuales secundarias que están asociadas con la influencia de la testosterona (como el vello facial y corporal) en diversos grados. El hiperandrogenismo puede o no ser el resultado de una variación intersex subyacente, pero es común en varias variaciones (incluidas CAH y SOP). Sin embargo, las personas con hiperandrogenismo que no son intersex suelen tener muchas experiencias en común con las personas intersex, como enfrentarse a la exclusión y la discriminación en contextos segregados por sexo, como los deportes.
broader: Intersex variations
change note: Version 4.2.0
has top concept: Sex (Body)
in scheme: v3
preferred label: Hiperandrogenismo

Hypogonadism
type: Concept
issued: 2023-06-28
modified: 2025-02-23
comment: People with hypogonadism produce lower-than-typical levels of hormones like testosterone and estrogen, or none at all. This can affect how a person’s secondary sex characteristics develop as well as their fertility. Hypogonadism can be a result of a difference in how someone’s brain signals for their gonads to produce (or not produce) hormones, or it can be a feature of their gonads directly. Hypogonadism is not always caused by an intersex variation, but can be related to Klinefelter syndrome, Turner syndrome, and several other variations.
comment: Las personas con hipogonadismo producen niveles de hormonas como testosterona y estrógeno más bajos de lo normal, o ninguno en absoluto. Esto puede afectar el desarrollo de las características sexuales secundarias de una persona, así como su fertilidad. El hipogonadismo puede ser el resultado de una diferencia en la forma en que el cerebro de una persona envía señales a sus gónadas para que produzcan (o no produzcan) hormonas, o puede ser una característica de sus gónadas directamente. El hipogonadismo no siempre es causado por una variación intersex, pero puede estar relacionado con el síndrome de Klinefelter, el síndrome de Turner y varias otras variaciones.
broader: Intersex variations
change note: Version 4.2.0
has top concept: Sex (Body)
in scheme: v3
preferred label: Hipogonadismo

Intersexual
type: Concept
is replaced by: homoit0000352
issued: 2023-06-28
modified: 2023-12-08
comment: This term is not common in the English language as to not confuse intersex with a gender identity or sex orientation by adding "ual" but it is used in other languages such as Spanish to mean "intersex."
alternative label: Intersex
change note: Version 4.2.0
in scheme: v3

Isolated 17,20-lyase deficiency
type: Concept
issued: 2023-06-28
modified: 2025-02-23
comment: People with isolated 17,20-lyase deficiency (ILD) have one of several specific variations in their genes that cause their bodies to make lower-than-typical amounts of testosterone. They may be born with genitals that do not appear quite like a typical penis, and their testes may be descended or undescended. In adolescence, they may not experience all of the changes related to a typical testosterone puberty because their variation impacts their hormone production.
alternative label: ILD
broader: Intersex variations
change note: Version 4.2.0
has top concept: Sex (Body)
in scheme: v3

Asexual survivors of hate crimes
type: Concept
issued: 2023-06-28
modified: 2025-02-23
comment: Asexual people who have experienced and survived hate crimes; follow the individual's preference for "victims" or "survivors" whenever possible.
comment: Personas asexuales que han sufrido y sobrevivido a crímenes de odio; siga la preferencia de la persona sobre el uso de "víctimas" o "sobrevivientes" siempre que sea posible.
broader: LGBTQ+ survivors of hate crimes
change note: Version 4.2.0
has top concept: LGBTQ+ people
in scheme: v3
preferred label: Sobrevivientes asexuales de crímenes de odio

Asexual survivors of rape
type: Concept
issued: 2023-06-28
modified: 2025-02-23
comment: Asexual people who have experienced and survived rape; follow the individual's preference for "victims" or "survivors" whenever possible.
comment: Personas asexuales que han sufrido y sobrevivido a una violación; siga la preferencia de la persona sobre el uso de "víctimas" o "sobrevivientes" siempre que sea posible.
broader: LGBTQ+ survivors of rape
change note: Version 4.2.0
has top concept: LGBTQ+ people
in scheme: v3
preferred label: Sobrevivientes asexuales de violación

Asexual survivors of sexual abuse
type: Concept
issued: 2023-06-28
modified: 2025-02-23
comment: Asexual people who have experienced and survived sexual abuse; follow the individual's preference for "victims" or "survivors" whenever possible.
comment: Personas asexuales que han sufrido y sobrevivido a abusos sexuales; siga la preferencia de la persona sobre el uso de "víctimas" o "sobrevivientes" siempre que sea posible.
broader: LGBTQ+ survivors of sexual abuse
change note: Version 4.2.0
has top concept: LGBTQ+ people
in scheme: v3
preferred label: Sobrevivientes asexuales de abuso sexual

Asexual survivors of war
type: Concept
issued: 2023-06-28
modified: 2025-02-23
comment: Asexual people who have experienced and survived war; follow the individual's preference for "victims" or "survivors" whenever possible.
comment: Personas asexuales que han sufrido y sobrevivido a la guerra; siga la preferencia de la persona sobre el uso de "víctimas" o "sobrevivientes" siempre que sea posible.
broader: LGBTQ+ survivors of war
change note: Version 4.2.0
has top concept: LGBTQ+ people
in scheme: v3
preferred label: Sobrevivientes asexuales de guerra

Asexual television
type: Concept
issued: 2023-06-28
modified: 2025-02-23
comment: Television shows featuring asexual characters or themes.
comment: Programas de televisión con personajes o temas asexuales.
broader: LGBTQ+ television
change note: Version 4.2.0
has top concept: LGBTQ+ television
in scheme: v3
preferred label: Televisión asexual

Asexual victims of rape
type: Concept
issued: 2023-06-28
modified: 2025-02-23
comment: Asexual people who have experienced rape and may or may not have survived; follow the individual's preference for "victims" or "survivors" whenever possible.
comment: Personas asexuales que han sufrido una violación y pueden haber sobrevivido o no; siga la preferencia de la persona sobre el uso de "víctimas" o "sobrevivientes" siempre que sea posible.
broader: LGBTQ+ victims of rape
change note: Version 4.2.0
has top concept: LGBTQ+ people
in scheme: v3
preferred label: Víctimas asexuales de violación

Asexual victims of sexual abuse
type: Concept
issued: 2023-06-28
modified: 2025-02-23
comment: Asexual people who have experienced sexual abuse and may or may not have survived; follow the individual's preference for "victims" or "survivors" whenever possible.
comment: Personas asexuales que han sufrido abuso sexual y pueden haber sobrevivido o no; siga la preferencia de la persona sobre el uso de "víctimas" o "sobrevivientes" siempre que sea posible.
broader: LGBTQ+ victims of sexual abuse
change note: Version 4.2.0
has top concept: LGBTQ+ people
in scheme: v3
preferred label: Víctimas asexuales de abuso sexual

Asexual victims of war
type: Concept
issued: 2023-06-28
modified: 2025-02-23
comment: Asexual people who have experienced war and may or may not have survived; follow the individual's preference for "victims" or "survivors" whenever possible.
comment: Personas asexuales que han sufrido la guerra y que pueden haber sobrevivido o no; siga la preferencia de la persona sobre el uso de "víctimas" o "sobrevivientes" siempre que sea posible.
broader: LGBTQ+ victims of war
change note: Version 4.2.0
has top concept: LGBTQ+ people
in scheme: v3
preferred label: Víctimas asexuales de guerra

Asexual victims' rights
type: Concept
issued: 2023-06-28
modified: 2025-02-23
comment: Asexual people’s legal rights to be informed, present, and heard within the criminal justice system after having been harmed or injured as the result of a crime, accident, or other event.
comment: Los derechos legales de las personas asexuales a estar informadas, estar presentes y ser escuchadas dentro del sistema de justicia penal después de haber sido perjudicadas o lesionadas como resultado de un delito, una accidente u otro evento.
broader: LGBTQ+ victims' rights
change note: Version 4.2.0
has top concept: Law
in scheme: v3
preferred label: Derechos de víctimas asexuales

Asexual-focused businesses
type: Concept
issued: 2023-06-28
modified: 2025-02-23
comment: Businesses focusing on asexual clientele and products related to asexual communities.
comment: Empresas enfocadas clientela asexual y productos relacionados con comunidades asexuales.
alternative label: Empresas orientadas a personas asexuales
alternative label: Compañías orientadas a personas asexuales
broader: LGBTQ+-focused businesses
change note: Version 4.2.0
has top concept: LGBTQ+-focused businesses
in scheme: v3
preferred label: Negocios orientados a personas asexuales

Asexual-owned businesses
type: Concept
issued: 2023-06-28
modified: 2025-02-23
comment: Businesses owned by asexual people.
comment: Empresas pertenecientes a personas asexuales.
alternative label: Negocios de dueños asexuales
alternative label: Compañías de dueños asexuales
alternative label: Empresas de propietarios asexuales
alternative label: Negocios de dueñas asexuales
alternative label: Compañías de dueñas asexuales
alternative label: Empresas de propietarias asexuales
broader: LGBTQ+-owned businesses
change note: Version 4.2.0
has top concept: LGBTQ+-owned businesses
in scheme: v3
preferred label: Negocios propiedad de personas asexuales

Jacobs syndrome
type: Concept
issued: 2023-06-28
modified: 2025-02-23
comment: People with Jacobs syndrome develop with an extra Y chromosome. They might not have any obvious physical variations as a result, or they may be taller than usual or have other identifiable differences that do not relate to sex characteristics. Some people with Jacobs syndrome may also have a smaller-than-typical penis or scrotum, hypospadias, and/or undescended testicles.
comment: Las personas con síndrome de Jakob se desarrollan con un cromosoma Y adicional. Como resultado, es posible que no tengan variaciones físicas obvias, o puede que sean más altas de lo habitual o tener otras diferencias identificables que no se relacionan con las características sexuales. Algunas personas con síndrome de Jakob también pueden tener un pene o escroto más pequeño de lo normal, hipospadias y/o testículos no descendidos.
alternative label: 47XYY
alternative label: XYY syndrome
alternative label: Síndrome XYY
alternative label: Síndrome del supermacho
broader: Intersex variations
change note: Version 4.2.0
has top concept: Sex (Body)
in scheme: v3
preferred label: Síndrome de Jakob

Kallmann syndrome
type: Concept
issued: 2023-06-28
modified: 2025-02-23
comment: Kallmann syndrome can occur in people with XX or XY chromosomes and is a form of hypogonadism. People with Kallmann syndrome and XY chromosomes are often born with a smaller-than-typical penis and undescended testes. In adolescence, most people with Kallmann syndrome will either start puberty later than usual or not experience typical pubertal changes (such as developing facial hair and a deeper voice for people with XY chromosomes or developing breasts and starting to menstruate for people with XX chromosomes) unless they receive hormone therapy. Kallmann syndrome also affects someone’s sense of smell.
comment: El síndrome de Kallmann puede ocurrir en personas con cromosomas XX o XY y es una forma de hipogonadismo. Las personas con síndrome de Kallmann y cromosomas XY suelen nacer con un pene más pequeño de lo normal y testículos no descendidos. En la adolescencia, la mayoría de las personas con síndrome de Kallmann comenzarán la pubertad más tarde de lo habitual o no experimentarán los cambios puberales típicos (como desarrollar vello facial y una voz más grave en las personas con cromosomas XY o desarrollar senos y comenzar a menstruar en las personas con cromosomas XX) a menos que reciben terapia hormonal. El síndrome de Kallmann también afecta el sentido del olfato.
alternative label: Hypogonadotropic hypogonadism
broader: Intersex variations
change note: Version 4.2.0
has top concept: Sex (Body)
in scheme: v3
preferred label: Síndrome de Kallmann

Luteinizing hormone insensitivity
type: Concept
issued: 2023-06-28
modified: 2025-02-23
comment: People with XY chromosomes and luteinizing hormone insensitivity develop the variation Leydig cell hypoplasiae. Because people with XX chromosomes do not typically produce Leydig cells to begin with, someone with XX chromosomes who has a genetic insensitivity to luteinizing hormone will not be affected in the same way. A person with XX chromosomes whose body does not respond to luteinizing hormone will not usually have any noticeable differences at birth, but their ovaries may not produce fertile follicles (eggs), and they may not menstruate.
broader: Intersex variations
change note: Version 4.2.0
has top concept: Sex (Body)
in scheme: v3

Mild androgen insensitivity syndrome
type: Concept
issued: 2023-06-28
modified: 2025-02-23
comment: People with mild androgen insensitivity syndrome (MAIS) respond to testosterone at a somewhat reduced level compared to typical levels, which means that they will usually be born with a penis (which may or may not be smaller than typical) and will later develop secondary sex characteristics associated with a typical testosterone puberty. Because their bodies convert a small amount of their naturally produced androgens into estrogen, they may have visible variations in features, such as the amount of facial hair, body hair, or muscle tone they develop. They may also experience some breast development during puberty.
comment: Las personas con síndrome de insensibilidad androgénica leve (MAIS, por sus siglas en inglés) responden a la testosterona a un nivel algo reducido en comparación con los niveles típicos, lo que significa que generalmente nacerán con un pene (que puede o no ser más pequeño de lo típico) y luego desarrollarán características sexuales secundarias asociadas con una pubertad típica de testosterona. Debido a que sus cuerpos convierten una pequeña cantidad de los andrógenos producidos naturalmente en estrógeno, pueden tener variaciones visibles en sus rasgos, como la cantidad de vello facial, vello corporal o el tono muscular que desarrollen. También pueden experimentar cierto desarrollo mamario durante la pubertad.
alternative label: MAIS
broader: Androgen insensitivity syndrome
change note: Version 4.2.0
has top concept: Sex (Body)
in scheme: v3
preferred label: Síndrome de insensibilidad androgénica leve

Mixed gonadal dysgenesis
type: Concept
issued: 2023-06-28
modified: 2025-02-23
comment: People with mixed gonadal dysgenesis are born with a mosaic (usually 45X/46XY) chromosome pattern and may develop some gonadal streak tissue and testicular tissue. They may be born with a vulva or penis, or with visible genital variations. They usually have a partially or completely developed uterus, and they may have combinations of internal reproductive structures such as a fallopian tube and a vas deferens on opposite sides of the body. In adolescence, people with mixed gonadal dysgenesis may develop some secondary sex characteristics associated with a typical testosterone puberty, depending on the amount of hormone-producing testicular tissue they have.
comment: Las personas con disgenesia gonadal mixta nacen con un patrón cromosómico a modo de mosaico (generalmente 45X/46XY) y pueden desarrollar algo de tejido de estriado gonadal y tejido testicular. Pueden nacer con vulva o pene, o con variaciones genitales visibles. Por lo general, tienen un útero parcial o completamente desarrollado y pueden tener combinaciones de estructuras reproductivas internas como una trompa de Falopio y un conducto deferente en lados opuestos del cuerpo. En la adolescencia, las personas con disgenesia gonadal mixta pueden desarrollar algunas características sexuales secundarias asociadas con una pubertad típica de testosterona, dependiendo de la cantidad de tejido testicular productor de hormonas que tengan.
alternative label: Partial gonadal dysgenesis
alternative label: Disgenesia gonadal parcial
broader: Gonadal dysgenesis
change note: Version 4.2.0
has top concept: Sex (Body)
in scheme: v3
preferred label: Disgenesia gonadal mixta

Non-classical congenital adrenal hyperplasia
type: Concept
issued: 2023-06-28
modified: 2025-02-23
comment: Non-classical congenital adrenal hyperplasia (CAH), a subtype of CAH, does not usually become apparent until later in childhood, adolescence, or even young adulthood.
comment: La hiperplasia suprarrenal congénita no clásica (CAH, por sus siglas en inglés), un subtipo de CAH, generalmente no se hace evidente hasta más tarde en la infancia, la adolescencia o incluso en la edad adulta.
alternative label: Late-onset congenital adrenal hyperplasia
broader: Congenital adrenal hyperplasia
change note: Version 4.2.0
has top concept: Sex (Body)
in scheme: v3
preferred label: Hiperplasia suprarrenal congénita tardía

Penoscrotal transposition
type: Concept
issued: 2023-06-28
modified: 2025-02-23
comment: People with penoscrotal transposition are born with a different genital configuration than typical, with their penis located below or in the middle of their scrotum instead of above it. Their scrotum might be bifid (split into two halves), and they may also have hypospadias and/or chordee.
comment: Las personas con transposición penoescrotal nacen con una configuración genital diferente a la típica, con el pene ubicado debajo o en el medio del escroto en lugar de encima. Su escroto puede ser bífido (dividido en dos mitades) y también pueden tener hipospadias y/o cordee.
broader: Intersex variations
change note: Version 4.2.0
has top concept: Sex (Body)
in scheme: v3
preferred label: Transposición penoscrotal

Persistent Müllerian duct syndrome
type: Concept
issued: 2023-06-28
modified: 2025-02-23
comment: People with Persistent Müllerian duct syndrome (PMDS) have XY chromosomes, male-typical reproductive organs and external genitalia, and some component(s) of a female-typical reproductive tract, such as a uterus, fallopian tubes, and/or upper vaginal canal. PMDS occurs when the Müllerian ducts—internal structures that ordinarily break down in an XY fetus—remain and develop as they would in an XX fetus. PMDS is ordinarily not diagnosed at birth, and individuals with this variation often have a male gender identity.
comment: Las personas con síndrome de conducto mülleriano persistente (PMDS, por sus siglas en inglés) tienen cromosomas XY, órganos reproductores y genitales externos típicos masculinos y algunos componentes de un aparato reproductor típico femenino, como útero, trompas de Falopio y/o canal vaginal superior. El SDMP se produce cuando los conductos müllerianos -estructuras internas que normalmente se rompen en un feto XY- permanecen y se desarrollan como lo harían en un feto XX. El SDMP no suele diagnosticarse al nacer, y las personas con esta variante suelen tener una identidad de género masculina.
alternative label: PMDS
broader: Intersex variations
change note: Version 4.2.0
has top concept: Sex (Body)
in scheme: v3
preferred label: Síndrome de persistencia de los conductos müllerianos

Polycystic ovary syndrome
type: Concept
issued: 2023-06-28
modified: 2025-02-23
comment: People with this variation have XX chromosomes and are generally born with a vulva and vagina, a uterus, and ovaries. Later in life, their ovaries often produce higher-than-typical levels of androgens like testosterone. Polycystic ovary syndrome (PCOS) can also result in the development of characteristics such as facial and body hair, and it can interfere with the process of ovulation. This in turn can cause irregular periods or no periods, and people with PCOS may struggle to become pregnant. Some people with PCOS have small cysts (fluid-filled sacs) on their ovaries, but some do not. Signs of PCOS generally will not show up until a person starts menstruating, or later in life.
comment: Las personas con esta variación tienen cromosomas XX y generalmente nacen con vulva y vagina, útero y ovarios. Más adelante en la vida, sus ovarios a menudo producen niveles de andrógenos, como la testosterona, más altos de lo normal. El síndrome de ovario poliquístico (SOP) también puede provocar el desarrollo de características como vello facial y corporal, y puede interferir con el proceso de ovulación. Esto, a su vez, puede provocar períodos irregulares o ausencia de períodos, y las personas con síndrome de ovario poliquístico pueden tener dificultades para quedar embarazadas. Algunas personas con síndrome de ovario poliquístico tienen pequeños quistes (sacos llenos de líquido) en los ovarios, pero otras no. Los signos del síndrome de ovario poliquístico generalmente no aparecen hasta que una persona comienza a menstruar, o más adelante en la vida.
alternative label: PCOD
alternative label: PCOS
alternative label: Polycystic ovarian disease
alternative label: Polycystic ovarian syndrome
alternative label: SOP
broader: Intersex variations
change note: Version 4.2.0
has top concept: Sex (Body)
in scheme: v3
preferred label: Síndrome de ovario poliquístico

Pseudohermaphroditism
type: Concept
issued: 2023-06-28
modified: 2025-02-23
comment: A term previously used in medical contexts to refer to different groups of intersex variations, usually divided into categories of “male pseudohermaphroditism” and “female pseudohermaphroditism” on the basis of the person’s chromosomes. People may still find these terms used in their medical records or in medical journal articles when researching their variation, but they are often considered highly stigmatizing in addition to being vague and inaccurate. Do not use this term to describe a person's variation unless they do so themselves.
comment: Un término utilizado anteriormente en contextos médicos para referirse a diferentes grupos de variaciones intersex, generalmente divididos en categorías de “pseudohermafroditismo masculino” y “pseudohermafroditismo femenino” según los cromosomas de la persona. Es posible que las personas todavía encuentren estos términos utilizados en sus registros médicos o en artículos de revistas médicas cuando investigan su variación, pero a menudo se les considera altamente estigmatizantes, además de vagos e inexactos. No debe utilizarse este término para describir la variación de una persona a menos que lo haga ella misma.
alternative label: Female pseudohermaphroditism
alternative label: Male pseudohermaphroditism
alternative label: Seudohermafroditismo
broader: Intersex variations
change note: Version 4.2.0
has top concept: Sex (Body)
in scheme: v3
preferred label: Pseudohermafroditismo

Salt-wasting congenital adrenal hyperplasia
type: Concept
issued: 2023-06-28
modified: 2025-02-23
comment: People who have salt-wasting congenital adrenal hyperplasia (CAH), a subtype of classical CAH, experience "salt-wasting," a dangerous scenario a person's low levels of aldosterone cause their body to lose too much sodium. They may experience life-threatening adrenal crises, especially when their body is under stress.
broader: Classical congenital adrenal hyperplasia
change note: Version 4.2.0
has top concept: Sex (Body)
in scheme: v3

Sex reversal syndrome
type: Concept
issued: 2023-06-28
modified: 2025-02-23
comment: A term sometimes used in medical contexts to refer to different variations in which a person is born with XY chromosomes and a vulva and vagina or XX chromosomes and a penis.
comment: Un término que a veces se utiliza en contextos médicos para referirse a diferentes variaciones en las que una persona nace con cromosomas XY y vulva y vagina o cromosomas XX y pene.
broader: Intersex variations
change note: Version 4.2.0
has top concept: Sex (Body)
in scheme: v3
preferred label: Síndrome de inversión de sexo

Streak gonads
type: Concept
issued: 2023-06-28
modified: 2025-02-23
comment: Minimally developed gonadal tissue that is present in place of either testes or ovaries. Streak gonads are more common in certain intersex variations such as Swyer syndrome.
broader: Gonads
change note: Version 4.2.0
has top concept: Sex (Body)
in scheme: v3

Trisomy X
type: Concept
issued: 2023-06-28
modified: 2025-02-23
comment: People with Trisomy X are born with 47XXX chromosomes rather than the typical 46XX. If they receive the additional X chromosome from their parent's original sperm or egg cell, they will have 47XXX chromosomes in all their cells. If the additional chromosome appears during the embryo's development process, however, only some cells will have 47XXX chromosomes and the person will be born with a mosaic chromosome pattern. Most people with 47XXX chromosomes do not develop any variations in their other sex characteristics but some may have ovaries that stop producing hormones at an earlier-than-typical age and some may not menstruate.
comment: Las personas con trisomía X nacen con los cromosomas 47XXX en lugar del típico 46XX. Si reciben el cromosoma X adicional del espermatozoide o del óvulo original de sus padres, tendrán 47XXX cromosomas en todas sus células. Sin embargo, si el cromosoma adicional aparece durante el proceso de desarrollo del embrión, sólo algunas células tendrán cromosomas 47XXX y la persona nacerá con un patrón cromosómico en mosaico. La mayoría de las personas con cromosomas 47XXX no desarrollan ninguna variación en sus otras características sexuales, pero algunas pueden tener ovarios que dejan de producir hormonas a una edad más temprana de lo normal y algunas pueden no menstruar.
alternative label: Triple XXX syndrome
alternative label: Síndrome triple XXX
broader: Intersex variations
change note: Version 4.2.0
has top concept: Sex (Body)
in scheme: v3
preferred label: Trisomía X

Type 1 Leydig cell hypoplasia
type: Concept
issued: 2023-06-28
modified: 2025-02-23
comment: People with Type 1 Leydig cell hypoplasia (LCH) produce almost no testosterone and will usually be born with a vulva and vagina and undescended testes. They are usually assigned female at birth, often without their variation being recognized until adolescence, at which point they generally will not develop any secondary sex characteristics or experience other changes typically associated with puberty.
comment: Las personas con hipoplasia de células de Leydig (HCL) tipo 1 casi no producen testosterona y generalmente nacen con vulva y vagina y testículos no descendidos. Por lo general, se les asigna al sexo femenino al nacer, a menudo sin que se reconozca su variación hasta la adolescencia, momento en el que generalmente no desarrollan ninguna característica sexual secundaria ni experimentan otros cambios típicamente asociados con la pubertad.
alternative label: Type 1 LCH
broader: Leydig cell hypoplasia
change note: Version 4.2.0
has top concept: Sex (Body)
in scheme: v3
preferred label: Hipoplasia de células de Leydig tipo 1

Type 1 Mayer-Rokitansky-Küster-Hauser syndrome
type: Concept
issued: 2023-06-28
modified: 2025-02-23
comment: People with Type 1 Mayer-Rokitansky-Küster-Hauser (MRKH) syndrome typically have only the differences associated with MRKH syndrome.
comment: Las personas con síndrome de Mayer-Rokitansky-Küster-Hauser (MRKH) tipo 1 normalmente sólo tienen las diferencias asociadas con el síndrome de MRKH.
alternative label: Type 1 MRKH
broader: Mayer-Rokitansky-Küster-Hauser syndrome
change note: Version 4.2.0
has top concept: Sex (Body)
in scheme: v3
preferred label: Síndrome de Mayer-Rokitansky-Küster-Hauser tipo 1

Type 2 Leydig cell hypoplasia
type: Concept
issued: 2023-06-28
modified: 2025-02-23
comment: People with Type 2 Leydig cell hypoplasia (LCH) have some response to luteinizing hormone and produce lower-than-typical amounts of testosterone, but more than people with Type 1 LCH. At birth, their testes may be descended or undescended, and they may have a smaller-than-typical penis, often with other noticeable differences such as hypospadias. In adolescence, they will often develop some characteristics associated with a typical testosterone puberty.
comment: Las personas con hipoplasia de células de Leydig (HCL) tipo 2 tienen cierta respuesta a la hormona luteinizante y producen cantidades de testosterona inferiores a las típicas, pero más que las personas con HCL tipo 1. Al nacer, sus testículos pueden estar descendidos o no descendidos, y pueden tener un pene más pequeño de lo típico, a menudo con otras diferencias notables, como hipospadias. En la adolescencia, a menudo desarrollarán algunas características asociadas con una pubertad típica de testosterona.
alternative label: Type 2 LCH
broader: Leydig cell hypoplasia
change note: Version 4.2.0
has top concept: Sex (Body)
in scheme: v3
preferred label: Hipoplasia de células de Leydig tipo 2

Type 2 Mayer-Rokitansky-Küster-Hauser syndrome
type: Concept
issued: 2023-06-28
modified: 2025-02-23
comment: People with Type 2 Mayer-Rokitansky-Küster-Hauser (MRKH) syndrome have both the differences associated with MRKH syndrome and additional differences in other parts of their body, such as their fallopian tubes, kidneys, spine, or heart. A specific example of Type 2 MRKH known as Müllerian agenesis, Renal agenesis, Cervicothoracic Somite (MURCS) association, occurs when someone’s kidneys do not develop typically. They may have scoliosis or fused vertebrae in addition to the usual features of MRKH.
comment: Las personas con síndrome de Mayer-Rokitansky-Küster-Hauser (MRKH) tipo 2 tienen tanto las diferencias asociadas con el síndrome de MRKH como diferencias adicionales en otras partes de su cuerpo, como las trompas de Falopio, los riñones, la columna vertebral o el corazón. Un ejemplo específico de MRKH tipo 2 conocido como agenesia mülleriana, agenesia renal, asociación somita cervicotorácica (MURCS, por sus siglas en inglés), ocurre cuando los riñones de una persona no se desarrollan normalmente. Pueden tener escoliosis o vértebras fusionadas además de las características habituales de MRKH.
alternative label: Type 2 MRKH
alternative label: MRKHS
broader: Mayer-Rokitansky-Küster-Hauser syndrome
change note: Version 4.2.0
has top concept: Sex (Body)
in scheme: v3
preferred label: Síndrome de Mayer-Rokitansky-Küster-Hauser tipo 2

Vaginal atresia
type: Concept
issued: 2023-06-28
modified: 2025-02-23
comment: People with this variation may be born without a vaginal opening, a shallow “dimple” where an opening would typically be, or a vaginal opening that is fused or blocked by fibrous tissue. People with vaginal atresia often have a typical upper vaginal canal (along with a typical uterus, cervix, fallopian tubes, and ovaries) with differences in the lower portion of the vagina only.
comment: Las personas con esta variación pueden nacer sin una abertura vaginal, un "hoyuelo" poco profundo donde normalmente estaría una abertura, o una abertura vaginal fusionada o bloqueada por tejido fibroso. Las personas con atresia vaginal a menudo tienen un canal vaginal superior típico (junto con un útero, cuello uterino, trompas de Falopio y ovarios típicos) con diferencias solo en la porción inferior de la vagina.
broader: Intersex variations
change note: Version 4.2.0
has top concept: Sex (Body)
in scheme: v3
preferred label: Atresia vaginal

XXYY syndrome
type: Concept
issued: 2023-06-28
modified: 2025-02-23
comment: People with XXYY syndrome are born with an extra copy of both an X and Y chromosome, resulting in an 48XXYY chromosome pattern instead of the typical 46XY. People with XXYY chromosomes may have undescended testes and produce lower-than-typical amounts of testosterone, which can cause them to start puberty at a later age than typical and develop less pronounced secondary sex characteristics like muscle tone and facial hair. They may also experience breast growth. People with XXYY syndrome often have other physical features that are similar to those developed by people with Klinefelter syndrome (47XXY).
comment: Las personas con síndrome XXYY nacen con una copia adicional de un cromosoma X y uno Y, lo que resulta en un patrón cromosómico 48XXYY, en lugar del típico 46XY. Las personas con cromosomas XXYY pueden tener testículos no descendidos y producir cantidades de testosterona inferiores a las habituales, lo que puede provocar que comiencen la pubertad a una edad más tardía de lo habitual y que desarrollen características sexuales secundarias menos pronunciadas, como el tono muscular y el vello facial. También pueden experimentar crecimiento de los senos. Las personas con síndrome XXYY suelen tener otras características físicas similares a las que desarrollan las personas con síndrome de Klinefelter (47XXY).
alternative label: Síndrome 48 XXYY
broader: Intersex variations
change note: Version 4.2.0
has top concept: Sex (Body)
in scheme: v3
preferred label: Síndrome XXYY

Gay operas
type: Concept
issued: 2023-06-28
modified: 2025-02-23
comment: Operas created by gay directors, depicting gay men, or that are regarded as important within gay culture.
comment: Publicaciones impresas o digitales serializadas sobre hombres gay o temas gay (y generalmente producidas por hombres gay u organizaciones gay) que contienen noticias, artículos, columnas, correspondencia y anuncios.
alternative label: Diarios gay
broader: LGBTQ+ operas
change note: Version 4.2.0
has top concept: Subcultures
in scheme: v3
preferred label: Periódicos gay

Bisexual operas
type: Concept
issued: 2023-06-28
modified: 2025-02-23
comment: Operas created by bisexual directors, depicting bisexual individuals, or that are regarded as important within bisexual culture.
comment: Publicaciones impresas o digitales serializadas creadas por o para personas bisexuales, a menudo con el propósito de compartir noticias e información relacionada con comunidades bisexuales y temas bisexuales.
broader: LGBTQ+ operas
change note: Version 4.2.0
has top concept: Subcultures
in scheme: v3
preferred label: Boletines bisexuales

Asexual operas
type: Concept
issued: 2023-06-28
modified: 2025-02-23
comment: Operas created by asexual directors, depicting asexual individuals, or that are regarded as important within asexual culture.
comment: Óperas creadas por directores asexuales, que representan a personas asexuales, o que se consideran importantes dentro de la cultura asexual.
broader: LGBTQ+ operas
change note: Version 4.2.0
has top concept: Subcultures
in scheme: v3
preferred label: Óperas asexuales

Aboriginal Australian asexual people
type: Concept
issued: 2023-06-28
modified: 2025-02-23
comment: Asexual people who belong to one or more of the various Indigenous peoples of Australia; do not use to refer to the Indigenous people of the Torres Strait Islands, who are considered ethnically and culturally distinct. Only use to describe people who identify as Aboriginal Australian.
comment: Personas asexuales que pertenecen a uno o más de los diversos pueblos indígenas de Australia; no se utiliza para referirse a los pueblos indígenas de las Islas del Estrecho de Torres, que se consideran étnica y culturalmente distintos. Utilícese únicamente para describir a las personas que se autoidentifiquen como aborígenes australianos.
alternative label: Aboriginal asexual people
alternative label: Asexual Aboriginal Australian people
alternative label: Asexual Aboriginal Australians
alternative label: Asexuales aborígenes australianos
alternative label: Australianos asexuales aborígenes
alternative label: Asexuales aborígenes australianas
alternative label: Australianas asexuales aborígenes
broader: Aboriginal Australian LGBTQ+ people
change note: Version 4.2.0
has top concept: LGBTQ+ people
in scheme: v3
preferred label: Personas asexuales aborígenes australianas

Asexual victims of hate crimes
type: Concept
issued: 2023-06-29
modified: 2025-02-23
comment: Asexual people who have experienced hate crimes and may or may not have survived; follow the individual's preference for "victims" or "survivors" whenever possible.
comment: Personas asexuales que han sufrido crímenes de odio y pueden haber sobrevivido o no; siga la preferencia de la persona sobre el uso de "víctimas" o "sobrevivientes" siempre que sea posible.
broader: LGBTQ+ victims of hate crimes
change note: Version 4.2.0
has top concept: LGBTQ+ people
in scheme: v3
preferred label: Víctimas asexuales de crímenes de odio

Multiracial asexual people
type: Concept
issued: 2023-06-29
modified: 2025-02-23
comment: Asexual people who belong to two or more racial groups.
comment: Personas asexuales que pertenecen a dos o más grupos raciales. Utilícese únicamente para personas que se autoidentifiquen como multirraciales.
alternative label: Asexual multi-racial people
alternative label: Asexual multiracial people
alternative label: Multi-racial asexual people
alternative label: Personas multirraciales asexuales
broader: Multiracial LGBTQ+ people
change note: Version 4.2.0
has top concept: LGBTQ+ people
in scheme: v3
preferred label: Personas asexuales multirraciales

Biracial asexual people
type: Concept
issued: 2023-06-29
modified: 2025-02-23
comment: Asexual people who belong to two or more racial groups. Only use to describe people who self-identify as biracial.
comment: Personas asexuales que pertenecen a dos o más grupos raciales. Utilícese únicamente para personas que se autoidentifiquen como birraciales.
alternative label: Asexual bi-racial people
alternative label: Asexual biracial people
alternative label: Bi-racial asexual people
alternative label: Personas birraciales asexuales
alternative label: Asexuales birraciales
broader: Biracial LGBTQ+ people
change note: Version 4.2.0
has top concept: LGBTQ+ people
in scheme: v3
preferred label: Personas asexuales birraciales

Daughters of asexual people
type: Concept
issued: 2023-06-29
modified: 2025-02-23
comment: Daughters who have one or more asexual parent.
comment: Hijas que tienen uno o más padres asexuales.
broader: Daughters of LGBTQ+ people
change note: Version 4.2.0
has top concept: Family members
in scheme: v3
preferred label: Hijas de personas asexuales

Fathers of asexual people
type: Concept
issued: 2023-06-29
modified: 2025-02-23
comment: People who assume the role of father to asexual people. Only use to describe individuals who identify as fathers.
comment: Personas que asumen el rol de padre de personas asexuales. Utilícese únicamente para describir a personas que se autoidentifiquen como padres.
alternative label: Papás de personas asexuales
broader: Fathers of LGBTQ+ people
change note: Version 4.2.0
has top concept: Family members
in scheme: v3
preferred label: Padres de personas asexuales

Jewish asexual people
type: Concept
issued: 2023-06-29
modified: 2025-02-23
comment: Asexual people who are Jewish.
comment: Personas asexuales que son judías.
alternative label: Asexual Jews
alternative label: Judíos asexuales
broader: Jewish LGBTQ+ people
change note: Version 4.2.0
has top concept: LGBTQ+ people
in scheme: v3
preferred label: Personas asexuales judías

Mothers of asexual people
type: Concept
issued: 2023-06-29
modified: 2025-02-23
comment: A person who assumes the role of mother to an asexual person; use only for individuals who self-identify as mothers.
comment: Una persona que asume el rol de madre de una persona asexual; utilícese únicamente para personas que se autoidentifiquen como madres.
alternative label: Mamás de personas asexuales
broader: Mothers of LGBTQ+ people
change note: Version 4.2.0
has top concept: Family members
in scheme: v3
preferred label: Madres de personas asexuals

Parents of asexual people
type: Concept
issued: 2023-06-29
modified: 2025-02-23
comment: People who act as parents to one or more asexual person. For parents who are themselves asexual, use the term "Asexual parents."
comment: Personas que actúan como padres de una o más personas asexuales. Para padres que son asexuales, utilice el término "madres y padres asexuales".
alternative label: Asexual people's parents
alternative label: Padres de personas asexuales
alternative label: Madres de personas asexuales
broader: Parents of LGBTQ+ people
change note: Version 4.2.0
has top concept: Family members
in scheme: v3
preferred label: Madres y padres de personas asexuales

Partners of asexual people
type: Concept
issued: 2023-06-29
modified: 2025-02-23
comment: People whose sexual, romantic, or play partner is asexual.
comment: Personas cuya pareja sexual, romántica o de juego es asexual.
broader: Partners of LGBTQ+ people
change note: Version 4.2.0
has top concept: Partners
in scheme: v3
preferred label: Parejas de personas asexuales

Romani asexual people
type: Concept
issued: 2023-06-29
modified: 2026-02-23
comment: Asexual people who are Romani or descend from this traditionally nomadic Indo-European people; only use to refer to people who self-identify as Romani.
comment: Personas asexuales que son romaníes o parte del pueblo indoeuropeo tradicionalmente nómada.
alternative label: Asexual Roma
alternative label: Asexual Romanis
alternative label: Asexual Romany
alternative label: Roma asexual people
alternative label: Romany asexual people
alternative label: Personas romaníes asexuales
broader: Romani LGBTQ+ people
change note: Version 4.2.0
has top concept: LGBTQ+ people
in scheme: v3
preferred label: Personas asexuales romaníes

White asexual people
type: Concept
issued: 2023-06-29
modified: 2025-02-23
comment: Asexual people who are white.
comment: Personas asexuales que son blancas.
alternative label: Asexual Caucasian people
alternative label: Asexual white people
alternative label: Personas caucásicas asexuales
alternative label: Personas blancas asexuales
broader: White LGBTQ+ people
change note: Version 4.2.0
has top concept: White LGBTQ+ people
in scheme: v3
preferred label: Personas asexuales blancas

Intersex museums
type: Concept
issued: 2023-06-30
modified: 2025-02-23
comment: Institutions dedicated to the storage, exhibition, conservation, and preservation of materials relating to intersex people and intersex history.
comment: Instituciones dedicadas al almacenamiento, la exhibición, la conservación y la preservación de materiales relacionados con las personas intersex y la historia intersex.
broader: LGBTQ+ museums
change note: Version 4.2.0
has top concept: LGBTQ+ cultural heritage institutions
in scheme: v3
preferred label: Museos intersex

Intersex newsletters
type: Concept
issued: 2023-06-30
modified: 2025-02-23
comment: Serialized print or digital periodicals created by or for intersex people, often with the purpose of sharing news and information related to intersex communities and intersex issues.
comment: Publicaciones periódicas impresas o digitales serializadas creadas por o para personas intersex, a menudo con el propósito de compartir noticias e información relacionada con comunidades intersex y cuestiones intersex.
broader: LGBTQ+ newsletters
change note: Version 4.2.0
has top concept: LGBTQ+ press
in scheme: v3
preferred label: Boletines intersex

Intersex newspapers
type: Concept
issued: 2023-06-30
modified: 2025-02-23
comment: Serialized print or digital publications about intersex issues (and typically produced by intersex people or intersex organizations) that contain news, articles, columns, correspondence, and advertisements.
comment: Publicaciones impresas o digitales serializadas sobre personas intersex o cuestiones intersex (y generalmente producidas por personas intersex u organizaciones intersex) que contienen noticias, artículos, columnas, correspondencia y anuncios.
alternative label: Diarios intersex
broader: LGBTQ+ newspapers
change note: Version 4.2.0
has top concept: LGBTQ+ press
in scheme: v3
preferred label: Periódicos intersex

Intersex partners
type: Concept
issued: 2023-06-30
modified: 2025-02-23
comment: Intersex people who are the romantic, sexual, or play partners of another person or people.
comment: Personas intersex que son parejas románticas, sexuales o de juego de otra persona o personas.
broader: LGBTQ+ partners
change note: Version 4.2.0
has top concept: LGBTQ+ families
in scheme: v3
preferred label: Parejas intersex

Intersex people in the military
type: Concept
issued: 2023-06-30
modified: 2025-02-23
comment: Intersex people serving in state and national armed forces.
comment: Personas intersex que sirven en las fuerzas armadas estatales y nacionales.
alternative label: Personas intersex en las fuerzas armadas
broader: LGBTQ+ people in the military
change note: Version 4.2.0
has top concept: Legal status
in scheme: v3
preferred label: Personas intersex en el ejército

Intersex Deaf people
type: Concept
issued: 2023-06-30
modified: 2025-02-23
comment: Intersex people with significant or total hearing loss. Some but not all Deaf people prefer to capitalize Deaf in recognition of the cultural and linguistic identity they share with other Deaf people.
comment: Personas intersex con pérdida auditiva significativa o total. Algunas personas sordas, pero no todas, prefieren escribir “Sorda/o” con mayúscula en reconocimiento de la identidad cultural y lingüística que comparten con otras personas sordas.
alternative label: Deaf intersex people
alternative label: Personas sordas intersex
broader: LGBTQ+ deaf people
change note: Version 4.2.0
has top concept: LGBTQ+ deaf people
in scheme: v3
preferred label: Personas intersex sordas

Intersex community
type: Concept
issued: 2023-06-30
modified: 2025-02-23
comment: Groups of people who share the experience of being intersex.
comment: Grupos de personas que comparten la experiencia de ser intersex.
broader: LGBTQ+ communities
change note: Version 4.2.0
has top concept: LGBTQ+ communities
in scheme: v3
preferred label: Comunidad intersex

African American intersex people
type: Concept
issued: 2023-06-30
modified: 2025-02-23
comment: Intersex people of African descent born in the United States or intersex people born in African countries who live in or have a strong connection to the United States. Use for individuals who self-identity as African American. Follow the individual’s preference for African American or Black whenever possible.
comment: Personas intersexuales de ascendencia africana nacidas en los Estados Unidos o personas intersex nacidas en países africanos que viven o tienen una conexión fuerte con los Estados Unidos. Utilícese para personas que se autoidentifiquen como afroamericanas.
alternative label: Intersex African American people
alternative label: Intersex African Americans
alternative label: Afroamericanos intersex
alternative label: Intersex afroamericanos
alternative label: Afroamericanas intersex
alternative label: Intersex afroamericanas
alternative label: Personas intersex afroamericanas
broader: African American LGBTQ+ people
change note: Version 4.2.0
has top concept: LGBTQ+ people
in scheme: v3
preferred label: Personas intersexuales afroamericanas

Intersex publishers
type: Concept
issued: 2023-09-29
modified: 2025-02-23
comment: Companies and organizations that publish materials for intersex communities or addressing intersex issues.
comment: Empresas y organizaciones que publican materiales para comunidades intersex o que abordan asuntos intersex.
preferred label: Editoriales intersex
broader: LGBTQ+ publishers
change note: Version 4.2.0
has top concept: LGBTQ+ publishers
in scheme: v3

Intersex radio
type: Concept
issued: 2023-09-29
modified: 2025-02-23
comment: Auditory content broadcast on the radio (analog or digital) about intersex people and intersex issues.
comment: Contenido auditivo difundido por radio (analógica o digital) sobre personas intersex y asuntos intersex.
broader: LGBTQ+ radio
change note: Version 4.2.0
has top concept: LGBTQ+ radio
in scheme: v3
preferred label: Radio intersex

Intersex slang
type: Concept
issued: 2023-09-29
modified: 2025-02-23
comment: Colloquial or informal language related to intersex identity or used by intersex people.
comment: Lenguaje coloquial o informal relacionado con la identidad intersex o utilizado por personas intersex.
alternative label: Argot intersex
broader: LGBTQ+ slang
change note: Version 4.2.0
has top concept: LGBTQ+ slang
in scheme: v3
preferred label: Jerga intersex

Intersex sons
type: Concept
issued: 2023-09-29
modified: 2025-02-23
comment: Intersex people who are sons. Only use to describe individuals who identify as sons.
comment: Personas intersex que son hijos. Utilícese únicamente para describir a personas que se autoidentifiquen como hijos.
broader: LGBTQ+ sons
change note: Version 4.2.0
has top concept: LGBTQ+ people
in scheme: v3
preferred label: Hijos intersex

Intersex survivors of hate crimes
type: Concept
issued: 2023-09-29
modified: 2025-02-23
comment: Intersex people who have experienced and survived hate crimes; follow the individual's preference for "victims" or "survivors" whenever possible.
comment: Personas intersex que han sufrido y sobrevivido crímenes de odio; siga la preferencia de la persona sobre el uso de "víctimas" o "sobrevivientes" siempre que sea posible.
broader: LGBTQ+ survivors of hate crimes
change note: Version 4.2.0
has top concept: LGBTQ+ people
in scheme: v3
preferred label: Sobrevivientes intersex de crímenes de odio

Intersex survivors of rape
type: Concept
issued: 2023-09-29
modified: 2025-02-23
comment: Intersex people who have experienced and survived rape; follow the individual's preference for "victims" or "survivors" whenever possible.
comment: Personas intersex que han sufrido y sobrevivido una violación; siga la preferencia de la persona sobre el uso de "víctimas" o "sobrevivientes" siempre que sea posible.
broader: LGBTQ+ survivors of rape
change note: Version 4.2.0
has top concept: LGBTQ+ people
in scheme: v3
preferred label: Sobrevivientes intersex de violación

Intersex survivors of sexual abuse
type: Concept
issued: 2023-09-29
modified: 2025-02-23
comment: Intersex people who have experienced and survived sexual abuse; follow the individual's preference for "victims" or "survivors" whenever possible.
comment: Personas intersex que han sufrido y sobrevivido abusos sexuales; siga la preferencia de la persona sobre el uso de "víctimas" o "sobrevivientes" siempre que sea posible.
broader: LGBTQ+ survivors of sexual abuse
change note: Version 4.2.0
has top concept: LGBTQ+ people
in scheme: v3
preferred label: Sobrevivientes intersex de abuso sexual

Intersex survivors of war
type: Concept
issued: 2023-09-29
modified: 2025-02-23
comment: Intersex people who have experienced and survived war; follow the individual's preference for "victims" or "survivors" whenever possible.
comment: Personas intersex que han sufrido y sobrevivido la guerra; siga la preferencia de la persona sobre el uso de "víctimas" o "sobrevivientes" siempre que sea posible.
broader: LGBTQ+ survivors of war
change note: Version 4.2.0
has top concept: LGBTQ+ people
in scheme: v3
preferred label: Sobrevivientes intersex de guerra

Intersex television
type: Concept
issued: 2023-09-29
modified: 2025-02-23
comment: Television shows featuring intersex characters or themes.
comment: Programas de televisión que presentan personajes o temas intersex.
broader: LGBTQ+ television
change note: Version 4.2.0
has top concept: LGBTQ+ television
in scheme: v3
preferred label: Televisión intersex

Intersex theater
type: Concept
issued: 2023-09-29
modified: 2025-02-23
comment: Works in the performance arts that focus on intersex characters or themes.
comment: Trabajos en las artes escénicas que se centran en personajes o temas intersex.
alternative label: Intersex theatre
broader: LGBTQ+ theater
change note: Version 4.2.0
has top concept: LGBTQ+ theater
in scheme: v3
preferred label: Teatro intersex

Intersex victims of hate crimes
type: Concept
issued: 2023-09-29
modified: 2025-02-23
comment: Intersex people who have experienced hate crimes and may or may not have survived; follow the individual's preference for "victims" or "survivors" whenever possible.
comment: Personas intersex que han sufrido crímenes de odio y que pueden haber sobrevivido o no; siga la preferencia de la persona sobre el uso de "víctimas" o "sobrevivientes" siempre que sea posible.
broader: LGBTQ+ victims of hate crimes
change note: Version 4.2.0
has top concept: LGBTQ+ people
in scheme: v3
preferred label: Víctimas intersex de crímenes de odio

Intersex victims of sexual abuse
type: Concept
issued: 2023-09-29
modified: 2025-02-23
comment: Intersex people who have experienced sexual abuse and may or may not have survived; follow the individual's preference for "victims" or "survivors" whenever possible.
comment: Personas intersex que han sufrido abuso sexual y que pueden haber sobrevivido o no; siga la preferencia de la persona sobre el uso de "víctimas" o "sobrevivientes" siempre que sea posible.
broader: LGBTQ+ victims of sexual abuse
change note: Version 4.2.0
has top concept: LGBTQ+ people
in scheme: v3
preferred label: Víctimas intersex de abuso sexual

Intersex victims of war
type: Concept
issued: 2023-09-29
modified: 2025-02-23
comment: Intersex people who have experienced war and may or may not have survived; follow the individual's preference for "victims" or "survivors" whenever possible.
comment: Personas intersex que han sufrido la guerra y que pueden haber sobrevivido o no; siga la preferencia de la persona sobre el uso de "víctimas" o "sobrevivientes" siempre que sea posible.
broader: LGBTQ+ victims of war
change note: Version 4.2.0
has top concept: LGBTQ+ people
in scheme: v3
preferred label: Víctimas intersex de guerra

Intersex victims' rights
type: Concept
issued: 2023-09-29
modified: 2025-02-23
comment: Intersex people’s legal rights to be informed, present, and heard within the criminal justice system after having been harmed or injured as the result of of a crime, accident, or other event.
comment: Los derechos legales de las personas intersex a estar informadas, estar presentes y ser escuchadas dentro del sistema de justicia penal después de haber sido perjudicadas o lesionadas como resultado de un delito, un accidente u otro evento.
broader: LGBTQ+ victims' rights
change note: Version 4.2.0
has top concept: Law
in scheme: v3
preferred label: Derechos de víctimas intersex

Intersex-focused businesses
type: Concept
issued: 2023-09-29
modified: 2025-02-23
comment: Businesses focusing on intersex clientele and products related to intersex communities.
comment: Empresas enfocadas en clientela intersex y productos relacionados con comunidades intersex.
broader: LGBTQ+-focused businesses
change note: Version 4.2.0
has top concept: LGBTQ+-focused businesses
in scheme: v3
preferred label: Negocios orientados a personas intersex

Intersex-owned businesses
type: Concept
issued: 2023-09-29
modified: 2025-02-23
comment: Businesses owned by intersex people.
comment: Empresas pertenecientes a personas intersex.
broader: LGBTQ+-owned businesses
change note: Version 4.2.0
has top concept: LGBTQ+-owned businesses
in scheme: v3
preferred label: Negocios propiedad de personas intersex

Biracial intersex people
type: Concept
issued: 2023-09-29
modified: 2025-02-23
comment: Intersex people who belong to two or more racial groups. Only use for people who self-identify as biracial.
comment: Personas intersexuales que pertenecen a dos o más grupos raciales. Utilícese únicamente para personas que se autoidentifiquen como birraciales.
alternative label: Bi-racial intersex people
alternative label: Intersex bi-racial people
alternative label: Intersex biracial people
alternative label: Personas bi-raciales intersex
alternative label: Personas intersex bi-raciales
alternative label: Personas birraciales intersex
alternative label: Personas intersex birraciales
broader: Biracial LGBTQ+ people
change note: Version 4.2.0
has top concept: LGBTQ+ people
in scheme: v3
preferred label: Personas intersexuales birraciales

Mothers of intersex people
type: Concept
issued: 2023-09-29
modified: 2025-02-23
comment: A person who assumes the role of mother to an intersex person; use only for individuals who self-identify as mothers.
comment: Una persona que asume el rol de madre de una persona intersexual; utilícese únicamente para personas que se autoidentifiquen como madres.
alternative label: Mamás de personas intersex
alternative label: Madres de personas intersex
broader: Mothers of LGBTQ+ people
change note: Version 4.2.0
has top concept: Family members
in scheme: v3
preferred label: Madres de personas intersexuales

Multiracial intersex people
type: Concept
issued: 2023-09-29
modified: 2025-02-23
comment: Intersex people who belong to two or more racial groups. Only use for people who self-identify as multiracial.
comment: Personas intersexuales que pertenecen a dos o más grupos raciales. Utilícese únicamente para personas que se autoidentifiquen como multirraciales.
alternative label: Intersex multi-racial people
alternative label: Intersex multiracial people
alternative label: Multi-racial intersex people
alternative label: Personas intersex multirraciales
alternative label: Personas multirraciales intersexuales
broader: Multiracial LGBTQ+ people
change note: Version 4.2.0
has top concept: LGBTQ+ people
in scheme: v3
preferred label: Personas intersexuales multirraciales

Intersex bookshops
type: Concept
issued: 2023-09-29
modified: 2025-02-23
comment: Bookshops that sell materials intended for use by intersex people or addressing topics related to intersex experiences.
comment: Librerías que venden materiales destinados al uso de personas intersex o que abordan temas relacionados con experiencias intersex.
broader: LGBTQ+ bookshops
change note: Version 4.2.0
has top concept: LGBTQ+ bookshops
in scheme: v3
preferred label: Librerías intersex

Intersex characters
type: Concept
issued: 2023-09-29
modified: 2025-02-23
comment: Characters in creative works who are intersex.
comment: Personajes de obras creativas que son intersex.
broader: LGBTQ+ characters
change note: Version 4.2.0
has top concept: LGBTQ+ characters
in scheme: v3
preferred label: Personajes intersex

Intersex community centers
type: Concept
issued: 2023-09-29
modified: 2025-02-23
comment: Spaces in which people from intersex communities meet for social, education, recreational, or organizing activities.
comment: Espacios en los que personas de comunidades intersex se reúnen para realizar actividades sociales, educativas, recreativas u organizativas.
alternative label: Intersex community centres
broader: LGBTQ+ community centers
change note: Version 4.2.0
has top concept: LGBTQ+ centers
in scheme: v3
preferred label: Centros comunitarios intersex

Intersex culture
type: Concept
issued: 2023-09-29
modified: 2025-02-23
comment: Cultural experiences shared by members of intersex communities or products of intersex culture (e.g., art and media created by and for intersex people, activism focused on intersex issues, slang commonly used in intersex communities, etc.).
comment: Experiencias culturales compartidas por miembros de comunidades intersex o productos de la cultura intersex (por ejemplo, arte y medios creados por y para personas intersex, activismo centrado en cuestiones intersex, jerga comúnmente utilizada en comunidades intersex, etc.).
broader: LGBTQ+ culture
change note: Version 4.2.0
has top concept: Subcultures
in scheme: v3
preferred label: Cultura intersex

Intersex daughters
type: Concept
issued: 2023-09-29
modified: 2025-02-23
comment: Daughters who identify as intersex. Only use for people who identify as daughters.
comment: Hijas que se identifican como intersex. Utilícese únicamente para personas que se autoidentifiquen como hijas.
broader: LGBTQ+ daughters
change note: Version 4.2.0
has top concept: LGBTQ+ people
in scheme: v3
preferred label: Hijas intersex

Intersex atheists
type: Concept
issued: 2023-09-29
modified: 2025-02-23
comment: Intersex people who are atheists.
comment: Personas intersex que son ateas.
broader: LGBTQ+ atheists
change note: Version 4.2.0
has top concept: LGBTQ+ people
in scheme: v3
preferred label: Ateos intersex

Intersex Christians
type: Concept
issued: 2023-09-29
modified: 2025-02-23
comment: Intersex people who are Christian.
comment: Personas intersex que son cristianas.
broader: LGBTQ+ Christians
change note: Version 4.2.0
has top concept: LGBTQ+ African religions
in scheme: v3
preferred label: Cristianos intersex

Intersex clergy
type: Concept
issued: 2023-09-29
modified: 2025-02-23
comment: Intersex people who are ordained for religious duties, particularly in the Christian Church.
comment: Personas intersex que son ordenadas para deberes religiosos, particularmente en la Iglesia cristiana.
alternative label: Clero intersex
broader: LGBTQ+ clergy
change note: Version 4.2.0
has top concept: LGBTQ+ clergy
in scheme: v3
preferred label: Clero intersexual

Intersex Muslims
type: Concept
issued: 2023-09-29
modified: 2025-02-23
comment: Intersex people who are Muslim.
comment: Personas intersex que son musulmanas.
broader: LGBTQ+ Muslims
change note: Version 4.2.0
has top concept: LGBTQ+ African religions
in scheme: v3
preferred label: Musulmanes intersex

Intersex Pagans
type: Concept
issued: 2023-09-29
modified: 2025-02-23
comment: Intersex people who are members of polytheistic religions or other religions outside of the dominant culture that typically incorporate nature worship and/or the sacred feminine, such as Wicca, Druidry, Heathenry, etc. Use to describe intersex people who self-identify as Pagan.
comment: Personas intersex que son miembros de religiones politeístas u otras religiones fuera de la cultura dominante que típicamente incorporan el culto a la naturaleza y/o lo sagrado femenino, como la Wicca, el druidismo, el paganismo, etc. Utilícese para describir a las personas intersex que se autoidentifican como paganas.
broader: LGBTQ+ Pagans
change note: Version 4.2.0
has top concept: LGBTQ+ African religions
in scheme: v3
preferred label: Paganos intersexuales

Intersex Protestants
type: Concept
issued: 2023-09-29
modified: 2025-02-23
comment: Intersex people who are members of the Protestant Church.
comment: Personas intersex que son miembros de la Iglesia protestante.
broader: LGBTQ+ Protestants
change note: Version 4.2.0
has top concept: LGBTQ+ African religions
in scheme: v3
preferred label: Protestantes intersex

Asexual atheists
type: Concept
issued: 2023-10-27
modified: 2025-02-23
comment: Asexual people who are atheists.
comment: Personas asexuales que son ateas.
broader: LGBTQ+ atheists
change note: Version 4.2.0
has top concept: LGBTQ+ people
in scheme: v3
preferred label: Ateos asexuales

Asexual Christians
type: Concept
issued: 2023-10-27
modified: 2025-02-23
comment: Asexual people who are Christian.
comment: Personas asexuales que son cristianas.
broader: LGBTQ+ Christians
change note: Version 4.2.0
has top concept: LGBTQ+ African religions
in scheme: v3
preferred label: Cristianos asexuales

Asexual clergy
type: Concept
issued: 2023-10-27
modified: 2025-02-23
comment: Asexual people who are ordained for religious duties, particularly in the Christian Church.
comment: Personas asexuales que son ordenadas para deberes religiosos, particularmente en la iglesia cristiana.
broader: LGBTQ+ clergy
change note: Version 4.2.0
has top concept: LGBTQ+ clergy
in scheme: v3
preferred label: Clero asexual

Asexual Muslims
type: Concept
issued: 2023-10-27
modified: 2025-02-23
comment: Asexual people who are Muslim.
comment: Personas asexuales que son musulmanas.
broader: LGBTQ+ Muslims
change note: Version 4.2.0
has top concept: LGBTQ+ African religions
in scheme: v3
preferred label: Musulmanes asexuales

Asexual Pagans
type: Concept
issued: 2023-10-27
modified: 2025-02-23
comment: Asexual people who are members of polytheistic religions or other religions outside of the dominant culture that typically incorporate nature worship and/or the sacred feminine, such as Wicca, Druidry, Heathenry, etc. Use to describe asexual people who self-identify as Pagan.
comment: Personas asexuales que son miembros de religiones politeístas u otras religiones fuera de la cultura dominante que típicamente incorporan el culto a la naturaleza y/o a lo sagrado femenino, tal como la wicca, el druidismo, el paganismo, etc. Utilícese para describir a las personas asexuales que se autoidentifiquen como paganas.
broader: LGBTQ+ Pagans
change note: Version 4.2.0
has top concept: LGBTQ+ African religions
in scheme: v3
preferred label: Paganos asexuales

Asexual Protestants
type: Concept
issued: 2023-10-27
modified: 2025-02-23
comment: Asexual people who are members of the Protestant Church.
comment: Personas asexuales que son miembros de la Iglesia protestante.
broader: LGBTQ+ Protestants
change note: Version 4.2.0
has top concept: LGBTQ+ African religions
in scheme: v3
preferred label: Protestantes asexuales

Asexual witches
type: Concept
issued: 2023-10-27
modified: 2025-02-23
comment: Asexual practitioners of Wicca or other Pagan religions who self-identify as witches.
alternative label: Asexual Wiccans
broader: LGBTQ+ witches
change note: Version 4.2.0
has top concept: LGBTQ+ African religions
in scheme: v3

Asexual Roman Catholics
type: Concept
issued: 2023-10-27
modified: 2025-02-23
comment: Asexual people who are members of the Roman Catholic Church.
comment: Personas asexuales que son miembros de la Iglesia católica romana.
alternative label: Católicos romanos asexuales
alternative label: Católicas romanas asexuales
broader: LGBTQ+ Roman Catholics
change note: Version 4.2.0
has top concept: LGBTQ+ African religions
in scheme: v3
preferred label: Personas católicas romanas asexuales

Intersex Roman Catholics
type: Concept
issued: 2023-10-27
modified: 2025-02-23
comment: Intersex people who are members of the Roman Catholic Church.
comment: Personas intersex que son miembros de la Iglesia católica romana.
alternative label: Católico romanos intersex
broader: LGBTQ+ Roman Catholics
change note: Version 4.2.0
has top concept: LGBTQ+ African religions
in scheme: v3
preferred label: Personas católicas romanas intersex

Asexual Buddhists
type: Concept
issued: 2023-10-27
modified: 2025-02-23
comment: Asexual people who are Buddhist.
comment: Personas asexuales que son budistas.
broader: LGBTQ+ Buddhists
change note: Version 4.2.0
has top concept: LGBTQ+ African religions
in scheme: v3
preferred label: Budistas asexuales

Intersex Buddhists
type: Concept
issued: 2023-10-27
modified: 2025-02-23
comment: Intersex people who are Buddhist.
comment: Personas intersex que son budistas.
broader: LGBTQ+ Buddhists
change note: Version 4.2.0
has top concept: LGBTQ+ African religions
in scheme: v3
preferred label: Budistas intersex

Asexual dominatrices
type: Concept
issued: 2023-10-27
modified: 2025-02-23
comment: Women who take a dominant role in BDSM activities; use for dominatrices who identify as asexual.
comment: Mujeres que desempeñan un papel dominante en actividades de BDSM; utilícese para dominatrices que se autoidentifiquen como asexuales.
broader: LGBTQ+ dominatrices
change note: Version 4.2.0
has top concept: Relationship minorities
in scheme: v3
preferred label: Dominatrices asexuales

Asexual dominants
type: Concept
issued: 2023-10-27
modified: 2025-02-23
comment: Asexual people (typically men) who are part of the BDSM scene and assume the dominant role in sexual relationships with a master/slave dynamic.
comment: Personas asexuales (típicamente hombres) que forman parte de la escena BDSM y asumen el rol dominante en relaciones sexuales con una dinámica amo/esclavo.
broader: LGBTQ+ dominants
change note: Version 4.2.0
has top concept: Sexual identity
in scheme: v3
preferred label: Dominantes asexuales

Asexual mistresses (BDSM culture)
type: Concept
issued: 2023-10-27
modified: 2026-02-24
comment: Asexual women who are part of the BDSM scene and assume the mistress role in sexual relationships with a mistress/submissive dynamic.
broader: LGBTQ+ mistresses (BDSM culture)
change note: Version 4.2.0
has top concept: Sexual identity
in scheme: v3

Demisexual autistic people
type: Concept
issued: 2023-10-27
modified: 2025-02-23
comment: Demisexual people who are autistic.
comment: Personas demisexuales que son autistas.
alternative label: Autistic demisexual people
alternative label: Personas autistas demisexuales
alternative label: Personas demisexuales con autismo
broader: Demisexual neurodivergent people
change note: Version 4.2.0
has top concept: LGBTQ+ people
in scheme: v3
preferred label: Personas demisexuales autistas

Megasexual autistic people
type: Concept
issued: 2023-10-27
modified: 2025-02-23
comment: Megasexual people who are autistic.
comment: Personas megasexuales que son autistas.
alternative label: Autistic megasexual people
alternative label: Personas autistas megasexuales
alternative label: Personas megasexuales con autismo
broader: Megasexual neurodivergent people
change note: Version 4.2.0
has top concept: LGBTQ+ people
in scheme: v3
preferred label: Personas megasexuales autistas

Aromantic autistic people
type: Concept
issued: 2023-10-27
modified: 2025-02-23
comment: Aromantic people who are autistic.
comment: Personas arrománticas que son autistas.
alternative label: Autistic aromantic people
alternative label: Personas autistas arrománticas
alternative label: Personas arrománticas con autismo
broader: Aromantic neurodivergent people
change note: Version 4.2.0
has top concept: LGBTQ+ people
in scheme: v3
preferred label: Personas arrománticas autistas

Greyromantic autistic people
type: Concept
issued: 2023-10-27
modified: 2025-02-23
comment: Greyromantic people who are autistic.
comment: Personas grisrománticas que son autistas.
alternative label: Autistic greyromantic people
alternative label: Personas autistas grisrománticas
alternative label: Personas grisrománticas con autismo
broader: Greyromantic neurodivergent people
change note: Version 4.2.0
has top concept: LGBTQ+ people
in scheme: v3
preferred label: Personas grisrománticas autistas

Demisexual blind people
type: Concept
issued: 2023-10-27
modified: 2025-02-23
comment: Demisexual people with significant or total loss of vision.
comment: Personas demisexuales con pérdida significativa o total de la visión.
alternative label: Blind demisexual people
alternative label: Personas ciegas demisexuales
alternative label: Ciegos demisexuales
alternative label: Ciegas demisexuales
broader: Demisexual disabled people
change note: Version 4.2.0
has top concept: LGBTQ+ people
in scheme: v3
preferred label: Personas demisexuales ciegas

Megasexual blind people
type: Concept
issued: 2023-10-27
modified: 2025-02-23
comment: Megasexual people with significant or total loss of vision.
comment: Personas megasexuales con pérdida significativa o total de la visión.
alternative label: Blind megasexual people
alternative label: Personas ciegas megasexuales
broader: Megasexual disabled people
change note: Version 4.2.0
has top concept: LGBTQ+ people
in scheme: v3
preferred label: Personas megasexuales ciegas

Aromantic blind people
type: Concept
issued: 2023-10-27
modified: 2025-02-23
comment: Aromantic people with significant or total loss of vision.
comment: Personas aromáticas con pérdida significativa o total de la visión.
alternative label: Blind aromantic people
alternative label: Personas ciegas arrománticas
broader: Aromantic disabled people
change note: Version 4.2.0
has top concept: LGBTQ+ people
in scheme: v3
preferred label: Personas arrománticas ciegas

Greyromantic blind people
type: Concept
issued: 2023-10-27
modified: 2025-02-23
comment: Greyromantic people with significant or total loss of vision.
comment: Personas grisrománticas con pérdida significativa o total de la visión.
alternative label: Blind greyromantic people
alternative label: Personas ciegas grisrománticas
alternative label: Ciegos grisrománticos
broader: Greyromantic disabled people
change note: Version 4.2.0
has top concept: LGBTQ+ people
in scheme: v3
preferred label: Personas grisrománticas ciegas

Non-binary blind people
type: Concept
issued: 2023-10-27
modified: 2025-02-23
comment: Non-binary people with significant or total loss of vision.
comment: Personas no binarias con pérdida significativa o total de la visión.
alternative label: Blind non-binary people
alternative label: Nonbinary blind people
alternative label: Personas ciegas no binarias
broader: Non-binary disabled people
change note: Version 4.2.0
has top concept: LGBTQ+ people
in scheme: v3
preferred label: Personas no binarias ciegas

Non-binary wheelchair users
type: Concept
issued: 2023-10-27
modified: 2025-02-23
comment: Non-binary people who use wheelchairs.
comment: Personas no binarias que utilizan sillas de ruedas.
alternative label: Nonbinary wheelchair users
alternative label: Usuarios de sillas de ruedas no binarios
broader: Non-binary disabled people
change note: Version 4.2.0
has top concept: LGBTQ+ people
in scheme: v3
preferred label: Usuarios no binarios de sillas de ruedas

Demisexual wheelchair users
type: Concept
issued: 2023-10-27
modified: 2025-02-23
comment: Demisexual people who use wheelchairs.
comment: Personas demisexuales que utilizan sillas de ruedas.
broader: Demisexual disabled people
change note: Version 4.2.0
has top concept: LGBTQ+ people
in scheme: v3
preferred label: Usuarios demisexuales de sillas de ruedas

Megasexual wheelchair users
type: Concept
issued: 2023-10-27
modified: 2025-02-23
comment: Megasexual people who use wheelchairs.
comment: Personas megasexuales que utilizan sillas de ruedas.
broader: Megasexual disabled people
change note: Version 4.2.0
has top concept: LGBTQ+ people
in scheme: v3
preferred label: Usuarios megasexuales de sillas de ruedas

Aromantic wheelchair users
type: Concept
issued: 2023-10-27
modified: 2025-02-23
comment: Aromantic people who use wheelchairs.
comment: Personas arrománticas que utilizan sillas de ruedas.
broader: Aromantic disabled people
change note: Version 4.2.0
has top concept: LGBTQ+ people
in scheme: v3
preferred label: Usuarios arrománticos de sillas de ruedas

Greyromantic wheelchair users
type: Concept
issued: 2023-10-27
modified: 2025-02-23
comment: Greyromantic people who use wheelchairs.
comment: Personas grisrománticas que utilizan sillas de ruedas.
broader: Greyromantic disabled people
change note: Version 4.2.0
has top concept: LGBTQ+ people
in scheme: v3
preferred label: Usuarios grisrománticos de sillas de ruedas

Wrestling
type: Concept
issued: 2023-12-15
modified: 2025-02-23
comment: A competitive, social, or erotic activity involving two or more people engaging in grappling with each other trying throw or force the other(s) to the ground.
comment: Una actividad competitiva, social o erótica que involucra a dos o más personas luchando entre sí, tratando de arrojar o forzar a la otra persona(s) al suelo.
alternative label: Luchar
alternative label: Lucha
broader: BDSM
change note: Version 4.2.0
has top concept: Eroticism
in scheme: v3
preferred label: Lucha libre

Total power exchange
type: Concept
issued: 2023-12-15
modified: 2025-02-23
comment: Consensual exchange of power between two or more people as a feature of their relationship that is practiced at all times.
comment: Intercambio consensual de poder entre dos o más personas como característica de su relación que se practica en todo momento.
alternative label: 24/7 (Power Exchange)
alternative label: Kept
alternative label: 24/7 (intercambio de poder}
broader: Power exchange
change note: Version 4.2.0
has top concept: Role behavior
in scheme: v3
preferred label: Intercambio total de poder

Humiliation (Erotic)
type: Concept
issued: 2023-12-18
modified: 2025-03-20
comment: Psychological or physical humiliation performed in order to produce erotic excitement or sexual arousal.
comment: Humillación psicológica o física realizada con el fin de producir excitación erótica o sexual.
alternative label: Erotic humiliation
alternative label: Humillación erótica
change note: Version 4.2.0
in scheme: v3
preferred label: Humillación

Pony play
type: Concept
issued: 2023-12-18
modified: 2025-02-23
comment: The act of roleplaying as an equine, sometimes with someone acting as a trainer, handler or pet owner, for fun or erotic enjoyment.
comment: El acto de representar un rol como un equino, a veces con una persona que actúa como entrenadora, cuidadora o dueña de una mascota, por diversión o disfrute erótico.
broader: Animal roleplay
change note: Version 4.2.0
has top concept: Sex (Act)
in scheme: v3
preferred label: Juego de pony

Spitting (Erotic)
type: Concept
issued: 2023-12-20
modified: 2025-03-20
comment: Expelling spit, usually onto a person’s body or into their mouth.
comment: Expulsar saliva, generalmente sobre el cuerpo de una persona o dentro de su boca.
change note: Version 4.2.0
in scheme: v3
preferred label: Escupir (sexo)

Sounding (Erotic)
type: Concept
issued: 2023-12-20
modified: 2025-03-20
comment: Insertion of rods into the urethra, usually for erotic stimulation.
comment: Inserción de varillas en la uretra, generalmente para estimulación erótica.
alternative label: Juego uretral
change note: Version 4.2.0
in scheme: v3
preferred label: Sondeo uretral (Sexo)

Squirting
type: Concept
issued: 2023-12-20
modified: 2025-03-20
comment: Expulsion of fluid from the urethra during orgasm. Not commonly used for penile ejaculation.
comment: Expulsión de líquido de la uretra durante el orgasmo. No se utiliza comúnmente para la eyaculación del pene.
alternative label: Cervical mucus
alternative label: Fejac
alternative label: Female ejaculation
alternative label: Gush
alternative label: Squirt
broader: Body fluids
change note: Version 4.2.0
has top concept: Body fluids
in scheme: v3
preferred label: Eyaculación femenina

Straitjacket
type: Concept
issued: 2023-12-20
modified: 2025-02-23
comment: A type of jacket used to restrain the upper body.
comment: Un tipo de chaqueta utilizada para sujetar la parte superior del cuerpo.
alternative label: Strait-jacket
broader: Restraints
change note: Version 4.2.0
has top concept: Sex accessories
in scheme: v3
preferred label: Camisa de fuerza

Caning
type: Concept
issued: 2023-12-20
modified: 2025-02-23
comment: Striking the body with a cane as a form of impact play.
comment: Golpear el cuerpo con un bastón como forma de juego de impacto.
alternative label: Azotes con bastón
alternative label: Palmeta
alternative label: Palmetazo
alternative label: Bastón
alternative label: Bastonazo
broader: Impact play
change note: Version 4.2.0
has top concept: Eroticism
in scheme: v3
preferred label: Golpes con bastón

Feminist sex wars
type: Concept
issued: 2023-12-20
modified: 2025-03-20
comment: A period of debates beginning in the 1970s between different schools and factions of feminist thought concerning sexual freedom, sex work, pornography, kink and sadomasochism, sex toys, butch/femme, and trans identities.
comment: Un período de debates que comenzó en la década de 1970 entre diferentes escuelas y facciones del pensamiento feminista sobre la libertad sexual, el trabajo sexual, la pornografía, el vicio y el sadomasoquismo, los juguetes sexuales, las identidades butch/femme y trans.
alternative label: Porn wars
alternative label: Sex wars
alternative label: Guerras del porno
alternative label: Guerra del sexo
change note: Version 4.2.0
in scheme: v3
preferred label: Guerras del Sexo

Cum shots
type: Concept
issued: 2023-12-20
modified: 2025-03-20
comment: Depictions of ejaculation, especially onto another person and especially in the context of pornography.
comment: La representación de la eyaculación, especialmente sobre otra persona, especialmente en el contexto de la pornografía.
alternative label: Cash shots
alternative label: Money shots
alternative label: Money shot
alternative label: Cum shot
change note: Version 4.2.0
in scheme: v3
preferred label: Corrida

Ashing (Erotic)
type: Concept
issued: 2023-12-20
modified: 2025-03-20
comment: Applying cigar or cigarette ash to someone's mouth or body.
alternative label: Ash play
change note: Version 4.2.0
in scheme: v3

Armpits
type: Concept
issued: 2023-12-20
modified: 2025-02-23
comment: The hollow area underneath the upper arm where the shoulder connects, known to be ticklish and/or sexually stimulative.
alternative label: Axilla
broader: Erogenous body parts
change note: Version 4.2.0
has top concept: Erogenous body parts
in scheme: v3

Discipline (Erotic)
type: Concept
issued: 2024-01-02
modified: 2025-03-20
comment: A variety of practices where someone in a dominant role sets rules for someone in a submissive role that they are expected to obey and the dominant administers punishments, corrections, or rewards.
comment: Una variedad de prácticas en las que alguien en un rol dominante establece reglas para alguien en un rol sumiso que se espera que obedezca y la persona en el rol dominante administra castigos, correcciones o recompensas.
change note: Version 4.2.0
in scheme: v3
preferred label: Disciplina

Aromantic zines
type: Concept
issued: 2024-01-02
modified: 2025-02-23
comment: Independent, small-circulation publications usually reproduced via photocopier; use for zines created by aromantic people and/or focusing on aromantic identity, issues, or culture.
comment: Publicaciones independientes de pequeña tirada generalmente reproducidas mediante fotocopiadora; utilícese para revistas creadas por personas arrománticas y/o centradas en la identidad arromántica.
broader: LGBTQ+ zines
change note: Version 4.2.0
has top concept: LGBTQ+ press
in scheme: v3
preferred label: Zines arrománticos

Non-binary zines
type: Concept
issued: 2024-01-02
modified: 2025-02-23
comment: Independent, small-circulation publications usually reproduced via photocopier; use for zines created by non-binary people and/or focusing on non-binary identities, issues, or culture.
alternative label: Nonbinary zines
broader: LGBTQ+ zines
change note: Version 4.2.0
has top concept: LGBTQ+ press
in scheme: v3

LGBTQ+ country music
type: Concept
issued: 2024-01-09
modified: 2025-02-23
comment: Music expressing a LGBTQ+ sensibility, produced within the larger country genre since the 1930s.
comment: Música que expresa una sensibilidad LGBTQ+, producida dentro del género musical del más amplio del country desde la década de 1930.
alternative label: Música campirana LGBTQ+
broader: LGBTQ+ music
change note: Version 4.2.0
has top concept: Subcultures
in scheme: v3
preferred label: Música country LGBTQ+

Gay musicals
type: Concept
issued: 2024-01-09
modified: 2025-02-23
comment: Musicals created by gay directors, depicting gay men, or that are regarded as important within gay culture.
comment: Instituciones dedicadas al almacenamiento, la exhibición, la conservación y la preservación de materiales relacionados con hombres gay o la historia gay.
alternative label: Homosexual musicals
broader: LGBTQ+ musicals
change note: Version 4.2.0
has top concept: Subcultures
in scheme: v3
preferred label: Museos gay

Bisexual musicals
type: Concept
issued: 2024-01-09
modified: 2025-02-23
comment: Musicals created by bisexual directors, depicting bisexual individuals, or that are regarded as important within bisexual culture.
broader: LGBTQ+ musicals
change note: Version 4.2.0
has top concept: Subcultures
in scheme: v3

Transgender musicals
type: Concept
issued: 2024-01-09
modified: 2025-02-23
comment: Musicals created by transgender directors, depicting transgender individuals, or that are regarded as important within transgender culture.
comment: Musicales creados por directores transgénero, que representan a personas transgénero o personas consideradas importantes dentro de la cultura transgénero.
broader: LGBTQ+ musicals
change note: Version 4.2.0
has top concept: Subcultures
in scheme: v3
preferred label: Musicales transgénero

Asexual musicals
type: Concept
issued: 2024-01-09
modified: 2025-02-23
comment: Musicals created by asexual directors, depicting asexual individuals, or that are regarded as important within asexual culture.
comment: Musicales creados por directores asexuales que representan a personas asexuales.
broader: LGBTQ+ musicals
change note: Version 4.2.0
has top concept: Subcultures
in scheme: v3
preferred label: Musicales asexuales

Intersex musicals
type: Concept
issued: 2024-01-09
modified: 2025-02-23
comment: Musicals created by intersex directors, depicting intersex individuals, or that are regarded as important within intersex culture.
comment: Musicales por directores intersex, presentando a personas intersex, o personas consideradas importantes dentro de la cultura intersex
broader: LGBTQ+ musicals
change note: Version 4.2.0
has top concept: Subcultures
in scheme: v3
preferred label: Musicales intersex

Transfeminists
type: Concept
issued: 2024-01-11
modified: 2025-02-28
comment: A person who is part of or subscribes to beliefs developed as part of a movement by and for trans women who view the liberation of trans women as essential to the liberation of all women. Use when resources are about transfeminists or when an individual identifies as such.
comment: Una persona que forma parte de o se suscribe a creencias desarrolladas como parte de un movimiento por y para las mujeres trans, que ven la liberación de las mujeres trans como esencial para la liberación de todas las mujeres. Utilícese cuando los recursos sean sobre transfeministas o cuando una persona se identifique como tal.
change note: Version 4.2.0
in scheme: v3
preferred label: Transfeministas

Gay urban fantasy fiction
type: Concept
issued: 2024-01-18
modified: 2025-02-23
comment: A subgenre of fantasy fiction featuring magic and supernatural creatures in contemporary urban settings; use for urban fantasy focusing on gay male characters or themes.
comment: Un subgénero de ficción fantástica que presenta a criaturas mágicas y sobrenaturales en entornos urbanos contemporáneos; utilícese para la fantasía urbana centrada en temas o personajes masculinos gay.
broader: LGBTQ+ urban fantasy fiction
change note: Version 4.2.0
has top concept: Subcultures
in scheme: v3
preferred label: Ficción fantástica urbana gay

Lesbian urban fantasy fiction
type: Concept
issued: 2024-01-18
modified: 2025-02-23
comment: A subgenre of fantasy fiction featuring magic and supernatural creatures in contemporary urban settings; use for urban fantasy focusing on lesbian characters or themes.
comment: Un subgénero de la ficción fantástica que presenta criaturas mágicas y sobrenaturales en entornos urbanos contemporáneos; utilícese para la fantasía urbana centrada en personajes o temas lésbicos.
broader: LGBTQ+ urban fantasy fiction
change note: Version 4.2.0
has top concept: Subcultures
in scheme: v3
preferred label: Ficción fantástica urbana lésbica

Bisexual urban fantasy fiction
type: Concept
issued: 2024-01-18
modified: 2025-02-23
comment: A subgenre of fantasy fiction featuring magic and supernatural creatures in contemporary urban settings; use for urban fantasy focusing on bisexual characters or themes.
comment: Un subgénero de la ficción fantástica que presenta criaturas mágicas y sobrenaturales en entornos urbanos contemporáneos; utilícese para la fantasía urbana centrada en personajes o temas bisexuales.
broader: LGBTQ+ urban fantasy fiction
change note: Version 4.2.0
has top concept: Subcultures
in scheme: v3
preferred label: Ficción fantástica urbana bisexual

Queer urban fantasy fiction
type: Concept
issued: 2024-01-18
modified: 2025-02-23
comment: A subgenre of fantasy fiction featuring magic and supernatural creatures in contemporary urban settings; use for urban fantasy focusing on queer characters or themes.
comment: Un subgénero de la ficción fantástica que presenta criaturas mágicas y sobrenaturales en entornos urbanos contemporáneos; utilícese para la ficción fantástica urbana centrada en personajes o temas queer.
broader: LGBTQ+ urban fantasy fiction
change note: Version 4.2.0
has top concept: Subcultures
in scheme: v3
preferred label: Ficción fantástica urbana queer

Transgender urban fantasy fiction
type: Concept
issued: 2024-01-18
modified: 2025-02-23
comment: A subgenre of fantasy fiction featuring magic and supernatural creatures in contemporary urban settings; use for urban fantasy focusing on transgender characters or themes.
comment: Un subgénero de la ficción fantástica que presenta criaturas mágicas y sobrenaturales en entornos urbanos contemporáneos; utilícese para la ficción fantástica urbana centrada en personajes o temas transgénero.
broader: LGBTQ+ urban fantasy fiction
change note: Version 4.2.0
has top concept: Subcultures
in scheme: v3
preferred label: Ficción fantástica urbana transgénero

Asexual urban fantasy fiction
type: Concept
issued: 2024-01-18
modified: 2025-02-23
comment: A subgenre of fantasy fiction featuring magic and supernatural creatures in contemporary urban settings; use for urban fantasy focusing on asexual characters or themes.
comment: Un subgénero de la ficción fantástica que presenta a criaturas mágicas y sobrenaturales en entornos urbanos contemporáneos; utilícese para la fantasía urbana centrada en personajes o temas asexuales.
broader: LGBTQ+ urban fantasy fiction
change note: Version 4.2.0
has top concept: Subcultures
in scheme: v3
preferred label: Ficción fantástica urbana asexual

Aromantic urban fantasy fiction
type: Concept
issued: 2024-01-18
modified: 2025-02-23
comment: A subgenre of fantasy fiction featuring magic and supernatural creatures in contemporary urban settings; use for urban fantasy focusing on aromantic characters or themes.
comment: Un subgénero de la ficción fantástica que presenta criaturas mágicas y sobrenaturales en entornos urbanos contemporáneos; utilícese para fantasía urbana centrada en personajes o temas arománticos.
broader: LGBTQ+ urban fantasy fiction
change note: Version 4.2.0
has top concept: Subcultures
in scheme: v3
preferred label: Ficción fantástica urbana arromántica

Megasexual urban fantasy fiction
type: Concept
issued: 2024-01-18
modified: 2025-02-23
comment: A subgenre of fantasy fiction featuring magic and supernatural creatures in contemporary urban settings; use for urban fantasy focusing on megasexual characters or themes.
comment: Un subgénero de la ficción fantástica que presenta criaturas mágicas y sobrenaturales en entornos urbanos contemporáneos; utilícese para la ficción fantasía urbana centrada en personajes o temas megasexuales.
broader: LGBTQ+ urban fantasy fiction
change note: Version 4.2.0
has top concept: Subcultures
in scheme: v3
preferred label: Ficción fantástica urbana megasexual

Demisexual urban fantasy fiction
type: Concept
issued: 2024-01-18
modified: 2025-02-23
comment: A subgenre of fantasy fiction featuring magic and supernatural creatures in contemporary urban settings; use for urban fantasy focusing on demisexual characters or themes.
comment: Un subgénero de la ficción fantástica que presenta criaturas mágicas y sobrenaturales en entornos urbanos contemporáneos. Utilícese para fantasía urbana centrada en personajes o temas demisexuales.
broader: LGBTQ+ urban fantasy fiction
change note: Version 4.2.0
has top concept: Subcultures
in scheme: v3
preferred label: Ficción fantástica urbana demisexual

Intersex urban fantasy fiction
type: Concept
issued: 2024-01-18
modified: 2025-02-23
comment: A subgenre of fantasy fiction featuring magic and supernatural creatures in contemporary urban settings; use for urban fantasy focusing on intersex characters or themes.
comment: Un subgénero de la ficción fantástica que presenta criaturas mágicas y sobrenaturales en entornos urbanos contemporáneos; utilícese para la fantasía urbana centrada en personajes o temas intersex.
broader: LGBTQ+ urban fantasy fiction
change note: Version 4.2.0
has top concept: Subcultures
in scheme: v3
preferred label: Ficción fantástica urbana intersex

Greyromantic urban fantasy fiction
type: Concept
issued: 2024-01-18
modified: 2025-02-23
comment: A subgenre of fantasy fiction featuring magic and supernatural creatures in contemporary urban settings; use for urban fantasy focusing on greyromantic characters or themes.
comment: Un subgénero de la ficción fantástica que presenta criaturas mágicas y sobrenaturales en entornos urbanos contemporáneos; utilícese para la fantasía urbana centrada en personajes o temas grisrománticos.
broader: LGBTQ+ urban fantasy fiction
change note: Version 4.2.0
has top concept: Subcultures
in scheme: v3
preferred label: Ficción fantástica urbana grisromántica

Lesbian dominants
type: Concept
issued: 2024-02-01
modified: 2025-02-23
comment: Lesbians who are part of the BDSM scene and assume the dominant role in sexual relationships with a dominant/submissive dynamic.
comment: Lesbianas que forman parte de la escena BDSM y asumen el rol dominante en las relaciones sexuales con una dinámica dominante/sumisa.
alternative label: Lesbian masters
alternative label: Amas lesbianas
broader: LGBTQ+ dominants
change note: Version 4.2.0
has top concept: Sexual identity
in scheme: v3
preferred label: Lesbianas dominantes

Lesbian solidarity
type: Concept
issued: 2024-04-16
modified: 2025-02-23
comment: A sense of fellowship and overall unity of purpose, political interest, and/or community sympathies based on shared experiences as lesbians.
broader: LGBTQ+ solidarity
change note: Version 4.2.0
has top concept: LGBTQ+ solidarity
in scheme: v3

Gay solidarity
type: Concept
issued: 2024-04-16
modified: 2025-02-23
comment: A sense of fellowship and overall unity of purpose, political interest, and/or community sympathies based on shared experiences as gay men.
broader: LGBTQ+ solidarity
change note: Version 4.2.0
has top concept: LGBTQ+ solidarity
in scheme: v3

Bisexual solidarity
type: Concept
issued: 2024-04-16
modified: 2025-02-23
comment: A sense of fellowship and overall unity of purpose, political interest, and/or community sympathies based on shared experiences as bisexual people.
broader: LGBTQ+ solidarity
change note: Version 4.2.0
has top concept: LGBTQ+ solidarity
in scheme: v3

Transgender solidarity
type: Concept
issued: 2024-04-16
modified: 2025-02-23
comment: A sense of fellowship and overall unity of purpose, political interest, and/or community sympathies based on shared experiences as transgender people.
alternative label: Trans solidarity
broader: LGBTQ+ solidarity
change note: Version 4.2.0
has top concept: LGBTQ+ solidarity
in scheme: v3

Queer solidarity
type: Concept
issued: 2024-04-16
modified: 2025-02-23
comment: A sense of fellowship and overall unity of purpose, political interest, and/or community sympathies based on shared experiences as queer people.
broader: LGBTQ+ solidarity
change note: Version 4.2.0
has top concept: LGBTQ+ solidarity
in scheme: v3

Intersex solidarity
type: Concept
issued: 2024-04-16
modified: 2025-02-23
comment: A sense of fellowship and overall unity of purpose, political interest, and/or community sympathies based on shared experiences as intersex people.
broader: LGBTQ+ solidarity
change note: Version 4.2.0
has top concept: LGBTQ+ solidarity
in scheme: v3

Asexual solidarity
type: Concept
issued: 2024-04-16
modified: 2025-02-23
comment: A sense of fellowship and overall unity of purpose, political interest, and/or community sympathies based on shared experiences as asexual people.
broader: LGBTQ+ solidarity
change note: Version 4.2.0
has top concept: LGBTQ+ solidarity
in scheme: v3

Aromantic solidarity
type: Concept
issued: 2024-04-16
modified: 2025-02-23
comment: A sense of fellowship and overall unity of purpose, political interest, and/or community sympathies based on shared experiences as aromantic people.
broader: LGBTQ+ solidarity
change note: Version 4.2.0
has top concept: LGBTQ+ solidarity
in scheme: v3

Demisexual solidarity
type: Concept
issued: 2024-04-16
modified: 2025-02-23
comment: A sense of fellowship and overall unity of purpose, political interest, and/or community sympathies based on shared experiences as demisexual people.
broader: LGBTQ+ solidarity
change note: Version 4.2.0
has top concept: LGBTQ+ solidarity
in scheme: v3

Greyromantic solidarity
type: Concept
issued: 2024-04-16
modified: 2025-02-23
comment: A sense of fellowship and overall unity of purpose, political interest, and/or community sympathies based on shared experiences as greyromantic people.
broader: LGBTQ+ solidarity
change note: Version 4.2.0
has top concept: LGBTQ+ solidarity
in scheme: v3

Megasexual solidarity
type: Concept
issued: 2024-04-16
modified: 2025-02-23
comment: A sense of fellowship and overall unity of purpose, political interest, and/or community sympathies based on shared experiences as megasexual people.
broader: LGBTQ+ solidarity
change note: Version 4.2.0
has top concept: LGBTQ+ solidarity
in scheme: v3

Non-binary solidarity
type: Concept
issued: 2024-04-16
modified: 2025-02-23
comment: A sense of fellowship and overall unity of purpose, political interest, and/or community sympathies based on shared experiences as non-binary people.
alternative label: Nonbinary solidarity
broader: LGBTQ+ solidarity
change note: Version 4.2.0
has top concept: LGBTQ+ solidarity
in scheme: v3

Lesbian websites
type: Concept
issued: 2024-04-25
modified: 2025-02-23
comment: Public web pages that primarily address lesbian communities and issues, as well as web pages intended for use by lesbians.
broader: LGBTQ+ websites
change note: Version 4.2.0
has top concept: LGBTQ+ websites
in scheme: v3

Gay websites
type: Concept
issued: 2024-04-25
modified: 2025-02-23
comment: Public web pages that primarily address gay communities and issues, as well as web pages intended for use by gay people.
broader: LGBTQ+ websites
change note: Version 4.2.0
has top concept: LGBTQ+ websites
in scheme: v3

Bisexual websites
type: Concept
issued: 2024-04-25
modified: 2025-02-23
comment: Public web pages that primarily address bisexual communities and issues, as well as web pages intended for use by bisexual people.
broader: LGBTQ+ websites
change note: Version 4.2.0
has top concept: LGBTQ+ websites
in scheme: v3

Transgender websites
type: Concept
issued: 2024-04-25
modified: 2025-02-23
comment: Public web pages that primarily address transgender communities and issues, as well as web pages intended for use by transgender people.
broader: LGBTQ+ websites
change note: Version 4.2.0
has top concept: LGBTQ+ websites
in scheme: v3

Queer websites
type: Concept
issued: 2024-04-25
modified: 2025-02-23
comment: Public web pages that primarily address queer communities and issues, as well as web pages intended for use by queer people.
broader: LGBTQ+ websites
change note: Version 4.2.0
has top concept: LGBTQ+ websites
in scheme: v3

Intersex websites
type: Concept
issued: 2024-04-25
modified: 2025-02-23
comment: Public web pages that primarily address intersex communities and issues, as well as web pages intended for use by intersex people.
broader: LGBTQ+ websites
change note: Version 4.2.0
has top concept: LGBTQ+ websites
in scheme: v3

Aromantic websites
type: Concept
issued: 2024-04-25
modified: 2025-02-23
comment: Public web pages that primarily address aromantic communities and issues, as well as web pages intended for use by aromantic people.
broader: LGBTQ+ websites
change note: Version 4.2.0
has top concept: LGBTQ+ websites
in scheme: v3

Asexual websites
type: Concept
issued: 2024-04-25
modified: 2025-02-23
comment: Public web pages that primarily address asexual communities and issues, as well as web pages intended for use by asexual people.
broader: LGBTQ+ websites
change note: Version 4.2.0
has top concept: LGBTQ+ websites
in scheme: v3

Demisexual websites
type: Concept
issued: 2024-04-25
modified: 2025-02-23
comment: Public web pages that primarily address demisexual communities and issues, as well as web pages intended for use by demisexual people.
broader: LGBTQ+ websites
change note: Version 4.2.0
has top concept: LGBTQ+ websites
in scheme: v3

Greyromantic websites
type: Concept
issued: 2024-04-25
modified: 2025-02-23
comment: Public web pages that primarily address greyromantic communities and issues, as well as web pages intended for use by greyromantic people.
broader: LGBTQ+ websites
change note: Version 4.2.0
has top concept: LGBTQ+ websites
in scheme: v3

Megasexual websites
type: Concept
issued: 2024-04-25
modified: 2025-02-23
comment: Public web pages that primarily address megasexual communities and issues, as well as web pages intended for use by megasexual people.
broader: LGBTQ+ websites
change note: Version 4.2.0
has top concept: LGBTQ+ websites
in scheme: v3

Non-binary websites
type: Concept
issued: 2024-04-25
modified: 2025-02-23
comment: Public web pages that primarily address non-binary communities and issues, as well as web pages intended for use by non-binary.
alternative label: Nonbinary websites
broader: LGBTQ+ websites
change note: Version 4.2.0
has top concept: LGBTQ+ websites
in scheme: v3

Lesbian musicals
type: Concept
issued: 2024-05-24
modified: 2025-02-23
comment: Musicals created by lesbian directors, depicting lesbians, or that are regarded as important within lesbian culture.
broader: LGBTQ+ musicals
change note: Version 4.2.0
has top concept: Subcultures
in scheme: v3

Palestinian gay men
type: Concept
issued: 2024-05-24
modified: 2025-02-23
comment: Gay men who were born in, reside in, and/or are descended from those indigenous to the country of Palestine.
alternative label: Gay Palestinians
broader: Palestinian LGBTQ+ people
change note: Version 4.2.0
has top concept: LGBTQ+ people
in scheme: v3

Palestinian lesbians
type: Concept
issued: 2024-05-24
modified: 2025-02-23
comment: Lesbians who were born in, reside in, and/or are descended from those indigenous to the country of Palestine.
alternative label: Lesbian Palestinians
broader: Palestinian LGBTQ+ people
change note: Version 4.2.0
has top concept: LGBTQ+ people
in scheme: v3

Palestinian bisexual people
type: Concept
issued: 2024-05-24
modified: 2025-02-23
comment: Bisexual people who were born in, reside in, and/or are descended from those indigenous to the country of Palestine.
alternative label: Bisexual Palestinians
broader: Palestinian LGBTQ+ people
change note: Version 4.2.0
has top concept: LGBTQ+ people
in scheme: v3

Palestinian queer people
type: Concept
issued: 2024-05-24
modified: 2025-02-23
comment: Queer people who were born in, reside in, and/or are descended from those indigenous to the country of Palestine.
alternative label: Queer Palestinians
broader: Palestinian LGBTQ+ people
change note: Version 4.2.0
has top concept: LGBTQ+ people
in scheme: v3

Palestinian transgender people
type: Concept
issued: 2024-05-24
modified: 2025-02-23
comment: Transgender people who were born in, reside in, and/or are descended from those indigenous to the country of Palestine.
alternative label: Palestinian trans people
alternative label: Trans Palestinians
alternative label: Transgender Palestinians
broader: Palestinian LGBTQ+ people
change note: Version 4.2.0
has top concept: LGBTQ+ people
in scheme: v3

Palestinian non-binary people
type: Concept
issued: 2024-05-24
modified: 2025-02-23
comment: Non-binary people who were born in, reside in, and/or are descended from those indigenous to the country of Palestine.
alternative label: Non-binary Palestinians
alternative label: Nonbinary Palestinians
alternative label: Palestinian nonbinary people
broader: Palestinian LGBTQ+ people
change note: Version 4.2.0
has top concept: LGBTQ+ people
in scheme: v3

Palestinian asexual people
type: Concept
issued: 2024-05-24
modified: 2025-02-23
comment: Asexual people who were born in, reside in, and/or are descended from those indigenous to the country of Palestine.
alternative label: Ace Palestinians
alternative label: Asexual Palestinians
broader: Palestinian LGBTQ+ people
change note: Version 4.2.0
has top concept: LGBTQ+ people
in scheme: v3

Palestinian intersex people
type: Concept
issued: 2024-05-24
modified: 2025-02-23
comment: Intersex people who were born in, reside in, and/or are descended from those indigenous to the country of Palestine.
alternative label: Intersex Palestinians
broader: Palestinian LGBTQ+ people
change note: Version 4.2.0
has top concept: LGBTQ+ people
in scheme: v3

Asexual teachers
type: Concept
issued: 2024-05-24
modified: 2025-02-23
comment: Teachers who self-identify as asexual.
broader: LGBTQ+ teachers
change note: Version 4.2.0
has top concept: LGBTQ+ people
in scheme: v3

Bisexual teachers
type: Concept
issued: 2024-05-24
modified: 2025-02-23
comment: Teachers who self-identify as bisexual.
alternative label: Bi teachers
broader: LGBTQ+ teachers
change note: Version 4.2.0
has top concept: LGBTQ+ people
in scheme: v3

Demisexual teachers
type: Concept
issued: 2024-05-24
modified: 2025-02-23
comment: Teachers who self-identify as demisexual.
broader: LGBTQ+ teachers
change note: Version 4.2.0
has top concept: LGBTQ+ people
in scheme: v3

Gay teachers
type: Concept
issued: 2024-05-24
modified: 2025-02-23
comment: Teachers who self-identify as gay men.
broader: LGBTQ+ teachers
change note: Version 4.2.0
has top concept: LGBTQ+ people
in scheme: v3

Greyromantic teachers
type: Concept
issued: 2024-05-24
modified: 2025-02-23
comment: Teachers who self-identify as greyromantic.
broader: LGBTQ+ teachers
change note: Version 4.2.0
has top concept: LGBTQ+ people
in scheme: v3

Intersex teachers
type: Concept
issued: 2024-05-24
modified: 2025-02-23
comment: Teachers who are intersex.
broader: LGBTQ+ teachers
change note: Version 4.2.0
has top concept: LGBTQ+ people
in scheme: v3

Lesbian teachers
type: Concept
issued: 2024-05-24
modified: 2025-02-23
comment: Teachers who self-identify as lesbians.
broader: LGBTQ+ teachers
change note: Version 4.2.0
has top concept: LGBTQ+ people
in scheme: v3

Megasexual teachers
type: Concept
issued: 2024-05-24
modified: 2025-02-23
comment: Teachers who self-identify as megasexual.
broader: LGBTQ+ teachers
change note: Version 4.2.0
has top concept: LGBTQ+ people
in scheme: v3

Non-binary teachers
type: Concept
issued: 2024-05-24
modified: 2025-02-23
comment: Teachers who self-identify as non-binary.
alternative label: Nonbinary teachers
broader: LGBTQ+ teachers
change note: Version 4.2.0
has top concept: LGBTQ+ people
in scheme: v3

Queer teachers
type: Concept
issued: 2024-05-24
modified: 2025-02-23
comment: Teachers who self-identify as queer.
broader: LGBTQ+ teachers
change note: Version 4.2.0
has top concept: LGBTQ+ people
in scheme: v3

Transgender teachers
type: Concept
issued: 2024-05-24
modified: 2025-02-23
comment: Teachers who self-identify as transgender.
alternative label: Trans teachers
broader: LGBTQ+ teachers
change note: Version 4.2.0
has top concept: LGBTQ+ people
in scheme: v3

Asexual academics
type: Concept
issued: 2024-05-24
modified: 2025-02-23
comment: Asexual researchers and/or educators working in higher education.
alternative label: Ace academics
alternative label: Asexual college teachers
alternative label: Asexual professors
alternative label: Asexual researchers
broader: LGBTQ+ academics
change note: Version 4.2.0
has top concept: LGBTQ+ people
in scheme: v3

Bisexual academics
type: Concept
issued: 2024-05-24
modified: 2025-02-23
comment: Bisexual researchers and/or educators working in higher education.
alternative label: Bi academics
alternative label: Bisexual college teachers
alternative label: Bisexual professors
alternative label: Bisexual researchers
broader: LGBTQ+ academics
change note: Version 4.2.0
has top concept: LGBTQ+ people
in scheme: v3

Demisexual academics
type: Concept
issued: 2024-05-24
modified: 2025-02-23
comment: Demisexual researchers and/or educators working in higher education.
alternative label: Demi academics
alternative label: Demisexual college teachers
alternative label: Demisexual professors
alternative label: Demisexual researchers
broader: LGBTQ+ academics
change note: Version 4.2.0
has top concept: LGBTQ+ people
in scheme: v3

Gay academics
type: Concept
issued: 2024-05-24
modified: 2025-02-23
comment: Gay men working as researchers or educators in higher education.
alternative label: Gay college teachers
alternative label: Gay professors
alternative label: Gay researchers
broader: LGBTQ+ academics
change note: Version 4.2.0
has top concept: LGBTQ+ people
in scheme: v3

Greyromantic academics
type: Concept
issued: 2024-05-24
modified: 2025-02-23
comment: Greyromantic researchers and/or educators working in higher education.
alternative label: Greyromantic college teachers
alternative label: Greyromantic professors
alternative label: Greyromantic researchers
broader: LGBTQ+ academics
change note: Version 4.2.0
has top concept: LGBTQ+ people
in scheme: v3

Intersex academics
type: Concept
issued: 2024-05-24
modified: 2025-02-23
comment: Intersex researchers and/or educators working in higher education.
alternative label: Intersex college teachers
alternative label: Intersex professors
alternative label: Intersex researchers
broader: LGBTQ+ academics
change note: Version 4.2.0
has top concept: LGBTQ+ people
in scheme: v3

Lesbian academics
type: Concept
issued: 2024-05-24
modified: 2025-02-23
comment: Lesbian researchers and/or educators working in higher education.
alternative label: Lesbian college teachers
alternative label: Lesbian professors
alternative label: Lesbian researchers
broader: LGBTQ+ academics
change note: Version 4.2.0
has top concept: LGBTQ+ people
in scheme: v3

Megasexual academics
type: Concept
issued: 2024-05-24
modified: 2025-02-23
comment: Megasexual researchers and/or educators working in higher education.
alternative label: Megasexual college teachers
alternative label: Megasexual professors
alternative label: Megasexual researchers
broader: LGBTQ+ academics
change note: Version 4.2.0
has top concept: LGBTQ+ people
in scheme: v3

Non-binary academics
type: Concept
issued: 2024-05-24
modified: 2025-02-23
comment: Non-binary researchers and/or educators working in higher education.
alternative label: Non-binary college teachers
alternative label: Non-binary professors
alternative label: Non-binary researchers
alternative label: Nonbinary academics
broader: LGBTQ+ academics
change note: Version 4.2.0
has top concept: LGBTQ+ people
in scheme: v3

Queer academics
type: Concept
issued: 2024-05-24
modified: 2025-02-23
comment: Queer researchers and/or educators working in higher education.
alternative label: Queer college teachers
alternative label: Queer professors
alternative label: Queer researchers
broader: LGBTQ+ academics
change note: Version 4.2.0
has top concept: LGBTQ+ people
in scheme: v3

Transgender academics
type: Concept
issued: 2024-05-24
modified: 2025-02-23
comment: Transgender researchers and/or educators working in higher education.
alternative label: Trans academics
alternative label: Transgender college teachers
alternative label: Transgender professors
alternative label: Transgender researchers
broader: LGBTQ+ academics
change note: Version 4.2.0
has top concept: LGBTQ+ people
in scheme: v3

Arab non-binary people
type: Concept
issued: 2024-06-10
modified: 2025-02-23
comment: Non-binary people who are from Arab countries and/or are descended from Arab peoples. Do not conflate with Muslim people.
alternative label: Arab nonbinary people
alternative label: Non-binary Arab people
alternative label: Non-binary Arabs
alternative label: Nonbinary Arab people
alternative label: Nonbinary Arabs
broader: Arab LGBTQ+ people
change note: Version 4.2.0
has top concept: LGBTQ+ people
in scheme: v3

Open marriage
type: Concept
issued: 2024-06-10
modified: 2025-02-23
comment: A form of consensual non-monogamy in which spouses agree to engage in sexual and/or romantic relationships with individuals other than their marriage partner, without regarding this as infidelity.
broader: Consensual non-monogamy
change note: Version 4.2.0
has top concept: Relationship orientation
in scheme: v3

Central American Indigenous asexual people
type: Concept
issued: 2024-06-10
modified: 2025-02-23
comment: People who are part of the Native peoples of Central America and self-identify as asexual.
alternative label: Asexual Central American Indigenous people
alternative label: Asexual Central American Native people
alternative label: Central American Native asexual people
alternative label: Indigenous Central American asexual people
broader: Central American Indigenous LGBTQ+ people
change note: Version 4.2.0
has top concept: LGBTQ+ people
in scheme: v3

Central American Indigenous bisexual people
type: Concept
issued: 2024-06-10
modified: 2025-02-23
comment: People who are part of the Native peoples of Central America and self-identify as bisexual.
alternative label: Bisexual Central American Indigenous people
alternative label: Bisexual Central American Native people
alternative label: Central American Native bisexual people
alternative label: Indigenous Central American bisexual people
broader: Central American Indigenous LGBTQ+ people
change note: Version 4.2.0
has top concept: LGBTQ+ people
in scheme: v3

Central American Indigenous gay men
type: Concept
issued: 2024-06-10
modified: 2025-02-23
comment: Men who are part of the Native peoples of Central America and self-identify as gay.
alternative label: Central American Native gay men
alternative label: Gay Central American Indigenous men
alternative label: Gay Central American Native men
alternative label: Indigenous Central American gay men
broader: Central American Indigenous LGBTQ+ people
change note: Version 4.2.0
has top concept: LGBTQ+ people
in scheme: v3

Central American Indigenous intersex people
type: Concept
issued: 2024-06-10
modified: 2025-02-23
comment: People who are part of the Native peoples of Central America and self-identify as intersex.
alternative label: Central American Native intersex people
alternative label: Indigenous Central American intersex people
alternative label: Intersex Central American Indigenous people
alternative label: Intersex Central American Native people
broader: Central American Indigenous LGBTQ+ people
change note: Version 4.2.0
has top concept: LGBTQ+ people
in scheme: v3

Central American Indigenous lesbians
type: Concept
issued: 2024-06-10
modified: 2025-02-23
comment: People who are part of the Native peoples of Central America and self-identify as lesbians.
alternative label: Central American Native lesbians
alternative label: Indigenous Central American lesbians
alternative label: Lesbian Central American Indigenous people
alternative label: Lesbian Central American Native people
broader: Central American Indigenous LGBTQ+ people
change note: Version 4.2.0
has top concept: LGBTQ+ people
in scheme: v3

Central American Indigenous queer people
type: Concept
issued: 2024-06-10
modified: 2025-02-23
comment: People who are part of the Native peoples of Central America and self-identify as queer.
alternative label: Central American Native queer people
alternative label: Indigenous Central American queer people
alternative label: Queer Central American Indigenous people
alternative label: Queer Central American Native people
broader: Central American Indigenous LGBTQ+ people
change note: Version 4.2.0
has top concept: LGBTQ+ people
in scheme: v3

Central American Indigenous transgender people
type: Concept
issued: 2024-06-10
modified: 2025-02-23
comment: People who are part of the Native peoples of Central America and self-identify as transgender.
alternative label: Central American Native transgender people
alternative label: Indigenous Central American transgender people
alternative label: Transgender Central American Indigenous people
alternative label: Transgender Central American Native people
broader: Central American Indigenous LGBTQ+ people
change note: Version 4.2.0
has top concept: LGBTQ+ people
in scheme: v3

Central American Indigenous non-binary people
type: Concept
issued: 2024-06-10
modified: 2025-02-23
comment: People who are part of the Native peoples of Central America and self-identify as non-binary.
alternative label: Central American Indigenous nonbinary people
alternative label: Central American Native non-binary people
alternative label: Indigenous Central American non-binary people
alternative label: Non-binary Central American Indigenous people
alternative label: Non-binary Central American Native people
broader: Central American Indigenous LGBTQ+ people
change note: Version 4.2.0
has top concept: LGBTQ+ people
in scheme: v3

Central American Indigenous demisexual people
type: Concept
issued: 2024-06-10
modified: 2025-02-23
comment: People who are part of the Native peoples of Central America and self-identify as demisexual.
alternative label: Central American Native demisexual people
alternative label: Demisexual Central American Indigenous people
alternative label: Demisexual Central American Native people
alternative label: Indigenous Central American demisexual people
broader: Central American Indigenous LGBTQ+ people
change note: Version 4.2.0
has top concept: LGBTQ+ people
in scheme: v3

Central American Indigenous megasexual people
type: Concept
issued: 2024-06-10
modified: 2025-02-23
comment: People who are part of the Native peoples of Central America and self-identify as megasexual.
alternative label: Central American Native megasexual people
alternative label: Indigenous Central American megasexual people
alternative label: Megasexual Central American Indigenous people
alternative label: Megasexual Central American Native people
broader: Central American Indigenous LGBTQ+ people
change note: Version 4.2.0
has top concept: LGBTQ+ people
in scheme: v3

Central American Indigenous greyromantic people
type: Concept
issued: 2024-06-10
modified: 2025-02-23
comment: People who are part of the Native peoples of Central America and self-identify as greyromantic.
alternative label: Central American Native greyromantic people
alternative label: Greyromantic Central American Indigenous people
alternative label: Greyromantic Central American Native people
alternative label: Indigenous Central American greyromantic people
broader: Central American Indigenous LGBTQ+ people
change note: Version 4.2.0
has top concept: LGBTQ+ people
in scheme: v3

Central American Indigenous aromantic people
type: Concept
issued: 2024-06-10
modified: 2025-02-23
comment: People who are part of the Native peoples of Central America and self-identify as aromantic.
alternative label: Aromantic Central American Indigenous people
alternative label: Aromantic Central American Native people
alternative label: Central American Native aromantic people
alternative label: Indigenous Central American aromantic people
broader: Central American Indigenous LGBTQ+ people
change note: Version 4.2.0
has top concept: LGBTQ+ people
in scheme: v3

South American Indigenous asexual people
type: Concept
issued: 2024-06-10
modified: 2025-02-23
comment: People who are part of the Native peoples of South America and self-identify as asexual.
alternative label: Asexual South American Indigenous people
alternative label: Asexual South American Native people
alternative label: Indigenous South American asexual people
alternative label: South American Native asexual people
broader: South American Indigenous LGBTQ+ people
change note: Version 4.2.0
has top concept: LGBTQ+ people
in scheme: v3

South American Indigenous bisexual people
type: Concept
issued: 2024-06-10
modified: 2025-02-23
comment: People who are part of the Native peoples of South America and self-identify as bisexual.
alternative label: Bisexual South American Indigenous people
alternative label: Bisexual South American Native people
alternative label: Indigenous South American bisexual people
alternative label: South American Native bisexual people
broader: South American Indigenous LGBTQ+ people
change note: Version 4.2.0
has top concept: LGBTQ+ people
in scheme: v3

South American Indigenous gay men
type: Concept
issued: 2024-06-10
modified: 2025-02-23
comment: Men who are part of the Native peoples of South America and self-identify as gay.
alternative label: Gay South American Indigenous men
alternative label: Gay South American Native men
alternative label: Indigenous South American gay men
alternative label: South American Native gay men
broader: South American Indigenous LGBTQ+ people
change note: Version 4.2.0
has top concept: LGBTQ+ people
in scheme: v3

South American Indigenous intersex people
type: Concept
issued: 2024-06-10
modified: 2025-02-23
comment: People who are part of the Native peoples of South America and self-identify as intersex.
alternative label: Indigenous South American intersex people
alternative label: Intersex South American Indigenous people
alternative label: Intersex South American Native people
alternative label: South American Native intersex people
broader: South American Indigenous LGBTQ+ people
change note: Version 4.2.0
has top concept: LGBTQ+ people
in scheme: v3

South American Indigenous lesbians
type: Concept
issued: 2024-06-10
modified: 2025-02-23
comment: People who are part of the Native peoples of South America and self-identify as lesbians.
alternative label: Indigenous South American lesbians
alternative label: Lesbian South American Indigenous people
alternative label: Lesbian South American Native people
alternative label: South American Native lesbians
broader: South American Indigenous LGBTQ+ people
change note: Version 4.2.0
has top concept: LGBTQ+ people
in scheme: v3

South American Indigenous queer people
type: Concept
issued: 2024-06-10
modified: 2025-02-23
comment: People who are part of the Native peoples of South America and self-identify as queer.
alternative label: Indigenous South American queer people
alternative label: Queer South American Indigenous people
alternative label: Queer South American Native people
alternative label: South American Native queer people
broader: South American Indigenous LGBTQ+ people
change note: Version 4.2.0
has top concept: LGBTQ+ people
in scheme: v3

South American Indigenous non-binary people
type: Concept
issued: 2024-06-10
modified: 2025-02-23
comment: People who are part of the Native peoples of South America and self-identify as non-binary.
alternative label: Indigenous South American non-binary people
alternative label: Non-binary South American Indigenous people
alternative label: Non-binary South American Native people
alternative label: South American Indigenous nonbinary people
alternative label: South American Native non-binary people
broader: South American Indigenous LGBTQ+ people
change note: Version 4.2.0
has top concept: LGBTQ+ people
in scheme: v3

South American Indigenous transgender people
type: Concept
issued: 2024-06-10
modified: 2025-02-23
comment: People who are part of the Native peoples of South America and self-identify as transgender.
alternative label: Indigenous South American transgender people
alternative label: South American Native transgender people
alternative label: Transgender South American Indigenous people
alternative label: Transgender South American Native people
broader: South American Indigenous LGBTQ+ people
change note: Version 4.2.0
has top concept: LGBTQ+ people
in scheme: v3

South American Indigenous demisexual people
type: Concept
issued: 2024-06-10
modified: 2025-02-23
comment: People who are part of the Native peoples of South America and self-identify as demisexual.
alternative label: Demisexual South American Indigenous people
alternative label: Demisexual South American Native people
alternative label: Indigenous South American demisexual people
alternative label: South American Native demisexual people
broader: South American Indigenous LGBTQ+ people
change note: Version 4.2.0
has top concept: LGBTQ+ people
in scheme: v3

South American Indigenous megasexual people
type: Concept
issued: 2024-06-10
modified: 2025-02-23
comment: People who are part of the Native peoples of South America and self-identify as megasexual.
alternative label: Indigenous South American megasexual people
alternative label: Megasexual South American Indigenous people
alternative label: Megasexual South American Native people
alternative label: South American Native megasexual people
broader: South American Indigenous LGBTQ+ people
change note: Version 4.2.0
has top concept: LGBTQ+ people
in scheme: v3

South American Indigenous greyromantic people
type: Concept
issued: 2024-06-10
modified: 2025-02-23
comment: People who are part of the Native peoples of South America and self-identify as greyromantic.
alternative label: Greyromantic South American Indigenous people
alternative label: Greyromantic South American Native people
alternative label: Indigenous South American greyromantic people
alternative label: South American Native greyromantic people
broader: South American Indigenous LGBTQ+ people
change note: Version 4.2.0
has top concept: LGBTQ+ people
in scheme: v3

South American Indigenous aromantic people
type: Concept
issued: 2024-06-10
modified: 2025-02-23
comment: People who are part of the Native peoples of South America and self-identify as aromantic.
alternative label: Aromantic South American Indigenous people
alternative label: Aromantic South American Native people
alternative label: Indigenous South American aromantic people
alternative label: South American Native aromantic people
broader: South American Indigenous LGBTQ+ people
change note: Version 4.2.0
has top concept: LGBTQ+ people
in scheme: v3

Belarusian asexual people
type: Concept
issued: 2024-06-10
modified: 2025-02-23
comment: Asexual people who are ethnically Belarusian or have Belarusian nationality.
alternative label: Asexual Belarusians
broader: Belarusian LGBTQ+ people
change note: Version 4.2.0
has top concept: LGBTQ+ people
in scheme: v3

Belarusian bisexual people
type: Concept
issued: 2024-06-10
modified: 2025-02-23
comment: Bisexual people who are ethnically Belarusian or have Belarusian nationality.
alternative label: Bi Belarusians
alternative label: Bisexual Belarusians
broader: Belarusian LGBTQ+ people
change note: Version 4.2.0
has top concept: LGBTQ+ people
in scheme: v3

Belarusian gay men
type: Concept
issued: 2024-06-10
modified: 2025-02-23
comment: Gay men who are ethnically Belarusian or have Belarusian nationality.
alternative label: Gay Belarusians
broader: Belarusian LGBTQ+ people
change note: Version 4.2.0
has top concept: LGBTQ+ people
in scheme: v3

Belarusian intersex people
type: Concept
issued: 2024-06-10
modified: 2025-02-23
comment: Intersex people who are ethnically Belarusian or have Belarusian nationality.
alternative label: Intersex Belarusians
broader: Belarusian LGBTQ+ people
change note: Version 4.2.0
has top concept: LGBTQ+ people
in scheme: v3

Belarusian lesbians
type: Concept
issued: 2024-06-10
modified: 2025-02-23
comment: Lesbians who are ethnically Belarusian or have Belarusian nationality.
alternative label: Lesbian Belarusians
broader: Belarusian LGBTQ+ people
change note: Version 4.2.0
has top concept: LGBTQ+ people
in scheme: v3

Belarusian queer people
type: Concept
issued: 2024-06-10
modified: 2025-02-23
comment: Queer people who are ethnically Belarusian or have Belarusian nationality.
alternative label: Queer Belarusians
broader: Belarusian LGBTQ+ people
change note: Version 4.2.0
has top concept: LGBTQ+ people
in scheme: v3

Belarusian non-binary people
type: Concept
issued: 2024-06-10
modified: 2025-02-23
comment: Non-binary people who are ethnically Belarusian or have Belarusian nationality.
alternative label: Belarusian nonbinary people
alternative label: Non-binary Belarusians
alternative label: Nonbinary Belarusians
broader: Belarusian LGBTQ+ people
change note: Version 4.2.0
has top concept: LGBTQ+ people
in scheme: v3

Belarusian transgender people
type: Concept
issued: 2024-06-10
modified: 2025-02-23
comment: Trans people who are ethnically Belarusian or have Belarusian nationality.
alternative label: Belarusian trans people
alternative label: Trans Belarusians
alternative label: Transgender Belarusians
broader: Belarusian LGBTQ+ people
change note: Version 4.2.0
has top concept: LGBTQ+ people
in scheme: v3

Belarusian demisexual people
type: Concept
issued: 2024-06-10
modified: 2025-02-23
comment: Demisexual people who are ethnically Belarusian or have Belarusian nationality.
alternative label: Demisexual Belarusians
broader: Belarusian LGBTQ+ people
change note: Version 4.2.0
has top concept: LGBTQ+ people
in scheme: v3

Belarusian megasexual people
type: Concept
issued: 2024-06-10
modified: 2025-02-23
comment: Megasexual people who are ethnically Belarusian or have Belarusian nationality.
alternative label: Megasexual Belarusians
broader: Belarusian LGBTQ+ people
change note: Version 4.2.0
has top concept: LGBTQ+ people
in scheme: v3

Belarusian greyromantic people
type: Concept
issued: 2024-06-10
modified: 2025-02-23
comment: Greyromantic people who are ethnically Belarusian or have Belarusian nationality.
alternative label: Greyromantic Belarusians
broader: Belarusian LGBTQ+ people
change note: Version 4.2.0
has top concept: LGBTQ+ people
in scheme: v3

Belarusian aromantic people
type: Concept
issued: 2024-06-10
modified: 2025-02-23
comment: Aromantic people who are ethnically Belarusian or have Belarusian nationality.
alternative label: Aromantic Belarusians
broader: Belarusian LGBTQ+ people
change note: Version 4.2.0
has top concept: LGBTQ+ people
in scheme: v3

Russian asexual people
type: Concept
issued: 2024-06-10
modified: 2025-02-23
comment: Asexual people who are ethnically Russian or have Russian nationality.
alternative label: Asexual Russians
broader: Russian LGBTQ+ people
change note: Version 4.2.0
has top concept: LGBTQ+ people
in scheme: v3

Russian bisexual people
type: Concept
issued: 2024-06-10
modified: 2025-02-23
comment: Bisexual people who are ethnically Russian or have Russian nationality.
alternative label: Bisexual Russians
broader: Russian LGBTQ+ people
change note: Version 4.2.0
has top concept: LGBTQ+ people
in scheme: v3

Russian gay men
type: Concept
issued: 2024-06-10
modified: 2025-02-23
comment: Gay men who are ethnically Russian or have Russian nationality.
alternative label: Gay Russians
broader: Russian LGBTQ+ people
change note: Version 4.2.0
has top concept: LGBTQ+ people
in scheme: v3

Russian intersex people
type: Concept
issued: 2024-06-10
modified: 2025-02-23
comment: Intersex people who are ethnically Russian or have Russian nationality.
alternative label: Intersex Russians
broader: Russian LGBTQ+ people
change note: Version 4.2.0
has top concept: LGBTQ+ people
in scheme: v3

Russian lesbians
type: Concept
issued: 2024-06-10
modified: 2025-02-23
comment: Lesbians who are ethnically Russian or have Russian nationality.
alternative label: Lesbian Russians
broader: Russian LGBTQ+ people
change note: Version 4.2.0
has top concept: LGBTQ+ people
in scheme: v3

Russian queer people
type: Concept
issued: 2024-06-10
modified: 2025-02-23
comment: Queer people who are ethnically Russian or have Russian nationality.
alternative label: Queer Russians
broader: Russian LGBTQ+ people
change note: Version 4.2.0
has top concept: LGBTQ+ people
in scheme: v3

Russian non-binary people
type: Concept
issued: 2024-06-10
modified: 2025-02-23
comment: Non-binary people who are ethnically Russian or have Russian nationality.
alternative label: Non-binary Russians
alternative label: Nonbinary Russians
alternative label: Russian nonbinary people
broader: Russian LGBTQ+ people
change note: Version 4.2.0
has top concept: LGBTQ+ people
in scheme: v3

Russian transgender people
type: Concept
issued: 2024-06-10
modified: 2025-02-23
comment: Trans people who are ethnically Russian or have Russian nationality.
alternative label: Russian trans people
alternative label: Trans Russians
alternative label: Transgender Russians
broader: Russian LGBTQ+ people
change note: Version 4.2.0
has top concept: LGBTQ+ people
in scheme: v3

Russian demisexual people
type: Concept
issued: 2024-06-10
modified: 2025-02-23
comment: Demisexual people who are ethnically Russian or have Russian nationality.
alternative label: Demisexual Russians
broader: Russian LGBTQ+ people
change note: Version 4.2.0
has top concept: LGBTQ+ people
in scheme: v3

Russian megasexual people
type: Concept
issued: 2024-06-10
modified: 2025-02-23
comment: Megasexual people who are ethnically Russian or have Russian nationality.
alternative label: Megasexual Russians
broader: Russian LGBTQ+ people
change note: Version 4.2.0
has top concept: LGBTQ+ people
in scheme: v3

Russian greyromantic people
type: Concept
issued: 2024-06-10
modified: 2025-02-23
comment: Greyromantic people who are ethnically Russian or have Russian nationality.
alternative label: Greyromantic Russians
broader: Russian LGBTQ+ people
change note: Version 4.2.0
has top concept: LGBTQ+ people
in scheme: v3

Russian aromantic people
type: Concept
issued: 2024-06-10
modified: 2025-02-23
comment: Aromantic people who are ethnically Russian or have Russian nationality.
alternative label: Aromantic Russians
broader: Russian LGBTQ+ people
change note: Version 4.2.0
has top concept: LGBTQ+ people
in scheme: v3

Indigenous non-binary people
type: Concept
issued: 2024-06-10
modified: 2025-02-23
comment: Non-binary people who are part of an Indigenous people, or culturally distinct ethnic group whose members are directly descended from the earliest known inhabitants of a particular region and, to some extent, maintain the language and culture of those people. Only use to describe people who identify as Indigenous; use more specific terms whenever possible.
alternative label: Indigenous nonbinary people
alternative label: Non-binary Indigenous people
alternative label: Nonbinary Indigenous people
broader: Indigenous LGBTQ+ people
change note: Version 4.2.0
has top concept: LGBTQ+ people
in scheme: v3

Ukrainian asexual people
type: Concept
issued: 2024-06-19
modified: 2025-02-23
comment: Asexual people who are ethnically Ukrainian or have Ukrainian nationality.
alternative label: Asexual Ukrainians
broader: Ukrainian LGBTQ+ people
change note: Version 4.2.0
has top concept: LGBTQ+ people
in scheme: v3

Ukrainian bisexual people
type: Concept
issued: 2024-06-19
modified: 2025-02-23
comment: Bisexual people who are ethnically Ukrainian or have Ukrainian nationality.
alternative label: Bi Ukrainians
alternative label: Bisexual Ukrainians
broader: Ukrainian LGBTQ+ people
change note: Version 4.2.0
has top concept: LGBTQ+ people
in scheme: v3

Ukrainian gay men
type: Concept
issued: 2024-06-19
modified: 2025-02-23
comment: Gay men who are ethnically Ukrainian or have Ukrainian nationality.
alternative label: Gay Ukrainians
broader: Ukrainian LGBTQ+ people
change note: Version 4.2.0
has top concept: LGBTQ+ people
in scheme: v3

Ukrainian intersex people
type: Concept
issued: 2024-06-19
modified: 2025-02-23
comment: Intersex people who are ethnically Ukrainian or have Ukrainian nationality.
alternative label: Intersex Ukrainians
broader: Ukrainian LGBTQ+ people
change note: Version 4.2.0
has top concept: LGBTQ+ people
in scheme: v3

Ukrainian lesbians
type: Concept
issued: 2024-06-19
modified: 2025-02-23
comment: Lesbians who are ethnically Ukrainian or have Ukrainian nationality.
alternative label: Lesbian Ukrainians
broader: Ukrainian LGBTQ+ people
change note: Version 4.2.0
has top concept: LGBTQ+ people
in scheme: v3

Ukrainian queer people
type: Concept
issued: 2024-06-19
modified: 2025-02-23
comment: Queer people who are ethnically Ukrainian or have Ukrainian nationality.
alternative label: Queer Ukrainians
broader: Ukrainian LGBTQ+ people
change note: Version 4.2.0
has top concept: LGBTQ+ people
in scheme: v3

Ukrainian non-binary people
type: Concept
issued: 2024-06-19
modified: 2025-02-23
comment: Non-binary people who are ethnically Ukrainian or have Ukrainian nationality.
alternative label: Non-binary Ukrainians
alternative label: Nonbinary Ukrainians
alternative label: Ukrainian nonbinary people
broader: Ukrainian LGBTQ+ people
change note: Version 4.2.0
has top concept: LGBTQ+ people
in scheme: v3

Ukrainian transgender people
type: Concept
issued: 2024-06-19
modified: 2025-02-23
comment: Trans people who are ethnically Ukrainian or have Ukrainian nationality.
alternative label: Trans Ukrainians
alternative label: Transgender Ukrainians
alternative label: Ukrainian trans people
broader: Ukrainian LGBTQ+ people
change note: Version 4.2.0
has top concept: LGBTQ+ people
in scheme: v3

Ukrainian demisexual people
type: Concept
issued: 2024-06-19
modified: 2025-02-23
comment: Demisexual people who are ethnically Ukrainian or have Ukrainian nationality.
alternative label: Demisexual Ukrainians
broader: Ukrainian LGBTQ+ people
change note: Version 4.2.0
has top concept: LGBTQ+ people
in scheme: v3

Ukrainian megasexual people
type: Concept
issued: 2024-06-19
modified: 2025-02-23
comment: Megasexual people who are ethnically Ukrainian or have Ukrainian nationality.
alternative label: Megasexual Ukrainians
broader: Ukrainian LGBTQ+ people
change note: Version 4.2.0
has top concept: LGBTQ+ people
in scheme: v3

Ukrainian greyromantic people
type: Concept
issued: 2024-06-19
modified: 2025-02-23
comment: Greyromantic people who are ethnically Ukrainian or have Ukrainian nationality.
alternative label: Greyromantic Ukrainians
broader: Ukrainian LGBTQ+ people
change note: Version 4.2.0
has top concept: LGBTQ+ people
in scheme: v3

Ukrainian aromantic people
type: Concept
issued: 2024-06-19
modified: 2025-02-23
comment: Aromantic people who are ethnically Ukrainian or have Ukrainian nationality.
alternative label: Aromantic Ukrainians
broader: Ukrainian LGBTQ+ people
change note: Version 4.2.0
has top concept: LGBTQ+ people
in scheme: v3

Lesbian Unitarian Universalists
type: Concept
issued: 2024-06-19
modified: 2025-02-23
comment: Lesbians who are members of the Unitarian Universalist church.
alternative label: Unitarian Universalist lesbians
broader: LGBTQ+ Unitarian Universalists
change note: Version 4.2.0
has top concept: LGBTQ+ African religions
in scheme: v3

Gay Unitarian Universalists
type: Concept
issued: 2024-06-19
modified: 2025-02-23
comment: Gay men who are members of the Unitarian Universalist church.
alternative label: Unitarian Universalist gay men
broader: LGBTQ+ Unitarian Universalists
change note: Version 4.2.0
has top concept: LGBTQ+ African religions
in scheme: v3

Bisexual Unitarian Universalists
type: Concept
issued: 2024-06-19
modified: 2025-02-23
comment: Bisexual people who are members of the Unitarian Universalist church.
alternative label: Unitarian Universalist bisexual people
alternative label: Unitarian Universalist bisexuals
broader: LGBTQ+ Unitarian Universalists
change note: Version 4.2.0
has top concept: LGBTQ+ African religions
in scheme: v3

Transgender Unitarian Universalists
type: Concept
issued: 2024-06-19
modified: 2025-02-23
comment: Transgender people who are members of the Unitarian Universalist church.
alternative label: Trans Unitarian Universalists
alternative label: Unitarian Universalist trans people
alternative label: Unitarian Universalist transgender people
broader: LGBTQ+ Unitarian Universalists
change note: Version 4.2.0
has top concept: LGBTQ+ African religions
in scheme: v3

Queer Unitarian Universalists
type: Concept
issued: 2024-06-19
modified: 2025-02-23
comment: Queer people who are members of the Unitarian Universalist church.
alternative label: Unitarian Universalist queer people
broader: LGBTQ+ Unitarian Universalists
change note: Version 4.2.0
has top concept: LGBTQ+ African religions
in scheme: v3

Demisexual Unitarian Universalists
type: Concept
issued: 2024-06-19
modified: 2025-02-23
comment: Demisexual people who are members of the Unitarian Universalist church.
alternative label: Unitarian Universalist demisexual people
alternative label: Unitarian Universalist demisexuals
broader: LGBTQ+ Unitarian Universalists
change note: Version 4.2.0
has top concept: LGBTQ+ African religions
in scheme: v3

Megasexual Unitarian Universalists
type: Concept
issued: 2024-06-19
modified: 2025-02-23
comment: Megasexual people who are members of the Unitarian Universalist church.
alternative label: Unitarian Universalist megasexual people
alternative label: Unitarian Universalist megasexuals
broader: LGBTQ+ Unitarian Universalists
change note: Version 4.2.0
has top concept: LGBTQ+ African religions
in scheme: v3

Intersex Unitarian Universalists
type: Concept
issued: 2024-06-19
modified: 2025-02-23
comment: Intersex people who are members of the Unitarian Universalist church.
alternative label: Unitarian Universalist intersex people
broader: LGBTQ+ Unitarian Universalists
change note: Version 4.2.0
has top concept: LGBTQ+ African religions
in scheme: v3

Aromantic Unitarian Universalists
type: Concept
issued: 2024-06-19
modified: 2025-02-23
comment: Aromantic people who are members of the Unitarian Universalist church.
alternative label: Unitarian Universalist aromantic people
broader: LGBTQ+ Unitarian Universalists
change note: Version 4.2.0
has top concept: LGBTQ+ African religions
in scheme: v3

Greyromantic Unitarian Universalists
type: Concept
issued: 2024-06-19
modified: 2025-02-23
comment: Greyromantic people who are members of the Unitarian Universalist church.
alternative label: Unitarian Universalist greyromantic people
broader: LGBTQ+ Unitarian Universalists
change note: Version 4.2.0
has top concept: LGBTQ+ African religions
in scheme: v3

Non-binary Unitarian Universalists
type: Concept
issued: 2024-06-19
modified: 2025-02-23
comment: Non-binary people who are members of the Unitarian Universalist church.
alternative label: Nonbinary Unitarian Universalists
alternative label: Unitarian Universalist non-binary people
alternative label: Unitarian Universalist nonbinary people
broader: LGBTQ+ Unitarian Universalists
change note: Version 4.2.0
has top concept: LGBTQ+ African religions
in scheme: v3

Reproductive health care for non-binary people
type: Concept
issued: 2024-06-19
modified: 2025-02-23
comment: Access to and experiences with reproductive health care for non-binary people. Reproductive health care includes birth control, abortion, assisted reproduction, and prenatal and obstetric care.
alternative label: Non-binary reproductive health care
alternative label: Reproductive health care for nonbinary people
alternative label: Reproductive healthcare for non-binary people
broader: Reproductive health care for LGBTQ+ people
change note: Version 4.2.0
has top concept: Health care for LGBTQ+ people
in scheme: v3

Reproductive health care for transgender people
type: Concept
issued: 2024-06-19
modified: 2025-02-23
comment: Access to and experiences with reproductive health care for transgender people. Reproductive health care includes birth control, abortion, assisted reproduction, and prenatal and obstetric care.
alternative label: Reproductive health care for trans people
alternative label: Reproductive healthcare for transgender people
alternative label: Trans reproductive health care
alternative label: Transgender reproductive health care
broader: Reproductive health care for LGBTQ+ people
change note: Version 4.2.0
has top concept: Health care for LGBTQ+ people
in scheme: v3

Rural lesbians
type: Concept
issued: 2024-07-11
modified: 2025-02-23
comment: Lesbians who are currently living in or consider themselves to be from agricultural or forested areas with low population densities.
broader: Rural LGBTQ+ people
change note: Version 4.2.0
has top concept: LGBTQ+ people
in scheme: v3

Rural gay men
type: Concept
issued: 2024-07-11
modified: 2025-02-23
comment: Gay men who are currently living in or consider themselves to be from agricultural or forested areas with low population densities.
alternative label: Gay rural men
broader: Rural LGBTQ+ people
change note: Version 4.2.0
has top concept: LGBTQ+ people
in scheme: v3

Rural bisexual people
type: Concept
issued: 2024-07-11
modified: 2025-02-23
comment: Bisexual people who are currently living in or consider themselves to be from agricultural or forested areas with low population densities.
alternative label: Bisexual rural people
broader: Rural LGBTQ+ people
change note: Version 4.2.0
has top concept: LGBTQ+ people
in scheme: v3

Rural transgender people
type: Concept
issued: 2024-07-11
modified: 2025-02-23
comment: Transgender people who are currently living in or consider themselves to be from agricultural or forested areas with low population densities.
alternative label: Rural trans people
alternative label: Trans rural people
alternative label: Transgender rural people
broader: Rural LGBTQ+ people
change note: Version 4.2.0
has top concept: LGBTQ+ people
in scheme: v3

Rural queer people
type: Concept
issued: 2024-07-11
modified: 2025-02-23
comment: Queer people who are currently living in or consider themselves to be from agricultural or forested areas with low population densities.
alternative label: Queer rural people
broader: Rural LGBTQ+ people
change note: Version 4.2.0
has top concept: LGBTQ+ people
in scheme: v3

Rural asexual people
type: Concept
issued: 2024-07-11
modified: 2025-02-23
comment: Asexual people who are currently living in or consider themselves to be from agricultural or forested areas with low population densities.
alternative label: Asexual rural people
broader: Rural LGBTQ+ people
change note: Version 4.2.0
has top concept: LGBTQ+ people
in scheme: v3

Rural aromantic people
type: Concept
issued: 2024-07-11
modified: 2025-02-23
comment: Aromantic people who are currently living in or consider themselves to be from agricultural or forested areas with low population densities.
alternative label: Aromantic rural people
broader: Rural LGBTQ+ people
change note: Version 4.2.0
has top concept: LGBTQ+ people
in scheme: v3

Rural intersex people
type: Concept
issued: 2024-07-11
modified: 2025-02-23
comment: Intersex people who are currently living in or consider themselves to be from agricultural or forested areas with low population densities.
alternative label: Intersex rural people
broader: Rural LGBTQ+ people
change note: Version 4.2.0
has top concept: LGBTQ+ people
in scheme: v3

Rural non-binary people
type: Concept
issued: 2024-07-11
modified: 2025-02-23
comment: Non-binary people who are currently living in or consider themselves to be from agricultural or forested areas with low population densities.
alternative label: Non-binary rural people
alternative label: Nonbinary rural people
alternative label: Rural nonbinary people
broader: Rural LGBTQ+ people
change note: Version 4.2.0
has top concept: LGBTQ+ people
in scheme: v3

White non-binary people
type: Concept
issued: 2024-07-11
modified: 2025-02-23
comment: Non-binary people who are white.
alternative label: Non-binary Caucasian people
alternative label: Non-binary Caucasians
alternative label: Non-binary white people
alternative label: Nonbinary Caucasian people
alternative label: Nonbinary Caucasians
alternative label: Nonbinary white people
alternative label: White nonbinary people
broader: White LGBTQ+ people
change note: Version 4.2.0
has top concept: White LGBTQ+ people
in scheme: v3

Arab American lesbians
type: Concept
issued: 2024-07-11
modified: 2025-02-23
comment: Lesbians who are descended from Arab peoples and were born in the United States, or lesbians born in Arab countries who live in or have a strong connection to the United States. Do not conflate with Muslim people.
alternative label: Lesbian Arab American people
alternative label: Lesbian Arab Americans
broader: Arab American LGBTQ+ people
change note: Version 4.2.0
has top concept: LGBTQ+ people
in scheme: v3

Arab American gay men
type: Concept
issued: 2024-07-11
modified: 2025-02-23
comment: Gay men who are descended from Arab peoples and were born in the United States, or gay men born in Arab countries who live in or have a strong connection to the United States. Do not conflate with Muslim people.
alternative label: Gay Arab American men
alternative label: Gay Arab Americans
broader: Arab American LGBTQ+ people
change note: Version 4.2.0
has top concept: LGBTQ+ people
in scheme: v3

Arab American bisexual people
type: Concept
issued: 2024-07-11
modified: 2025-02-23
comment: Bisexual people who are descended from Arab peoples and were born in the United States, or bisexual people born in Arab countries who live in or have a strong connection to the United States. Do not conflate with Muslim people.
alternative label: Bisexual Arab American people
alternative label: Bisexual Arab Americans
broader: Arab American LGBTQ+ people
change note: Version 4.2.0
has top concept: LGBTQ+ people
in scheme: v3

Arab American transgender people
type: Concept
issued: 2024-07-11
modified: 2025-02-23
comment: Transgender people who are descended from Arab peoples and were born in the United States, or transgender people born in Arab countries who live in or have a strong connection to the United States. Do not conflate with Muslim people.
alternative label: Transgender Arab American people
alternative label: Transgender Arab Americans
broader: Arab American LGBTQ+ people
change note: Version 4.2.0
has top concept: LGBTQ+ people
in scheme: v3

Arab American queer people
type: Concept
issued: 2024-07-11
modified: 2025-02-23
comment: Queer people who are descended from Arab peoples and were born in the United States, or Queer people born in Arab countries who live in or have a strong connection to the United States. Do not conflate with Muslim people.
alternative label: Queer Arab American people
alternative label: Queer Arab Americans
broader: Arab American LGBTQ+ people
change note: Version 4.2.0
has top concept: LGBTQ+ people
in scheme: v3

Arab American non-binary people
type: Concept
issued: 2024-07-11
modified: 2025-02-23
comment: Non-binary people who are descended from Arab peoples and were born in the United States, or non-binary people born in Arab countries who live in or have a strong connection to the United States. Do not conflate with Muslim people.
alternative label: Arab American nonbinary people
alternative label: Non-binary Arab American people
alternative label: Non-binary Arab Americans
alternative label: Nonbinary Arab American people
alternative label: Nonbinary Arab Americans
broader: Arab American LGBTQ+ people
change note: Version 4.2.0
has top concept: LGBTQ+ people
in scheme: v3

Arab American asexual people
type: Concept
issued: 2024-07-11
modified: 2025-02-23
comment: Asexual people who are descended from Arab peoples and were born in the United States, or asexual people born in Arab countries who live in or have a strong connection to the United States. Do not conflate with Muslim people.
alternative label: Asexual Arab American people
alternative label: Asexual Arab Americans
broader: Arab American LGBTQ+ people
change note: Version 4.2.0
has top concept: LGBTQ+ people
in scheme: v3

Arab American intersex people
type: Concept
issued: 2024-07-11
modified: 2025-02-23
comment: Intersex people who are descended from Arab peoples and were born in the United States, or intersex people born in Arab countries who live in or have a strong connection to the United States. Do not conflate with Muslim people.
alternative label: Intersex Arab American people
alternative label: Intersex Arab Americans
broader: Arab American LGBTQ+ people
change note: Version 4.2.0
has top concept: LGBTQ+ people
in scheme: v3

Arab American aromantic people
type: Concept
issued: 2024-07-11
modified: 2025-02-23
comment: Aromantic people who are descended from Arab peoples and were born in the United States, or aromantic people born in Arab countries who live in or have a strong connection to the United States. Do not conflate with Muslim people.
alternative label: Aromantic Arab American people
alternative label: Aromantic Arab Americans
broader: Arab American LGBTQ+ people
change note: Version 4.2.0
has top concept: LGBTQ+ people
in scheme: v3

Arab aromantic people
type: Concept
issued: 2024-07-11
modified: 2025-02-23
comment: Aromantic people who are from Arab countries and/or are descended from Arab peoples. Do not conflate with Muslim people.
alternative label: Aromantic Arab people
alternative label: Aromantic Arabs
broader: Arab LGBTQ+ people
change note: Version 4.2.0
has top concept: LGBTQ+ people
in scheme: v3

Aboriginal Australian non-binary people
type: Concept
issued: 2024-07-11
modified: 2025-02-23
comment: Non-binary people who belong to one or more of the various Indigenous peoples of Australia; do not use to refer to the Indigenous people of the Torres Strait Islands, who are considered ethnically and culturally distinct. Only use to describe people who identify as Aboriginal Australian.
alternative label: Non-binary Aboriginal Australian people
alternative label: Non-binary Aboriginal Australians
alternative label: Nonbinary Aboriginal Australian people
alternative label: Nonbinary Aboriginal Australians
broader: Aboriginal Australian LGBTQ+ people
change note: Version 4.2.0
has top concept: LGBTQ+ people
in scheme: v3

Assamese non-binary people
type: Concept
issued: 2024-07-11
modified: 2025-02-23
comment: Non-binary people who are a part of the socio-ethnic Assamese peoples, speak the Assamese language, or reside in the Indian state of Assam.
alternative label: Non-binary Asomiya
alternative label: Non-binary Assamese people
alternative label: Nonbinary Asomiya
alternative label: Nonbinary Assamese people
broader: Assamese LGBTQ+ people
change note: Version 4.2.0
has top concept: LGBTQ+ people
in scheme: v3

Awadhi non-binary people
type: Concept
issued: 2024-07-11
modified: 2025-02-23
comment: Non-binary people who speak the Awadhi dialect and reside in or are descended from those who resided in the Awadh region of Uttar Pradesh.
alternative label: Non-binary Awadhi people
alternative label: Non-binary Awadhis
alternative label: Nonbinary Awadhi people
alternative label: Nonbinary Awadhis
broader: Awadhi LGBTQ+ people
change note: Version 4.2.0
has top concept: LGBTQ+ people
in scheme: v3

Bengali non-binary people
type: Concept
issued: 2024-07-11
modified: 2025-02-23
comment: Non-binary people who speak the Bengali language or are of Bengali descent.
alternative label: Non-binary Bengali people
alternative label: Non-binary Bengalis
alternative label: Nonbinary Bengali people
alternative label: Nonbinary Bengalis
broader: Bengali LGBTQ+ people
change note: Version 4.2.0
has top concept: LGBTQ+ people
in scheme: v3

Bhil non-binary people
type: Concept
issued: 2024-07-11
modified: 2025-02-23
comment: Non-binary people who speak the Bhil language and belong to or are descended from the Bhil tribal group.
alternative label: Bheel non-binary people
alternative label: Bheel nonbinary people
alternative label: Non-binary Bhils
alternative label: Nonbinary Bhils
broader: Bhil LGBTQ+ people
change note: Version 4.2.0
has top concept: LGBTQ+ people
in scheme: v3

Bhojpuri non-binary people
type: Concept
issued: 2024-07-11
modified: 2025-02-23
comment: Non-binary people who speak the Bhojpuri language and live in or are descended from those who inhabited the Bhojpuri-Purvanchal region of India and Nepal.
alternative label: Non-binary Bhojpuri people
alternative label: Non-binary Bhojpuriyas
alternative label: Nonbinary Bhojpuri people
alternative label: Nonbinary Bhojpuriyas
broader: Bhojpuri LGBTQ+ people
change note: Version 4.2.0
has top concept: LGBTQ+ people
in scheme: v3

Biracial non-binary people
type: Concept
issued: 2024-07-11
modified: 2025-02-23
comment: Non-binary people who belong to two or more racial groups. Only use to describe people who self-identify as biracial.
alternative label: Bi-racial non-binary people
alternative label: Bi-racial nonbinary people
alternative label: Non-binary bi-racial people
alternative label: Non-binary biracial people
alternative label: Nonbinary bi-racial people
alternative label: Nonbinary biracial people
broader: Biracial LGBTQ+ people
change note: Version 4.2.0
has top concept: LGBTQ+ people
in scheme: v3

Black non-binary people
type: Concept
issued: 2024-07-11
modified: 2025-02-23
comment: Black people who are non-binary. Use only for individuals who self-identity as Black. Follow the individual’s preference for African American or Black whenever possible.
alternative label: Black nonbinary people
alternative label: Non-binary Black people
alternative label: Nonbinary Black people
broader: Black LGBTQ+ people
change note: Version 4.2.0
has top concept: LGBTQ+ people
in scheme: v3

Chakma non-binary people
type: Concept
issued: 2024-07-11
modified: 2025-02-23
comment: Non-binary people who belong to or are descended from the Chakma tribal group.
alternative label: Chakma nonbinary people
alternative label: Non-binary Chakma people
alternative label: Nonbinary Chakma people
broader: Chakma LGBTQ+ people
change note: Version 4.2.0
has top concept: LGBTQ+ people
in scheme: v3

Chicano/a/x non-binary people
type: Concept
issued: 2024-07-11
modified: 2025-02-23
comment: Non-binary people of Mexican descent born in the United States; only use to describe people who self-identify as Chicano, Chicana, or Chicanx. Do not conflate with Latino/a/x or Hispanic people.
alternative label: Chicana non-binary people
alternative label: Chicano non-binary people
alternative label: Chicanx non-binary people
alternative label: Non-binary Chicanas
alternative label: Non-binary Chicanos
alternative label: Non-binary Chicanx people
alternative label: Nonbinary Chicanas
alternative label: Nonbinary Chicanos
alternative label: Nonbinary Chicanx people
broader: Chicano/a/x LGBTQ+ people
change note: Version 4.2.0
has top concept: LGBTQ+ people
in scheme: v3

Closeted non-binary people
type: Concept
issued: 2024-07-11
modified: 2025-02-23
comment: Non-binary people who do not identify as such to others.
alternative label: Closeted nonbinary people
broader: Closeted LGBTQ+ people
change note: Version 4.2.0
has top concept: LGBTQ+ people
in scheme: v3

Daughters of non-binary people
type: Concept
issued: 2024-07-11
modified: 2025-02-23
comment: Daughters who have one or more non-binary parent.
alternative label: Daughters of nonbinary people
broader: Daughters of LGBTQ+ people
change note: Version 4.2.0
has top concept: Family members
in scheme: v3

Dogra non-binary people
type: Concept
issued: 2024-07-11
modified: 2025-02-23
comment: Non-binary people who are of the Dogra people of India and Pakistan and speak the Dogri language.
alternative label: Dogra nonbinary people
alternative label: Non-binary Dogra people
alternative label: Non-binary Dogras
alternative label: Nonbinary Dogra people
alternative label: Nonbinary Dogras
broader: Dogra LGBTQ+ people
change note: Version 4.2.0
has top concept: LGBTQ+ people
in scheme: v3

Fathers of non-binary people
type: Concept
issued: 2024-07-11
modified: 2025-02-23
comment: People who assume the role of father to non-binary people. Only use to describe individuals who identify as fathers.
alternative label: Fathers of nonbinary people
broader: Fathers of LGBTQ+ people
change note: Version 4.2.0
has top concept: Family members
in scheme: v3

Garhwali non-binary people
type: Concept
issued: 2024-07-11
modified: 2025-02-23
comment: Non-binary people who belong to or are descended from those native to Garhwal in Uttarakhand and who speak Garhwali.
alternative label: Garhwali nonbinary people
alternative label: Non-binary Garhwali people
alternative label: Non-binary Garhwalis
alternative label: Nonbinary Garhwali people
alternative label: Nonbinary Garhwalis
broader: Garhwali LGBTQ+ people
change note: Version 4.2.0
has top concept: LGBTQ+ people
in scheme: v3

Gujarati non-binary people
type: Concept
issued: 2024-07-11
modified: 2025-02-23
comment: Non-binary people who reside in or are descended from those indigenous to the Indian state of Gujarat.
alternative label: Gujarati nonbinary people
alternative label: Non-binary Gujarati people
alternative label: Non-binary Gujaratis
alternative label: Nonbinary Gujarati people
alternative label: Nonbinary Gujaratis
broader: Gujarati LGBTQ+ people
change note: Version 4.2.0
has top concept: LGBTQ+ people
in scheme: v3

Haryanvi non-binary people
type: Concept
issued: 2024-07-11
modified: 2025-02-23
comment: Non-binary people who are indigenous to or descended from those indigenous to what is now the Indian state of Haryana. This term can also apply to those who currently reside in Haryana.
alternative label: Haryanvi nonbinary people
alternative label: Non-binary Haryanvi people
alternative label: Non-binary Haryanvis
alternative label: Nonbinary Haryanvi people
alternative label: Nonbinary Haryanvis
broader: Haryanvi LGBTQ+ people
change note: Version 4.2.0
has top concept: LGBTQ+ people
in scheme: v3

Inuit non-binary people
type: Concept
issued: 2024-07-11
modified: 2025-02-23
comment: Non-binary people who are Inuit, or part of several Indigenous peoples inhabiting the Inuit homeland in the Arctic and subarctic regions of Greenland, Canada, and Alaska. Only use for people who identify as Inuit.
alternative label: Inuit nonbinary people
alternative label: Non-binary Inuit people
alternative label: Non-binary Inuit
alternative label: Nonbinary Inuit people
alternative label: Nonbinary Inuit
broader: Inuit LGBTQ+ people
change note: Version 4.2.0
has top concept: LGBTQ+ people
in scheme: v3

Jewish non-binary people
type: Concept
issued: 2024-07-11
modified: 2025-02-23
comment: Non-binary people who are Jewish.
alternative label: Jewish nonbinary people
alternative label: Non-binary Jewish people
alternative label: Non-binary Jews
alternative label: Nonbinary Jewish people
alternative label: Nonbinary Jews
broader: Jewish LGBTQ+ people
change note: Version 4.2.0
has top concept: LGBTQ+ people
in scheme: v3

Kalash non-binary people
type: Concept
issued: 2024-07-11
modified: 2025-02-23
comment: Non-binary people who belong to the indigenous Kalasha people and reside in the Chitral District of Khyber-Pakhtunkhwa province in Pakistan.
alternative label: Kalash nonbinary people
alternative label: Non-binary Kalash people
alternative label: Non-binary Kalasha
alternative label: Nonbinary Kalash people
alternative label: Nonbinary Kalasha
broader: Kalash LGBTQ+ people
change note: Version 4.2.0
has top concept: LGBTQ+ people
in scheme: v3

Kānaka Maoli non-binary people
type: Concept
issued: 2024-07-11
modified: 2025-02-23
comment: Non-binary people who are part of the Indigenous people of Mokupuni o Hawai‘i, or the Hawaiian Islands; only use to refer to people who identify as Kanaka Maoli.
alternative label: Kanaka Maoli non-binary people
alternative label: Kanaka Maoli nonbinary people
alternative label: Kānaka Maoli nonbinary people
alternative label: Non-binary Kanaka Maoli
alternative label: Non-binary Kānaka Maoli
alternative label: Nonbinary Kanaka Maoli
alternative label: Nonbinary Kānaka Maoli
broader: Kānaka Maoli LGBTQ+ people
change note: Version 4.2.0
has top concept: LGBTQ+ people
in scheme: v3

Kashmiri non-binary people
type: Concept
issued: 2024-07-11
modified: 2025-02-23
comment: Non-binary people who live in or are descended from those native to the Kashmir Valley in the Indian subcontinent.
alternative label: Kashmiri nonbinary people
alternative label: Non-binary Kashmiri people
alternative label: Non-binary Kashmiris
alternative label: Nonbinary Kashmiri people
alternative label: Nonbinary Kashmiris
broader: Kashmiri LGBTQ+ people
change note: Version 4.2.0
has top concept: LGBTQ+ people
in scheme: v3

Kho non-binary people
type: Concept
issued: 2024-07-11
modified: 2025-02-23
comment: Non-binary people who belong to or are descended from the people indigenous to the Chitral and Ghizer districts of modern-day Pakistan.
alternative label: Chitrali non-binary people
alternative label: Chitrali nonbinary people
alternative label: Kho nonbinary people
alternative label: Non-binary Kho people
alternative label: Nonbinary Kho people
broader: Kho LGBTQ+ people
change note: Version 4.2.0
has top concept: LGBTQ+ people
in scheme: v3

Konkan non-binary people
type: Concept
issued: 2024-07-11
modified: 2025-02-23
comment: Non-binary people who are from or descended from those native to the Konkan region of the Indian subcontinent, and who speak any of the dialects of the Konkani language.
alternative label: Konkan nonbinary people
alternative label: Non-binary Konkani people
alternative label: Non-binary Konkani
alternative label: Nonbinary Konkani people
alternative label: Nonbinary Konkani
broader: Konkan LGBTQ+ people
change note: Version 4.2.0
has top concept: LGBTQ+ people
in scheme: v3

Kumaoni non-binary people
type: Concept
issued: 2024-07-11
modified: 2025-02-23
comment: Non-binary people who live mostly in Kumaon region in the Indian Himalayas. They might also speak the Kumaoni language as their first language.
alternative label: Kumain non-binary people
alternative label: Kumain nonbinary people
alternative label: Kumaiye non-binary people
alternative label: Kumaiye nonbinary people
alternative label: Kumaoni nonbinary people
broader: Kumaoni LGBTQ+ people
change note: Version 4.2.0
has top concept: LGBTQ+ people
in scheme: v3

Kutchi non-binary people
type: Concept
issued: 2024-07-11
modified: 2025-02-23
comment: Non-binary people who are from or are descended from those native to the Kutch district of the Indian state of Gujarat and the Sindh region of Pakistan.
alternative label: Kutchi nonbinary people
alternative label: Non-binary Kutchi people
alternative label: Nonbinary Kutchi people
broader: Kutchi LGBTQ+ people
change note: Version 4.2.0
has top concept: LGBTQ+ people
in scheme: v3

Latino/a/x non-binary people
type: Concept
issued: 2024-07-11
modified: 2025-02-23
comment: Latin American people who are non-binary; only use to describe individuals who self-identify as Latino, Latina, or Latinx. Do not conflate with Chicano/a/x or Hispanic.
alternative label: Latina non-binary people
alternative label: Latina nonbinary people
alternative label: Latino non-binary people
alternative label: Latino nonbinary people
alternative label: Latino/a/x nonbinary people
alternative label: Latinx non-binary people
alternative label: Latinx nonbinary people
alternative label: Non-binary Latinas
alternative label: Non-binary Latino/a/x people
alternative label: Non-binary Latinos
alternative label: Non-binary Latinx
alternative label: Nonbinary Latinas
alternative label: Nonbinary Latino/a/x people
alternative label: Nonbinary Latinos
alternative label: Nonbinary Latinx
broader: Latino/a/x LGBTQ+ people
change note: Version 4.2.0
has top concept: LGBTQ+ people
in scheme: v3

Maldivian non-binary people
type: Concept
issued: 2024-07-11
modified: 2025-02-23
comment: Non-binary people who belong to or are descended from the people native to the Maldives (including the island of Minicoy) and speak the Maldivian language.
alternative label: Dhivehin non-binary people
alternative label: Dhivehin nonbinary people
alternative label: Maldivian nonbinary people
alternative label: Non-binary Maldivians
alternative label: Nonbinary Maldivians
broader: Maldivian LGBTQ+ people
change note: Version 4.2.0
has top concept: LGBTQ+ people
in scheme: v3

Multiracial non-binary people
type: Concept
issued: 2024-07-11
modified: 2025-02-23
comment: Non-binary people who belong to two or more racial groups.
alternative label: Non-binary muti-racial people
alternative label: Multi-racial nonbinary people
alternative label: Multiracial nonbinary people
alternative label: Muti-racial non-binary people
alternative label: Non-binary multiracial people
alternative label: Nonbinary multi-racial people
alternative label: Nonbinary multiracial people
broader: Multiracial LGBTQ+ people
change note: Version 4.2.0
has top concept: LGBTQ+ people
in scheme: v3

Native American non-binary people
type: Concept
issued: 2024-07-11
modified: 2025-02-23
comment: People who are part of the Native peoples of the continental United States and Canada (excluding Inuit people) and self-identity as Non-binary. Do not conflate with Two-Spirit people. Use more specific terms when available.
alternative label: American Indian non-binary people
alternative label: American Indian nonbinary people
alternative label: Native American nonbinary people
alternative label: Non-binary American Indians
alternative label: Non-binary Native Americans
alternative label: Nonbinary American Indians
alternative label: Nonbinary Native Americans
broader: Native American LGBTQ+ people
change note: Version 4.2.0
has top concept: LGBTQ+ people
in scheme: v3

Pacific Islander American non-binary people
type: Concept
issued: 2024-07-11
modified: 2025-02-23
comment: Non-binary people who identify as both Pacific Islanders (or of Pacific Islander ancestry) and American.
alternative label: Non-binary Pacific Islander Americans
alternative label: Nonbinary Pacific Islander Americans
alternative label: Pacific Islander American nonbinary people
broader: Pacific Islander American LGBTQ+ people
change note: Version 4.2.0
has top concept: LGBTQ+ people
in scheme: v3

Papuan non-binary people
type: Concept
issued: 2024-07-11
modified: 2025-02-23
comment: Non-binary people who are Papuan, or part of the Indigenous peoples of new Guinea; only use for people who identify as Papuan.
alternative label: Non-binary Papuans
alternative label: Nonbinary Papuans
alternative label: Papuan nonbinary people
broader: Papuan LGBTQ+ people
change note: Version 4.2.0
has top concept: LGBTQ+ people
in scheme: v3

Romani non-binary people
type: Concept
issued: 2024-07-11
modified: 2026-02-23
comment: Non-binary people who are Romani or descend from this traditionally nomadic Indo-European people; only use to refer to people who self-identify as Romani.
alternative label: Non-binary Roma
alternative label: Nonbinary Roma
alternative label: Romani nonbinary people
broader: Romani LGBTQ+ people
change note: Version 4.2.0
has top concept: LGBTQ+ people
in scheme: v3

South Asian non-binary people
type: Concept
issued: 2024-07-11
modified: 2025-02-23
comment: Non-binary people who belong to or are descended from the ethnolinguistic groups of South Asia.
alternative label: Non-binary South Asian people
alternative label: Non-binary South Asians
alternative label: Nonbinary South Asian people
alternative label: Nonbinary South Asians
alternative label: South Asian nonbinary people
broader: South Asian LGBTQ+ people
change note: Version 4.2.0
has top concept: LGBTQ+ people
in scheme: v3

Gay graphic novels
type: Concept
issued: 2024-07-21
modified: 2025-02-23
comment: Works consisting of sequential images often accompanied by text that generally contain stand-alone stories; used in reference to graphic novels focusing on gay male characters or themes.
broader: LGBTQ+ graphic novels
change note: Version 4.2.0
has top concept: Subcultures
in scheme: v3

Lesbian graphic novels
type: Concept
issued: 2024-07-21
modified: 2025-02-23
comment: Works consisting of sequential images often accompanied by text that generally contain stand-alone stories; used in reference to graphic novels focusing on lesbian characters or themes.
broader: LGBTQ+ graphic novels
change note: Version 4.2.0
has top concept: Subcultures
in scheme: v3

Bisexual graphic novels
type: Concept
issued: 2024-07-21
modified: 2025-02-23
comment: Works consisting of sequential images often accompanied by text that generally contain stand-alone stories. Use in reference to graphic novels focusing on bisexual characters or themes.
broader: LGBTQ+ graphic novels
change note: Version 4.2.0
has top concept: Subcultures
in scheme: v3

Megasexual graphic novels
type: Concept
issued: 2024-07-21
modified: 2025-02-23
comment: Works consisting of sequential images often accompanied by text that generally contain stand-alone stories; used in reference to graphic novels focusing on megasexual characters or themes.
broader: LGBTQ+ graphic novels
change note: Version 4.2.0
has top concept: Subcultures
in scheme: v3

Transgender graphic novels
type: Concept
issued: 2024-07-21
modified: 2025-02-23
comment: Works consisting of sequential images often accompanied by text that generally contain stand-alone stories; used in reference to graphic novels focusing on transgender characters or themes.
broader: LGBTQ+ graphic novels
change note: Version 4.2.0
has top concept: Subcultures
in scheme: v3

Queer graphic novels
type: Concept
issued: 2024-07-21
modified: 2025-02-23
comment: Works consisting of sequential images often accompanied by text that generally contain stand-alone stories; used in reference to graphic novels focusing on queer characters or themes.
broader: LGBTQ+ graphic novels
change note: Version 4.2.0
has top concept: Subcultures
in scheme: v3

Child sexual abuse content
type: Concept
issued: 2024-07-21
modified: 2025-02-23
comment: Images and videos that show children and youth who are under the age of consent engaged in sexual activities. While this term is not otherwise within the scope of the Homosaurus vocabulary, it is provided as an alternative to commonly used terms such as "Child pornography" in order to highlight that the production of such materials is a direct product of and contributes to the sexual abuse of children.
alternative label: CSA content
alternative label: CSA materials
alternative label: Child pornography
alternative label: Child sexual abuse materials
broader: Sexual violence
change note: Version 4.2.0
has top concept: Sexual violence
in scheme: v3

Queer painters
type: Concept
issued: 2024-07-31
modified: 2025-02-23
comment: Queer people who paint, either professionally or as a hobby.
broader: LGBTQ+ painters
change note: Version 4.2.0
has top concept: LGBTQ+ people
in scheme: v3

Intersex painters
type: Concept
issued: 2024-07-31
modified: 2025-02-23
comment: Intersex people who paint, either professionally or as a hobby.
broader: LGBTQ+ painters
change note: Version 4.2.0
has top concept: LGBTQ+ people
in scheme: v3

Non-binary painters
type: Concept
issued: 2024-07-31
modified: 2025-02-23
comment: Non-binary people who paint, either professionally or as a hobby.
alternative label: Nonbinary painters
broader: LGBTQ+ painters
change note: Version 4.2.0
has top concept: LGBTQ+ people
in scheme: v3

Aromantic painters
type: Concept
issued: 2024-07-31
modified: 2025-02-23
comment: Aromantic people who paint, either professionally or as a hobby.
broader: LGBTQ+ painters
change note: Version 4.2.0
has top concept: LGBTQ+ people
in scheme: v3

Asexual painters
type: Concept
issued: 2024-07-31
modified: 2025-02-23
comment: Asexual people who paint, either professionally or as a hobby.
broader: LGBTQ+ painters
change note: Version 4.2.0
has top concept: LGBTQ+ people
in scheme: v3

Demisexual painters
type: Concept
issued: 2024-07-31
modified: 2025-02-23
comment: Demisexual people who paint, either professionally or as a hobby.
broader: LGBTQ+ painters
change note: Version 4.2.0
has top concept: LGBTQ+ people
in scheme: v3

Greyromantic painters
type: Concept
issued: 2024-07-31
modified: 2025-02-23
comment: Greyromantic people who paint, either professionally or as a hobby.
broader: LGBTQ+ painters
change note: Version 4.2.0
has top concept: LGBTQ+ people
in scheme: v3

Megasexual painters
type: Concept
issued: 2024-07-31
modified: 2025-02-23
comment: Megasexual people who paint, either professionally or as a hobby.
broader: LGBTQ+ painters
change note: Version 4.2.0
has top concept: LGBTQ+ people
in scheme: v3

Lesbian photographers
type: Concept
issued: 2024-07-31
modified: 2025-02-23
comment: Lesbians who take photographs, either professionally or as a hobby.
broader: LGBTQ+ photographers
change note: Version 4.2.0
has top concept: LGBTQ+ people
in scheme: v3

Gay photographers
type: Concept
issued: 2024-07-31
modified: 2025-02-23
comment: Gay men who take photographs, either professionally or as a hobby.
comment: Hombres gay que son compañeros románticos, sexuales o de juego de otra persona o personas.
broader: LGBTQ+ photographers
change note: Version 4.2.0
has top concept: LGBTQ+ people
in scheme: v3
preferred label: Parejas gay

Bisexual photographers
type: Concept
issued: 2024-07-31
modified: 2025-02-23
comment: Bisexual people who take photographs, either professionally or as a hobby.
broader: LGBTQ+ photographers
change note: Version 4.2.0
has top concept: LGBTQ+ people
in scheme: v3

Transgender photographers
type: Concept
issued: 2024-07-31
modified: 2025-02-23
comment: Trans people who take photographs, either professionally or as a hobby.
alternative label: Trans photographers
broader: LGBTQ+ photographers
change note: Version 4.2.0
has top concept: LGBTQ+ people
in scheme: v3

Queer photographers
type: Concept
issued: 2024-07-31
modified: 2025-02-23
comment: Queer people who take photographs, either professionally or as a hobby.
broader: LGBTQ+ photographers
change note: Version 4.2.0
has top concept: LGBTQ+ people
in scheme: v3

Intersex photographers
type: Concept
issued: 2024-07-31
modified: 2025-02-23
comment: Intersex people who take photographs, either professionally or as a hobby.
broader: LGBTQ+ photographers
change note: Version 4.2.0
has top concept: LGBTQ+ people
in scheme: v3

Non-binary photographers
type: Concept
issued: 2024-07-31
modified: 2025-02-23
comment: Non-binary people who take photographs, either professionally or as a hobby.
alternative label: Nonbinary photographers
broader: LGBTQ+ photographers
change note: Version 4.2.0
has top concept: LGBTQ+ people
in scheme: v3

Aromantic photographers
type: Concept
issued: 2024-07-31
modified: 2025-02-23
comment: Aromantic people who take photographs, either professionally or as a hobby.
broader: LGBTQ+ photographers
change note: Version 4.2.0
has top concept: LGBTQ+ people
in scheme: v3

Asexual photographers
type: Concept
issued: 2024-07-31
modified: 2025-02-23
comment: Asexual people who take photographs, either professionally or as a hobby.
broader: LGBTQ+ photographers
change note: Version 4.2.0
has top concept: LGBTQ+ people
in scheme: v3

Demisexual photographers
type: Concept
issued: 2024-07-31
modified: 2025-02-23
comment: Demisexual people who take photographs, either professionally or as a hobby.
broader: LGBTQ+ photographers
change note: Version 4.2.0
has top concept: LGBTQ+ people
in scheme: v3

Greyromantic photographers
type: Concept
issued: 2024-07-31
modified: 2025-02-23
comment: Greyromantic people who take photographs, either professionally or as a hobby.
broader: LGBTQ+ photographers
change note: Version 4.2.0
has top concept: LGBTQ+ people
in scheme: v3

Megasexual photographers
type: Concept
issued: 2024-07-31
modified: 2025-02-23
comment: Megasexual people who take photographs, either professionally or as a hobby.
broader: LGBTQ+ photographers
change note: Version 4.2.0
has top concept: LGBTQ+ people
in scheme: v3

Gay youth survivors of bullying
type: Concept
issued: 2024-07-31
modified: 2025-02-23
comment: Gay male youth between the ages of 12-18 who have experienced and survived bullying due to their gender or sexual identity. Follow the individual's preference for "victims" or "survivors" whenever possible.
broader: LGBTQ+ youth survivors of bullying
change note: Version 4.2.0
has top concept: Youth
in scheme: v3

Lesbian youth survivors of bullying
type: Concept
issued: 2024-07-31
modified: 2025-02-23
comment: Lesbian youth between the ages of 12-18 who have experienced and survived bullying due to their gender or sexual identity. Follow the individual's preference for "victims" or "survivors" whenever possible.
broader: LGBTQ+ youth survivors of bullying
change note: Version 4.2.0
has top concept: Youth
in scheme: v3

Bisexual youth survivors of bullying
type: Concept
issued: 2024-07-31
modified: 2025-02-23
comment: Bisexual youth between the ages of 12-18 who have experienced and survived bullying due to their gender or sexual identity. Follow the individual's preference for "victims" or "survivors" whenever possible.
broader: LGBTQ+ youth survivors of bullying
change note: Version 4.2.0
has top concept: Youth
in scheme: v3

Queer youth survivors of bullying
type: Concept
issued: 2024-07-31
modified: 2025-02-23
comment: Queer youth between the ages of 12-18 who have experienced and survived bullying due to their gender or sexual identity. Follow the individual's preference for "victims" or "survivors" whenever possible.
broader: LGBTQ+ youth survivors of bullying
change note: Version 4.2.0
has top concept: Youth
in scheme: v3

Intersex youth survivors of bullying
type: Concept
issued: 2024-07-31
modified: 2026-02-27
comment: Intersex youth between the ages of 12-18 who have experienced and survived bullying because they are intersex. Follow the individual's preference for "victims" or "survivors" whenever possible.
broader: LGBTQ+ youth survivors of bullying
change note: Version 4.2.0
has top concept: Youth
in scheme: v3

Non-binary youth survivors of bullying
type: Concept
issued: 2024-07-31
modified: 2025-02-23
comment: Non-binary youth between the ages of 12-18 who have experienced and survived bullying due to their gender or sexual identity. Follow the individual's preference for "victims" or "survivors" whenever possible.
alternative label: Nonbinary youth survivors of bullying
broader: LGBTQ+ youth survivors of bullying
change note: Version 4.2.0
has top concept: Youth
in scheme: v3

Transgender youth survivors of bullying
type: Concept
issued: 2024-07-31
modified: 2025-02-23
comment: Transgender youth between the ages of 12-18 who have experienced and survived bullying due to their gender or sexual identity. Follow the individual's preference for "victims" or "survivors" whenever possible.
broader: LGBTQ+ youth survivors of bullying
change note: Version 4.2.0
has top concept: Youth
in scheme: v3

Asexual youth survivors of bullying
type: Concept
issued: 2024-07-31
modified: 2025-02-23
comment: Asexual youth between the ages of 12-18 who have experienced and survived bullying due to their sexual identity. Follow the individual's preference for "victims" or "survivors" whenever possible.
broader: LGBTQ+ youth survivors of bullying
change note: Version 4.2.0
has top concept: Youth
in scheme: v3

Aromantic youth survivors of bullying
type: Concept
issued: 2024-07-31
modified: 2025-02-23
comment: Aromantic youth between the ages of 12-18 who have experienced and survived bullying due to their sexual identity. Follow the individual's preference for "victims" or "survivors" whenever possible.
broader: LGBTQ+ youth survivors of bullying
change note: Version 4.2.0
has top concept: Youth
in scheme: v3

Greyromantic youth survivors of bullying
type: Concept
issued: 2024-07-31
modified: 2025-02-23
comment: Greyromantic youth between the ages of 12-18 who have experienced and survived bullying due to their gender or sexual identity. Follow the individual's preference for "victims" or "survivors" whenever possible.
broader: LGBTQ+ youth survivors of bullying
change note: Version 4.2.0
has top concept: Youth
in scheme: v3

Gay youth victims of bullying
type: Concept
issued: 2024-07-31
modified: 2025-02-23
comment: Gay male youth between the ages of 12-18 who have experienced bullying due to their gender or sexual identity and may or may not have survived. Follow the individual's preference for "victims" or "survivors" whenever possible.
broader: LGBTQ+ youth victims of bullying
change note: Version 4.2.0
has top concept: Youth
in scheme: v3

Lesbian youth victims of bullying
type: Concept
issued: 2024-07-31
modified: 2025-02-23
comment: Lesbian youth between the ages of 12-18 who have experienced bullying due to their gender or sexual identity and may or may not have survived. Follow the individual's preference for "victims" or "survivors" whenever possible.
broader: LGBTQ+ youth victims of bullying
change note: Version 4.2.0
has top concept: Youth
in scheme: v3

Bisexual youth victims of bullying
type: Concept
issued: 2024-07-31
modified: 2025-02-23
comment: Bisexual youth between the ages of 12-18 who have experienced bullying due to their gender or sexual identity and may or may not have survived. Follow the individual's preference for "victims" or "survivors" whenever possible.
broader: LGBTQ+ youth victims of bullying
change note: Version 4.2.0
has top concept: Youth
in scheme: v3

Queer youth victims of bullying
type: Concept
issued: 2024-07-31
modified: 2025-02-23
comment: Queer youth between the ages of 12-18 who have experienced bullying due to their gender or sexual identity and may or may not have survived. Follow the individual's preference for "victims" or "survivors" whenever possible.
broader: LGBTQ+ youth victims of bullying
change note: Version 4.2.0
has top concept: Youth
in scheme: v3

Intersex youth victims of bullying
type: Concept
issued: 2024-07-31
modified: 2025-02-23
comment: Intersex youth between the ages of 12-18 who have experienced bullying due to their gender or sexual identity and may or may not have survived. Follow the individual's preference for "victims" or "survivors" whenever possible.
broader: LGBTQ+ youth victims of bullying
change note: Version 4.2.0
has top concept: Youth
in scheme: v3

Non-binary youth victims of bullying
type: Concept
issued: 2024-07-31
modified: 2025-02-23
comment: Non-binary youth between the ages of 12-18 who have experienced bullying due to their gender or sexual identity and may or may not have survived. Follow the individual's preference for "victims" or "survivors" whenever possible.
alternative label: Nonbinary youth victims of bullying
broader: LGBTQ+ youth victims of bullying
change note: Version 4.2.0
has top concept: Youth
in scheme: v3

Transgender youth victims of bullying
type: Concept
issued: 2024-07-31
modified: 2025-02-23
comment: Transgender youth between the ages of 12-18 who have experienced bullying due to their gender or sexual identity and may or may not have survived. Follow the individual's preference for "victims" or "survivors" whenever possible.
broader: LGBTQ+ youth victims of bullying
change note: Version 4.2.0
has top concept: Youth
in scheme: v3

Asexual youth victims of bullying
type: Concept
issued: 2024-07-31
modified: 2025-02-23
comment: Asexual youth between the ages of 12-18 who have experienced bullying due to their sexual identity and may or may not have survived. Follow the individual's preference for "victims" or "survivors" whenever possible.
broader: LGBTQ+ youth victims of bullying
change note: Version 4.2.0
has top concept: Youth
in scheme: v3

Aromantic youth victims of bullying
type: Concept
issued: 2024-07-31
modified: 2025-02-23
comment: Aromantic youth between the ages of 12-18 who have experienced bullying due to their sexual identity and may or may not have survived. Follow the individual's preference for "victims" or "survivors" whenever possible.
broader: LGBTQ+ youth victims of bullying
change note: Version 4.2.0
has top concept: Youth
in scheme: v3

Greyromantic youth victims of bullying
type: Concept
issued: 2024-07-31
modified: 2025-02-23
comment: Greyromantic youth between the ages of 12-18 who have experienced bullying due to their gender or sexual identity and may or may not have survived. Follow the individual's preference for "victims" or "survivors" whenever possible.
broader: LGBTQ+ youth victims of bullying
change note: Version 4.2.0
has top concept: Youth
in scheme: v3

Gay children's literature
type: Concept
issued: 2024-07-31
modified: 2025-02-23
comment: Written literary works for an audience of readers up to 12 years of age, also known as kid lit or juvenile literature. Use in reference to children's literature focusing on gay male characters or themes.
alternative label: Gay juvenile literature
alternative label: Gay kid lit
broader: LGBTQ+ children's literature
change note: Version 4.2.0
has top concept: Subcultures
in scheme: v3

Lesbian children's literature
type: Concept
issued: 2024-07-31
modified: 2025-02-23
comment: Written literary works for an audience of readers up to 12 years of age, also known as kid lit or juvenile literature. Use in reference to children's literature focusing on lesbian characters or themes.
alternative label: Lesbian juvenile literature
alternative label: Lesbian kid lit
broader: LGBTQ+ children's literature
change note: Version 4.2.0
has top concept: Subcultures
in scheme: v3

Bisexual children's literature
type: Concept
issued: 2024-07-31
modified: 2025-02-23
comment: Written literary works for an audience of readers up to 12 years of age, also known as kid lit or juvenile literature. Use in reference to children's literature focusing on bisexual characters or themes.
alternative label: Bisexual juvenile literature
alternative label: Bisexual kid lit
broader: LGBTQ+ children's literature
change note: Version 4.2.0
has top concept: Subcultures
in scheme: v3

Transgender children's literature
type: Concept
issued: 2024-07-31
modified: 2025-02-23
comment: Written literary works for an audience of readers up to 12 years of age, also known as kid lit or juvenile literature. Use in reference to children's literature focusing on transgender characters or themes.
alternative label: Trans children's literature
alternative label: Transgender juvenile literature
alternative label: Transgender kid lit
broader: LGBTQ+ children's literature
change note: Version 4.2.0
has top concept: Subcultures
in scheme: v3

Queer children's literature
type: Concept
issued: 2024-07-31
modified: 2025-02-23
comment: Written literary works for an audience of readers up to 12 years of age, also known as kid lit or juvenile literature. Use in reference to children's literature focusing on queer characters or themes.
alternative label: Queer juvenile literature
alternative label: Queer kid lit
broader: LGBTQ+ children's literature
change note: Version 4.2.0
has top concept: Subcultures
in scheme: v3

Non-binary children's literature
type: Concept
issued: 2024-07-31
modified: 2025-02-23
comment: Written literary works for an audience of readers up to 12 years of age, also known as kid lit or juvenile literature. Use in reference to children's literature focusing on non-binary characters or themes.
alternative label: Non-binary juvenile literature
alternative label: Non-binary kit lit
alternative label: Nonbinary children's literature
alternative label: Nonbinary juvenile literature
alternative label: Nonbinary kid lit
broader: LGBTQ+ children's literature
change note: Version 4.2.0
has top concept: Subcultures
in scheme: v3

Asexual children's literature
type: Concept
issued: 2024-07-31
modified: 2025-02-23
comment: Written literary works for an audience of readers up to 12 years of age, also known as kid lit or juvenile literature. Use in reference to children's literature focusing on asexual characters or themes.
alternative label: Asexual juvenile literature
alternative label: Asexual kid lit
broader: LGBTQ+ children's literature
change note: Version 4.2.0
has top concept: Subcultures
in scheme: v3

Aromantic children's literature
type: Concept
issued: 2024-07-31
modified: 2025-02-23
comment: Written literary works for an audience of readers up to 12 years of age, also known as kid lit or juvenile literature. Use in reference to children's literature focusing on aromantic characters or themes.
alternative label: Aromantic juvenile literature
alternative label: Aromantic kid lit
broader: LGBTQ+ children's literature
change note: Version 4.2.0
has top concept: Subcultures
in scheme: v3

Intersex children's literature
type: Concept
issued: 2024-07-31
modified: 2025-02-23
comment: Written literary works for an audience of readers up to 12 years of age, also known as kid lit or juvenile literature. Use in reference to children's literature focusing on intersex characters or themes.
alternative label: Intersex juvenile literature
alternative label: Intersex kid lit
broader: LGBTQ+ children's literature
change note: Version 4.2.0
has top concept: Subcultures
in scheme: v3

Danmei
type: Concept
issued: 2024-07-31
modified: 2025-02-23
comment: A genre focusing on the romantic or sexual relationships between male characters in Chinese novels, comics, movies, animation, and dramas.
alternative label: Dānměi
broader: Boys' Love (Genre)
change note: Version 4.2.0
has top concept: Subcultures
in scheme: v3

Gender conversion therapy
type: Concept
issued: 2024-07-31
modified: 2025-02-23
comment: Efforts to change the gender identity of a transgender or non-binary person to meet cisgender norms, typically under the belief that their identity is dangerous and/or the result of mental illness or trauma. The processes involved in conversion therapy include visualization training, spiritual interventions, and other aversion treatments.
alternative label: Conversion therapy for gender
alternative label: Conversion therapy for trans people
alternative label: Conversion therapy for transgender people
alternative label: Gender reorientation therapy
alternative label: Trans conversion therapy
alternative label: Transgender conversion therapy
broader: Conversion therapy
change note: Version 4.2.0
has top concept: Medical care
in scheme: v3

Gay painters
type: Concept
issued: 2024-07-31
modified: 2025-02-23
comment: Gay men who paint, either professionally or as a hobby.
broader: LGBTQ+ painters
change note: Version 4.2.0
has top concept: LGBTQ+ people
in scheme: v3

Lesbian painters
type: Concept
issued: 2024-07-31
modified: 2025-02-23
comment: Lesbians who paint, either professionally or as a hobby.
broader: LGBTQ+ painters
change note: Version 4.2.0
has top concept: LGBTQ+ people
in scheme: v3

Bisexual painters
type: Concept
issued: 2024-07-31
modified: 2025-02-23
comment: Bisexual people who paint, either professionally or as a hobby.
broader: LGBTQ+ painters
change note: Version 4.2.0
has top concept: LGBTQ+ people
in scheme: v3

Transgender painters
type: Concept
issued: 2024-07-31
modified: 2025-02-23
comment: Trans people who paint, either professionally or as a hobby.
alternative label: Trans painters
broader: LGBTQ+ painters
change note: Version 4.2.0
has top concept: LGBTQ+ people
in scheme: v3

Bisexual political groups
type: Concept
issued: 2024-09-19
modified: 2025-02-23
comment: Organized groups centered on political change and action for bisexual people's rights.
broader: LGBTQ+ political groups
change note: Version 4.2.0
has top concept: LGBTQ+ political groups
in scheme: v3

Queer political groups
type: Concept
issued: 2024-09-19
modified: 2025-02-23
comment: Organized groups centered on political change and action for queer people's rights; may include advocacy and other political efforts for LGBTQ+ people's rights more broadly.
broader: LGBTQ+ political groups
change note: Version 4.2.0
has top concept: LGBTQ+ political groups
in scheme: v3

Megasexual political groups
type: Concept
issued: 2024-09-19
modified: 2025-02-23
comment: Organized groups centered on political change and action for megasexual people's rights.
broader: LGBTQ+ political groups
change note: Version 4.2.0
has top concept: LGBTQ+ political groups
in scheme: v3

Demisexual political groups
type: Concept
issued: 2024-09-19
modified: 2025-02-23
comment: Organized groups centered on political change and action for demisexual people's rights.
broader: LGBTQ+ political groups
change note: Version 4.2.0
has top concept: LGBTQ+ political groups
in scheme: v3

Intersex political groups
type: Concept
issued: 2024-09-19
modified: 2025-02-23
comment: Organized groups centered on political change and action for intersex people's rights.
broader: LGBTQ+ political groups
change note: Version 4.2.0
has top concept: LGBTQ+ political groups
in scheme: v3

Asexual political groups
type: Concept
issued: 2024-09-19
modified: 2025-02-23
comment: Organized groups centered on political change and action for asexual people's rights.
broader: LGBTQ+ political groups
change note: Version 4.2.0
has top concept: LGBTQ+ political groups
in scheme: v3

Non-binary political groups
type: Concept
issued: 2024-09-19
modified: 2025-02-23
comment: Organized groups centered on political change and action for non-binary people's rights.
alternative label: Nonbinary political groups
broader: LGBTQ+ political groups
change note: Version 4.2.0
has top concept: LGBTQ+ political groups
in scheme: v3

Aromantic political groups
type: Concept
issued: 2024-09-19
modified: 2025-02-23
comment: Organized groups centered on political change and action for aromantic people's rights.
broader: LGBTQ+ political groups
change note: Version 4.2.0
has top concept: LGBTQ+ political groups
in scheme: v3

Transgender political groups
type: Concept
issued: 2024-09-19
modified: 2025-02-23
comment: Organized groups centered on political change and action for trans people's rights.
alternative label: Trans political groups
broader: LGBTQ+ political groups
change note: Version 4.2.0
has top concept: LGBTQ+ political groups
in scheme: v3

Greyromantic political groups
type: Concept
issued: 2024-09-19
modified: 2025-02-23
comment: Organized groups centered on political change and action for greyromantic people's rights.
broader: LGBTQ+ political groups
change note: Version 4.2.0
has top concept: LGBTQ+ political groups
in scheme: v3

Aromantic students
type: Concept
issued: 2024-09-19
modified: 2025-02-23
comment: Aromantic people who are formally engaged in learning at an educational institution of some kind.
broader: LGBTQ+ students
change note: Version 4.2.0
has top concept: LGBTQ+ people
in scheme: v3

Asexual students
type: Concept
issued: 2024-09-19
modified: 2025-02-23
comment: Asexual people who are formally engaged in learning at an educational institution of some kind.
broader: LGBTQ+ students
change note: Version 4.2.0
has top concept: LGBTQ+ people
in scheme: v3

Bisexual students
type: Concept
issued: 2024-09-19
modified: 2025-02-23
comment: Bisexual people who are formally engaged in learning at an educational institution of some kind.
broader: LGBTQ+ students
change note: Version 4.2.0
has top concept: LGBTQ+ people
in scheme: v3

Demisexual students
type: Concept
issued: 2024-09-19
modified: 2025-02-23
comment: Demisexual people who are formally engaged in learning at an educational institution of some kind.
broader: LGBTQ+ students
change note: Version 4.2.0
has top concept: LGBTQ+ people
in scheme: v3

Gay students
type: Concept
issued: 2024-09-19
modified: 2025-02-23
comment: Gay men who are formally engaged in learning at an educational institution of some kind.
broader: LGBTQ+ students
change note: Version 4.2.0
has top concept: LGBTQ+ people
in scheme: v3

Intersex students
type: Concept
issued: 2024-09-19
modified: 2025-02-23
comment: Intersex people who are formally engaged in learning at an educational institution of some kind.
broader: LGBTQ+ students
change note: Version 4.2.0
has top concept: LGBTQ+ people
in scheme: v3

Greyromantic students
type: Concept
issued: 2024-09-19
modified: 2025-02-23
comment: Greyromantic people who are formally engaged in learning at an educational institution of some kind.
broader: LGBTQ+ students
change note: Version 4.2.0
has top concept: LGBTQ+ people
in scheme: v3

Lesbian students
type: Concept
issued: 2024-09-19
modified: 2025-02-23
comment: Lesbians who are formally engaged in learning at an educational institution of some kind.
broader: LGBTQ+ students
change note: Version 4.2.0
has top concept: LGBTQ+ people
in scheme: v3

Megasexual students
type: Concept
issued: 2024-09-19
modified: 2025-02-23
comment: Megasexual people who are formally engaged in learning at an educational institution of some kind.
broader: LGBTQ+ students
change note: Version 4.2.0
has top concept: LGBTQ+ people
in scheme: v3

Non-binary students
type: Concept
issued: 2024-09-19
modified: 2025-02-23
comment: Non-binary people who are formally engaged in learning at an educational institution of some kind.
alternative label: Nonbinary students
broader: LGBTQ+ students
change note: Version 4.2.0
has top concept: LGBTQ+ people
in scheme: v3

Queer students
type: Concept
issued: 2024-09-19
modified: 2025-02-23
comment: Queer people who are formally engaged in learning at an educational institution of some kind.
broader: LGBTQ+ students
change note: Version 4.2.0
has top concept: LGBTQ+ people
in scheme: v3

Transgender students
type: Concept
issued: 2024-09-19
modified: 2025-02-23
comment: Transgender people who are formally engaged in learning at an educational institution of some kind.
alternative label: Trans students
broader: LGBTQ+ students
change note: Version 4.2.0
has top concept: LGBTQ+ people
in scheme: v3

Lesbian archivists
type: Concept
issued: 2024-10-22
modified: 2025-02-23
comment: Lesbians who assess, curate, manage, process, preserve, steward, and/or provide access to records and archives of enduring historical value.
broader: LGBTQ+ archivists
change note: Version 4.2.0
has top concept: LGBTQ+ information professionals
in scheme: v3

Gay archivists
type: Concept
issued: 2024-10-22
modified: 2025-02-23
comment: Gay men who assess, curate, manage, process, preserve, steward, and/or provide access to records and archives of enduring historical value.
broader: LGBTQ+ archivists
change note: Version 4.2.0
has top concept: LGBTQ+ information professionals
in scheme: v3

Bisexual archivists
type: Concept
issued: 2024-10-22
modified: 2025-02-23
comment: Bisexual people who assess, curate, manage, process, preserve, steward, and/or provide access to records and archives of enduring historical value.
broader: LGBTQ+ archivists
change note: Version 4.2.0
has top concept: LGBTQ+ information professionals
in scheme: v3

Transgender archivists
type: Concept
issued: 2024-10-22
modified: 2025-02-23
comment: Transgender people who assess, curate, manage, process, preserve, steward, and/or provide access to records and archives of enduring historical value.
alternative label: Trans archivists
broader: LGBTQ+ archivists
change note: Version 4.2.0
has top concept: LGBTQ+ information professionals
in scheme: v3

Queer archivists
type: Concept
issued: 2024-10-22
modified: 2025-02-23
comment: Queer people who assess, curate, manage, process, preserve, steward, and/or provide access to records and archives of enduring historical value.
broader: LGBTQ+ archivists
change note: Version 4.2.0
has top concept: LGBTQ+ information professionals
in scheme: v3

Intersex archivists
type: Concept
issued: 2024-10-22
modified: 2025-02-23
comment: Intersex people who assess, curate, manage, process, preserve, steward, and/or provide access to records and archives of enduring historical value.
broader: LGBTQ+ archivists
change note: Version 4.2.0
has top concept: LGBTQ+ information professionals
in scheme: v3

Asexual archivists
type: Concept
issued: 2024-10-22
modified: 2025-02-23
comment: Asexual people who assess, curate, manage, process, preserve, steward, and/or provide access to records and archives of enduring historical value.
broader: LGBTQ+ archivists
change note: Version 4.2.0
has top concept: LGBTQ+ information professionals
in scheme: v3

Non-binary archivists
type: Concept
issued: 2024-10-22
modified: 2025-02-23
comment: Non-binary people who assess, curate, manage, process, preserve, steward, and/or provide access to records and archives of enduring historical value.
alternative label: Nonbinary archivists
broader: LGBTQ+ archivists
change note: Version 4.2.0
has top concept: LGBTQ+ information professionals
in scheme: v3

Non-binary people of color
type: Concept
issued: 2024-10-22
modified: 2025-02-23
comment: Primarily used in the United States, this term refers to non-binary people who are not white and who identify as people of color.
alternative label: Nonbinary people of color
broader: LGBTQ+ people of color
change note: Version 4.2.0
has top concept: LGBTQ+ people
in scheme: v3
preferred label: Non-binary people of colour

African American non-binary people
type: Concept
issued: 2024-10-22
modified: 2025-02-23
comment: Non-binary people of African descent born in the United States or non-binary people born in African countries who live in or have a strong connection to the United States. Use for individuals who self-identity as African American. Follow the individual’s preference for African American or Black whenever possible.
alternative label: Non-binary African Americans
alternative label: Non-binary African American people
alternative label: African American nonbinary people
alternative label: Nonbinary African American people
alternative label: Nonbinary African Americans
broader: African American LGBTQ+ people
change note: Version 4.2.0
has top concept: LGBTQ+ people
in scheme: v3

Asian non-binary people
type: Concept
issued: 2024-10-22
modified: 2025-02-23
comment: Non-binary people of Asian heritage or descent, living in Asia or part of the Asian diaspora. Only use for people who self-identify as Asian.
alternative label: Non-binary Asians
alternative label: Non-binary Asian people
alternative label: Nonbinary Asians
alternative label: Nonbinary Asian people
alternative label: Asian nonbinary people
broader: Asian LGBTQ+ people
change note: Version 4.2.0
has top concept: LGBTQ+ people
in scheme: v3

Lesbian high school students
type: Concept
issued: 2024-10-22
modified: 2025-02-23
comment: Lesbians who who attend high school, generally consisting of grades 9-12 (sometimes referred to as freshman through senior year) with students between the ages of 14 and 18.
alternative label: Lesbian secondary school students
broader: LGBTQ+ high school students
change note: Version 4.2.0
has top concept: LGBTQ+ people
in scheme: v3

Gay high school students
type: Concept
issued: 2024-10-22
modified: 2025-02-23
comment: Gay people who attend high school, generally consisting of grades 9-12 (sometimes referred to as freshman through senior year) with students between the ages of 14 and 18.
alternative label: Gay secondary school students
broader: LGBTQ+ high school students
change note: Version 4.2.0
has top concept: LGBTQ+ people
in scheme: v3

Bisexual high school students
type: Concept
issued: 2024-10-22
modified: 2025-02-23
comment: Bisexual people who attend high school, generally consisting of grades 9-12 (sometimes referred to as freshman through senior year) with students between the ages of 14 and 18.
alternative label: Bisexual secondary school students
broader: LGBTQ+ high school students
change note: Version 4.2.0
has top concept: LGBTQ+ people
in scheme: v3

Transgender high school students
type: Concept
issued: 2024-10-22
modified: 2025-02-23
comment: Transgender people who attend high school, generally consisting of grades 9-12 (sometimes referred to as freshman through senior year) with students between the ages of 14 and 18.
alternative label: Trans high school students
alternative label: Transgender secondary school students
alternative label: Trans secondary school students
broader: LGBTQ+ high school students
change note: Version 4.2.0
has top concept: LGBTQ+ people
in scheme: v3

Queer high school students
type: Concept
issued: 2024-10-22
modified: 2025-02-23
comment: Queer people who attend high school, generally consisting of grades 9-12 (sometimes referred to as freshman through senior year) with students between the ages of 14 and 18.
alternative label: Queer secondary school students
broader: LGBTQ+ high school students
change note: Version 4.2.0
has top concept: LGBTQ+ people
in scheme: v3

Intersex high school students
type: Concept
issued: 2024-10-22
modified: 2025-02-23
comment: Intersex people who attend high school, generally consisting of grades 9-12 (sometimes referred to as freshman through senior year) with students between the ages of 14 and 18.
alternative label: Intersex secondary school students
broader: LGBTQ+ high school students
change note: Version 4.2.0
has top concept: LGBTQ+ people
in scheme: v3

Asexual high school students
type: Concept
issued: 2024-10-22
modified: 2025-02-23
comment: Asexual people who attend high school, generally consisting of grades 9-12 (sometimes referred to as freshman through senior year) with students between the ages of 14 and 18.
alternative label: Asexual secondary school students
broader: LGBTQ+ high school students
change note: Version 4.2.0
has top concept: LGBTQ+ people
in scheme: v3

Aromantic high school students
type: Concept
issued: 2024-10-22
modified: 2025-02-23
comment: Aromantic people who attend high school, generally consisting of grades 9-12 (sometimes referred to as freshman through senior year) with students between the ages of 14 and 18.
alternative label: Aromantic secondary school students
broader: LGBTQ+ high school students
change note: Version 4.2.0
has top concept: LGBTQ+ people
in scheme: v3

Non-binary high school students
type: Concept
issued: 2024-10-22
modified: 2025-02-23
comment: Non-binary people who attend high school, generally consisting of grades 9-12 (sometimes referred to as freshman through senior year) with students between the ages of 14 and 18.
alternative label: Nonbinary high school students
alternative label: Non-binary secondary school students
alternative label: Nonbinary secondary school students
broader: LGBTQ+ high school students
change note: Version 4.2.0
has top concept: LGBTQ+ people
in scheme: v3

Demisexual high school students
type: Concept
issued: 2024-10-22
modified: 2025-02-23
comment: Demisexual people who attend high school, generally consisting of grades 9-12 (sometimes referred to as freshman through senior year) with students between the ages of 14 and 18.
alternative label: Demisexual secondary school students
broader: LGBTQ+ high school students
change note: Version 4.2.0
has top concept: LGBTQ+ people
in scheme: v3

Greyromantic high school students
type: Concept
issued: 2024-10-22
modified: 2025-02-23
comment: Greyromantic people who attend high school, generally consisting of grades 9-12 (sometimes referred to as freshman through senior year) with students between the ages of 14 and 18.
alternative label: Greyromantic secondary school students
broader: LGBTQ+ high school students
change note: Version 4.2.0
has top concept: LGBTQ+ people
in scheme: v3

Lesbian middle school students
type: Concept
issued: 2024-10-22
modified: 2025-02-23
comment: Lesbians who attend middle school, generally consisting of grades 6 through 8 with students between the ages of 11 and 14.
alternative label: Lesbian junior high school students
broader: LGBTQ+ middle school students
change note: Version 4.2.0
has top concept: LGBTQ+ people
in scheme: v3

Gay middle school students
type: Concept
issued: 2024-10-22
modified: 2025-02-23
comment: Gay people who attend middle school, generally consisting of grades 6 through 8 with students between the ages of 11 and 14.
alternative label: Gay junior high school students
broader: LGBTQ+ middle school students
change note: Version 4.2.0
has top concept: LGBTQ+ people
in scheme: v3

Bisexual middle school students
type: Concept
issued: 2024-10-22
modified: 2025-02-23
comment: Bisexual people who attend middle school, generally consisting of grades 6 through 8 with students between the ages of 11 and 14.
alternative label: Bi middle school students
alternative label: Bisexual junior high school students
broader: LGBTQ+ middle school students
change note: Version 4.2.0
has top concept: LGBTQ+ people
in scheme: v3

Transgender middle school students
type: Concept
issued: 2024-10-22
modified: 2025-02-23
comment: Transgender people who attend middle school, generally consisting of grades 6 through 8 with students between the ages of 11 and 14.
alternative label: Trans middle school students
alternative label: Trans junior high school students
alternative label: Transgender junior high school students
broader: LGBTQ+ middle school students
change note: Version 4.2.0
has top concept: LGBTQ+ people
in scheme: v3

Queer middle school students
type: Concept
issued: 2024-10-22
modified: 2025-02-23
comment: Queer people who attend middle school, generally consisting of grades 6 through 8 with students between the ages of 11 and 14.
alternative label: Queer junior high school students
broader: LGBTQ+ middle school students
change note: Version 4.2.0
has top concept: LGBTQ+ people
in scheme: v3

Intersex middle school students
type: Concept
issued: 2024-10-22
modified: 2025-02-23
comment: Intersex people who attend middle school, generally consisting of grades 6 through 8 with students between the ages of 11 and 14.
alternative label: Intersex junior high school students
broader: LGBTQ+ middle school students
change note: Version 4.2.0
has top concept: LGBTQ+ people
in scheme: v3

Asexual middle school students
type: Concept
issued: 2024-10-22
modified: 2025-02-23
comment: Asexual people who attend middle school, generally consisting of grades 6 through 8 with students between the ages of 11 and 14.
alternative label: Asexual junior high school students
broader: LGBTQ+ middle school students
change note: Version 4.2.0
has top concept: LGBTQ+ people
in scheme: v3

Aromantic middle school students
type: Concept
issued: 2024-10-22
modified: 2025-02-23
comment: Aromantic people who attend middle school, generally consisting of grades 6 through 8 with students between the ages of 11 and 14.
alternative label: Aromantic junior high school students
broader: LGBTQ+ middle school students
change note: Version 4.2.0
has top concept: LGBTQ+ people
in scheme: v3

Non-binary middle school students
type: Concept
issued: 2024-10-22
modified: 2025-02-23
comment: Non-binary people who attend middle school, generally consisting of grades 6 through 8 with students between the ages of 11 and 14.
alternative label: Nonbinary middle school students
alternative label: Non-binary junior high school students
alternative label: Nonbinary junion high school students
broader: LGBTQ+ middle school students
change note: Version 4.2.0
has top concept: LGBTQ+ people
in scheme: v3

Demisexual middle school students
type: Concept
issued: 2024-10-22
modified: 2025-02-23
comment: Demisexual people who attend middle school, generally consisting of grades 6 through 8 with students between the ages of 11 and 14.
alternative label: Demisexual junior high school students
broader: LGBTQ+ middle school students
change note: Version 4.2.0
has top concept: LGBTQ+ people
in scheme: v3

Greyromantic middle school students
type: Concept
issued: 2024-10-22
modified: 2025-02-23
comment: Greyromantic people who attend middle school, generally consisting of grades 6 through 8 with students between the ages of 11 and 14.
broader: LGBTQ+ middle school students
change note: Version 4.2.0
has top concept: LGBTQ+ people
in scheme: v3

Transgender elementary school students
type: Concept
issued: 2024-10-22
modified: 2025-02-23
comment: Transgender people who attend elementary school, generally consisting of grades k through 5 with students between the ages of 4 and 10.
alternative label: Trans elementary school students
alternative label: Transgender primary school students
alternative label: Trans primary school students
broader: LGBTQ+ elementary school students
change note: Version 4.2.0
has top concept: LGBTQ+ people
in scheme: v3

Intersex elementary school students
type: Concept
issued: 2024-10-22
modified: 2025-02-23
comment: Intersex people who attend elementary school, generally consisting of grades k through 5 with students between the ages of 4 and 10.
alternative label: Intersex primary school students
broader: LGBTQ+ elementary school students
change note: Version 4.2.0
has top concept: LGBTQ+ people
in scheme: v3

Non-binary elementary school students
type: Concept
issued: 2024-10-22
modified: 2025-02-23
comment: Non-binary people who attend elementary school, generally consisting of grades k through 5 with students between the ages of 4 and 10.
alternative label: Nonbinary elementary school students
alternative label: Non-binary primary school students
alternative label: Nonbinary primary school students
broader: LGBTQ+ elementary school students
change note: Version 4.2.0
has top concept: LGBTQ+ people
in scheme: v3

Lesbian events
type: Concept
issued: 2024-10-22
modified: 2025-02-23
comment: Organized public or social occasions for lesbians and lesbian communities.
broader: Europride
change note: Version 4.2.0
has top concept: Europride
in scheme: v3

Gay events
type: Concept
issued: 2024-10-22
modified: 2025-02-23
comment: Organized public or social occasions for gay men and gay communities.
broader: Europride
change note: Version 4.2.0
has top concept: Europride
in scheme: v3

Bisexual events
type: Concept
issued: 2024-10-22
modified: 2025-02-23
comment: Organized public or social occasions for bisexual people and communities.
broader: Europride
change note: Version 4.2.0
has top concept: Europride
in scheme: v3

Transgender events
type: Concept
issued: 2024-10-22
modified: 2025-02-23
comment: Organized public or social occasions for trans people and communities.
alternative label: Trans events
broader: Europride
change note: Version 4.2.0
has top concept: Europride
in scheme: v3

Queer events
type: Concept
issued: 2024-10-22
modified: 2025-02-23
comment: Organized public or social occasions for queer people and communities.
broader: Europride
change note: Version 4.2.0
has top concept: Europride
in scheme: v3

Non-binary events
type: Concept
issued: 2024-10-22
modified: 2025-02-23
comment: Organized public or social occasions for non-binary people and communities.
alternative label: Nonbinary events
broader: Europride
change note: Version 4.2.0
has top concept: Europride
in scheme: v3

Intersex events
type: Concept
issued: 2024-10-22
modified: 2025-02-23
comment: Organized public or social occasions for intersex people and communities.
broader: Europride
change note: Version 4.2.0
has top concept: Europride
in scheme: v3

Asexual events
type: Concept
issued: 2024-10-22
modified: 2025-02-23
comment: Organized public or social occasions for asexual people and communities.
broader: Europride
change note: Version 4.2.0
has top concept: Europride
in scheme: v3

Aromantic events
type: Concept
issued: 2024-10-22
modified: 2025-02-23
comment: Organized public or social occasions for aromantic people and communities.
broader: Europride
change note: Version 4.2.0
has top concept: Europride
in scheme: v3

Demisexual events
type: Concept
issued: 2024-10-22
modified: 2025-02-23
comment: Organized public or social occasions for demisexual people and communities.
broader: Europride
change note: Version 4.2.0
has top concept: Europride
in scheme: v3

Greyromantic events
type: Concept
issued: 2024-10-22
modified: 2025-02-23
comment: Organized public or social occasions for greyromantic people and communities.
broader: Europride
change note: Version 4.2.0
has top concept: Europride
in scheme: v3

Megasexual events
type: Concept
issued: 2024-10-22
modified: 2025-02-23
comment: Organized public or social occasions for megasexual people and communities.
broader: Europride
change note: Version 4.2.0
has top concept: Europride
in scheme: v3

LGBTQ+ rap music
type: Concept
issued: 2024-10-22
modified: 2025-02-23
comment: Rap music created by LGBTQ+ artists, for LGBTQ+ audiences, and/or that expresses an LGBTQ+ sensibility.
alternative label: Rap music (LGBTQ)
alternative label: Rap (LGBTQ)
broader: LGBTQ+ music
change note: Version 4.2.0
has top concept: Subcultures
in scheme: v3

LGBTQ+ pop music
type: Concept
issued: 2024-10-22
modified: 2025-02-23
comment: Pop music created by LGBTQ+ artists, for LGBTQ+ audiences, and/or that expresses an LGBTQ+ sensibility.
alternative label: Pop music (LGBTQ)
alternative label: Pop (LGBTQ)
alternative label: LGBTQ+ popular music
alternative label: Popular music (LGBTQ)
broader: LGBTQ+ music
change note: Version 4.2.0
has top concept: Subcultures
in scheme: v3

Queer ecology
type: Concept
issued: 2024-10-22
modified: 2025-02-23
comment: A school of ecology that seeks to understand nature, biology, and sexuality through the framing of queer theory. Queer ecology rejects the presumption of heterosexuality and cisgenderedness as natural, as well as notions of human exceptionalism and anthropocentrism.
alternative label: Queer ecologies
broader: Queer theory
change note: Version 4.2.0
has top concept: Theories
in scheme: v3

Decolonial theory
type: Concept
issued: 2024-10-22
modified: 2025-02-23
comment: A school of thought that rejects Eurocentric knowledge hierarchies and ways of being, including the presumed superiority of white Western culture.
alternative label: Decoloniality
alternative label: Decolonizing theory
alternative label: Postcolonial theory
alternative label: Postcolonialism
broader: Theories
change note: Version 4.2.0
has top concept: Theories
in scheme: v3

Lesbian librarians
type: Concept
issued: 2024-10-22
modified: 2025-02-23
comment: Lesbians, typically with degrees in library science, who work, manage, or assist in a library setting.
broader: LGBTQ+ librarians
change note: Version 4.2.0
has top concept: LGBTQ+ information professionals
in scheme: v3

Gay librarians
type: Concept
issued: 2024-10-22
modified: 2025-02-23
comment: Gay people, typically with degrees in library science, who work, manage, or assist in a library setting.
broader: LGBTQ+ librarians
change note: Version 4.2.0
has top concept: LGBTQ+ information professionals
in scheme: v3

Bisexual librarians
type: Concept
issued: 2024-10-22
modified: 2025-02-23
comment: Bisexual people, typically with degrees in library science, who work, manage, or assist in a library setting.
broader: LGBTQ+ librarians
change note: Version 4.2.0
has top concept: LGBTQ+ information professionals
in scheme: v3

Transgender librarians
type: Concept
issued: 2024-10-22
modified: 2025-02-23
comment: Transgender people, typically with degrees in library science, who work, manage, or assist in a library setting.
alternative label: Trans librarians
broader: LGBTQ+ librarians
change note: Version 4.2.0
has top concept: LGBTQ+ information professionals
in scheme: v3

Queer librarians
type: Concept
issued: 2024-10-22
modified: 2025-02-23
comment: Queer people, typically with degrees in library science, who work, manage, or assist in a library setting.
broader: LGBTQ+ librarians
change note: Version 4.2.0
has top concept: LGBTQ+ information professionals
in scheme: v3

Non-binary librarians
type: Concept
issued: 2024-10-22
modified: 2025-02-23
comment: Non-binary people, typically with degrees in library science, who work, manage, or assist in a library setting.
alternative label: Nonbinary librarians
broader: LGBTQ+ librarians
change note: Version 4.2.0
has top concept: LGBTQ+ information professionals
in scheme: v3

Intersex librarians
type: Concept
issued: 2024-10-22
modified: 2025-02-23
comment: Intersex people, typically with degrees in library science, who work, manage, or assist in a library setting.
broader: LGBTQ+ librarians
change note: Version 4.2.0
has top concept: LGBTQ+ information professionals
in scheme: v3

Asexual librarians
type: Concept
issued: 2024-10-22
modified: 2025-02-23
comment: Asexual people, typically with degrees in library science, who work, manage, or assist in a library setting.
broader: LGBTQ+ librarians
change note: Version 4.2.0
has top concept: LGBTQ+ information professionals
in scheme: v3

Aromantic librarians
type: Concept
issued: 2024-10-22
modified: 2025-02-23
comment: Aromantic people, typically with degrees in library science, who work, manage, or assist in a library setting.
broader: LGBTQ+ librarians
change note: Version 4.2.0
has top concept: LGBTQ+ information professionals
in scheme: v3

Demisexual librarians
type: Concept
issued: 2024-10-22
modified: 2025-02-23
comment: Demisexual people, typically with degrees in library science, who work, manage, or assist in a library setting.
broader: LGBTQ+ librarians
change note: Version 4.2.0
has top concept: LGBTQ+ information professionals
in scheme: v3

Greyromantic librarians
type: Concept
issued: 2024-10-22
modified: 2025-02-23
comment: Greyromantic people, typically with degrees in library science, who work, manage, or assist in a library setting.
broader: LGBTQ+ librarians
change note: Version 4.2.0
has top concept: LGBTQ+ information professionals
in scheme: v3

Megasexual librarians
type: Concept
issued: 2024-10-22
modified: 2025-02-23
comment: Megasexual people, typically with degrees in library science, who work, manage, or assist in a library setting.
broader: LGBTQ+ librarians
change note: Version 4.2.0
has top concept: LGBTQ+ information professionals
in scheme: v3

Aromantic archivists
type: Concept
issued: 2024-10-22
modified: 2025-02-23
comment: Aromantic people who assess, curate, manage, process, preserve, steward, and/or provide access to records and archives of enduring historical value.
broader: LGBTQ+ archivists
change note: Version 4.2.0
has top concept: LGBTQ+ information professionals
in scheme: v3

Demisexual archivists
type: Concept
issued: 2024-10-22
modified: 2025-02-23
comment: Demisexual people who assess, curate, manage, process, preserve, steward, and/or provide access to records and archives of enduring historical value.
broader: LGBTQ+ archivists
change note: Version 4.2.0
has top concept: LGBTQ+ information professionals
in scheme: v3

Greyromantic archivists
type: Concept
issued: 2024-10-22
modified: 2025-02-23
comment: Greyromantic people who assess, curate, manage, process, preserve, steward, and/or provide access to records and archives of enduring historical value.
broader: LGBTQ+ archivists
change note: Version 4.2.0
has top concept: LGBTQ+ information professionals
in scheme: v3

Megasexual archivists
type: Concept
issued: 2024-10-22
modified: 2025-02-23
comment: Megasexual people who assess, curate, manage, process, preserve, steward, and/or provide access to records and archives of enduring historical value.
broader: LGBTQ+ archivists
change note: Version 4.2.0
has top concept: LGBTQ+ information professionals
in scheme: v3

Lesbian scientists
type: Concept
issued: 2024-10-22
modified: 2025-02-23
comment: Lesbians who either study or have expert knowledge in one of the fields of the physical and/or natural sciences, including but not limited to chemists, biologists, physicists, psychologists, and multidisciplinary researchers.
broader: LGBTQ+ scientists
change note: Version 4.2.0
has top concept: LGBTQ+ people
in scheme: v3

Gay scientists
type: Concept
issued: 2024-10-22
modified: 2025-02-23
comment: Gay men who either study or have expert knowledge in one of the fields of the physical and/or natural sciences, including but not limited to chemists, biologists, physicists, psychologists, and multidisciplinary researchers.
broader: LGBTQ+ scientists
change note: Version 4.2.0
has top concept: LGBTQ+ people
in scheme: v3

Bisexual scientists
type: Concept
issued: 2024-10-22
modified: 2025-02-23
comment: Bisexual people who either study or have expert knowledge in one of the fields of the physical and/or natural sciences, including but not limited to chemists, biologists, physicists, psychologists, and multidisciplinary researchers.
broader: LGBTQ+ scientists
change note: Version 4.2.0
has top concept: LGBTQ+ people
in scheme: v3

Transgender scientists
type: Concept
issued: 2024-10-22
modified: 2025-02-23
comment: Transgender people who either study or have expert knowledge in one of the fields of the physical and/or natural sciences, including but not limited to chemists, biologists, physicists, psychologists, and multidisciplinary researchers.
alternative label: Trans scientists
broader: LGBTQ+ scientists
change note: Version 4.2.0
has top concept: LGBTQ+ people
in scheme: v3

Queer scientists
type: Concept
issued: 2024-10-22
modified: 2025-02-23
comment: Queer people who either study or have expert knowledge in one of the fields of the physical and/or natural sciences, including but not limited to chemists, biologists, physicists, psychologists, and multidisciplinary researchers.
broader: LGBTQ+ scientists
change note: Version 4.2.0
has top concept: LGBTQ+ people
in scheme: v3

Intersex scientists
type: Concept
issued: 2024-10-22
modified: 2025-02-23
comment: Intersex people who either study or have expert knowledge in one of the fields of the physical and/or natural sciences, including but not limited to chemists, biologists, physicists, psychologists, and multidisciplinary researchers.
broader: LGBTQ+ scientists
change note: Version 4.2.0
has top concept: LGBTQ+ people
in scheme: v3

Asexual scientists
type: Concept
issued: 2024-10-22
modified: 2025-02-23
comment: Asexual people who either study or have expert knowledge in one of the fields of the physical and/or natural sciences, including but not limited to chemists, biologists, physicists, psychologists, and multidisciplinary researchers.
broader: LGBTQ+ scientists
change note: Version 4.2.0
has top concept: LGBTQ+ people
in scheme: v3

Aromantic scientists
type: Concept
issued: 2024-10-22
modified: 2025-02-23
comment: Aromantic people who either study or have expert knowledge in one of the fields of the physical and/or natural sciences, including but not limited to chemists, biologists, physicists, psychologists, and multidisciplinary researchers.
broader: LGBTQ+ scientists
change note: Version 4.2.0
has top concept: LGBTQ+ people
in scheme: v3

Non-binary scientists
type: Concept
issued: 2024-10-22
modified: 2025-02-23
comment: Non-binary people who either study or have expert knowledge in one of the fields of the physical and/or natural sciences, including but not limited to chemists, biologists, physicists, psychologists, and multidisciplinary researchers.
alternative label: Nonbinary scientists
broader: LGBTQ+ scientists
change note: Version 4.2.0
has top concept: LGBTQ+ people
in scheme: v3

Greyromantic scientists
type: Concept
issued: 2024-10-22
modified: 2025-02-23
comment: Greyromantic people who either study or have expert knowledge in one of the fields of the physical and/or natural sciences, including but not limited to chemists, biologists, physicists, psychologists, and multidisciplinary researchers.
broader: LGBTQ+ scientists
change note: Version 4.2.0
has top concept: LGBTQ+ people
in scheme: v3

Demisexual scientists
type: Concept
issued: 2024-10-22
modified: 2025-02-23
comment: Demisexual people who either study or have expert knowledge in one of the fields of the physical and/or natural sciences, including but not limited to chemists, biologists, physicists, psychologists, and multidisciplinary researchers.
broader: LGBTQ+ scientists
change note: Version 4.2.0
has top concept: LGBTQ+ people
in scheme: v3

Megasexual scientists
type: Concept
issued: 2024-10-22
modified: 2025-02-23
comment: Megasexual people who either study or have expert knowledge in one of the fields of the physical and/or natural sciences, including but not limited to chemists, biologists, physicists, psychologists, and multidisciplinary researchers.
broader: LGBTQ+ scientists
change note: Version 4.2.0
has top concept: LGBTQ+ people
in scheme: v3

Transgender pride
type: Concept
issued: 2024-10-22
modified: 2025-04-17
comment: The recognition and celebration of transgender people and culture, thereby affirming the visibility, dignity, and diversity of transgender communities.
alternative label: Trans pride
broader: LGBTQ+ pride
change note: Version 4.2.0
has top concept: LGBTQ+ pride
in scheme: v3

Intersex-affirming care
type: Concept
issued: 2024-10-22
modified: 2025-02-23
comment: Social, psychological, behavioral, and medical interventions designed to support and affirm individuals belonging to the intersex community. Intersex-affirming care includes but is not limited to equal access to health care facilities, access to medical records and information about one's intersex status and traits, and informed consent regarding medical procedures or treatments related to intersex traits.
alternative label: Intersex affirming care
broader: Gender-affirming care
change note: Version 4.2.0
has top concept: Health care for LGBTQ+ people
in scheme: v3

Transgender-affirming care
type: Concept
issued: 2024-10-22
modified: 2025-02-23
comment: Social, psychological, behavioral, and medical interventions designed to support and affirm a transgender individual's gender identity. Transgender-affirming care includes but is not limited to equal access to health care facilities, counseling, puberty blockers, hormone therapy, and gender-affirming surgeries. It can also include resources to aid in social transition, such as affirming policies regarding name and pronoun changes, access to non-gendered restrooms and facilities, etc.
alternative label: Trans-affirming care
alternative label: Transgender affirming care
alternative label: Trans affirming care
broader: Gender-affirming care
change note: Version 4.2.0
has top concept: Health care for LGBTQ+ people
in scheme: v3

Lesbian poets
type: Concept
issued: 2024-10-22
modified: 2025-02-23
comment: Creators of written or spoken verse who identify as lesbian.
broader: LGBTQ+ poets
change note: Version 4.2.0
has top concept: LGBTQ+ people
in scheme: v3

Gay poets
type: Concept
issued: 2024-10-22
modified: 2025-02-23
comment: Creators of written or spoken verse who identify as gay.
broader: LGBTQ+ poets
change note: Version 4.2.0
has top concept: LGBTQ+ people
in scheme: v3

Bisexual poets
type: Concept
issued: 2024-10-22
modified: 2025-02-23
comment: Creators of written or spoken verse who identify as bisexual.
broader: LGBTQ+ poets
change note: Version 4.2.0
has top concept: LGBTQ+ people
in scheme: v3

Transgender poets
type: Concept
issued: 2024-10-22
modified: 2025-02-23
comment: Creators of written or spoken verse who identify as transgender.
alternative label: Trans poets
broader: LGBTQ+ poets
change note: Version 4.2.0
has top concept: LGBTQ+ people
in scheme: v3

Queer poets
type: Concept
issued: 2024-10-22
modified: 2025-02-23
comment: Creators of written or spoken verse who identify as queer.
broader: LGBTQ+ poets
change note: Version 4.2.0
has top concept: LGBTQ+ people
in scheme: v3

Non-binary poets
type: Concept
issued: 2024-10-22
modified: 2025-02-23
comment: Creators of written or spoken verse who identify as non-binary.
alternative label: Nonbinary poets
broader: LGBTQ+ poets
change note: Version 4.2.0
has top concept: LGBTQ+ people
in scheme: v3

Intersex poets
type: Concept
issued: 2024-10-22
modified: 2025-02-23
comment: Creators of written or spoken verse who identify as intersex.
broader: LGBTQ+ poets
change note: Version 4.2.0
has top concept: LGBTQ+ people
in scheme: v3

Asexual poets
type: Concept
issued: 2024-10-22
modified: 2025-02-23
comment: Creators of written or spoken verse who identify as asexual.
broader: LGBTQ+ poets
change note: Version 4.2.0
has top concept: LGBTQ+ people
in scheme: v3

Aromantic poets
type: Concept
issued: 2024-10-22
modified: 2025-02-23
comment: Creators of written or spoken verse who identify as aromantic.
broader: LGBTQ+ poets
change note: Version 4.2.0
has top concept: LGBTQ+ people
in scheme: v3

Demisexual poets
type: Concept
issued: 2024-10-22
modified: 2025-02-23
comment: Creators of written or spoken verse who identify as demisexual.
broader: LGBTQ+ poets
change note: Version 4.2.0
has top concept: LGBTQ+ people
in scheme: v3

Greyromantic poets
type: Concept
issued: 2024-10-22
modified: 2025-02-23
comment: Creators of written or spoken verse who identify as greyromantic.
broader: LGBTQ+ poets
change note: Version 4.2.0
has top concept: LGBTQ+ people
in scheme: v3

Megasexual poets
type: Concept
issued: 2024-10-22
modified: 2025-02-23
comment: Creators of written or spoken verse who identify as megasexual.
broader: LGBTQ+ poets
change note: Version 4.2.0
has top concept: LGBTQ+ people
in scheme: v3

Lesbian television personalities
type: Concept
issued: 2024-10-22
modified: 2025-02-23
comment: Lesbians who are well-known to the public through their appearances on television shows, typically as themselves rather than in scripted roles.
alternative label: Lesbian TV personalities
broader: LGBTQ+ television personalities
change note: Version 4.2.0
has top concept: LGBTQ+ people
in scheme: v3

Gay television personalities
type: Concept
issued: 2024-10-22
modified: 2025-02-23
comment: Gay men who are well-known to the public through their appearances on television shows, typically as themselves rather than in scripted roles.
alternative label: Gay TV personalities
broader: LGBTQ+ television personalities
change note: Version 4.2.0
has top concept: LGBTQ+ people
in scheme: v3

Bisexual television personalities
type: Concept
issued: 2024-10-22
modified: 2025-02-23
comment: Bisexual people who are well-known to the public through their appearances on television shows, typically as themselves rather than in scripted roles.
alternative label: Bisexual TV personalities
broader: LGBTQ+ television personalities
change note: Version 4.2.0
has top concept: LGBTQ+ people
in scheme: v3

Transgender television personalities
type: Concept
issued: 2024-10-22
modified: 2025-02-23
comment: Transgender people who are well-known to the public through their appearances on television shows, typically as themselves rather than in scripted roles.
alternative label: Trans television personalities
alternative label: Transgender TV personalities
alternative label: Trans TV personalities
broader: LGBTQ+ television personalities
change note: Version 4.2.0
has top concept: LGBTQ+ people
in scheme: v3

Queer television personalities
type: Concept
issued: 2024-10-22
modified: 2025-02-23
comment: Queer people who are well-known to the public through their appearances on television shows, typically as themselves rather than in scripted roles.
alternative label: Queer TV personalities
broader: LGBTQ+ television personalities
change note: Version 4.2.0
has top concept: LGBTQ+ people
in scheme: v3

Intersex television personalities
type: Concept
issued: 2024-10-22
modified: 2025-02-23
comment: Intersex people who are well-known to the public through their appearances on television shows, typically as themselves rather than in scripted roles.
alternative label: Intersex TV personalities
broader: LGBTQ+ television personalities
change note: Version 4.2.0
has top concept: LGBTQ+ people
in scheme: v3

Asexual television personalities
type: Concept
issued: 2024-10-22
modified: 2025-02-23
comment: Asexual people who are well-known to the public through their appearances on television shows, typically as themselves rather than in scripted roles.
alternative label: Asexual TV personalities
broader: LGBTQ+ television personalities
change note: Version 4.2.0
has top concept: LGBTQ+ people
in scheme: v3

Aromantic television personalities
type: Concept
issued: 2024-10-22
modified: 2025-02-23
comment: Aromantic people who are well-known to the public through their appearances on television shows, typically as themselves rather than in scripted roles.
alternative label: Aromantic TV personalities
broader: LGBTQ+ television personalities
change note: Version 4.2.0
has top concept: LGBTQ+ people
in scheme: v3

Non-binary television personalities
type: Concept
issued: 2024-10-22
modified: 2025-02-23
comment: Non-binary people who are well-known to the public through their appearances on television shows, typically as themselves rather than in scripted roles.
alternative label: Nonbinary television personalities
alternative label: Non-binary TV personalities
alternative label: Nonbinary TV personalities
broader: LGBTQ+ television personalities
change note: Version 4.2.0
has top concept: LGBTQ+ people
in scheme: v3

Demisexual television personalities
type: Concept
issued: 2024-10-22
modified: 2025-02-23
comment: Demisexual people who are well-known to the public through their appearances on television shows, typically as themselves rather than in scripted roles.
alternative label: Demisexual TV personalities
broader: LGBTQ+ television personalities
change note: Version 4.2.0
has top concept: LGBTQ+ people
in scheme: v3

Greyromantic television personalities
type: Concept
issued: 2024-10-22
modified: 2025-02-23
comment: Greyromantic people who are well-known to the public through their appearances on television shows, typically as themselves rather than in scripted roles.
alternative label: Greyromantic TV personalities
broader: LGBTQ+ television personalities
change note: Version 4.2.0
has top concept: LGBTQ+ people
in scheme: v3

Megasexual television personalities
type: Concept
issued: 2024-10-22
modified: 2025-02-23
comment: Megasexual people who are well-known to the public through their appearances on television shows, typically as themselves rather than in scripted roles.
alternative label: Megasexual TV personalities
broader: LGBTQ+ television personalities
change note: Version 4.2.0
has top concept: LGBTQ+ people
in scheme: v3

Lesbian film criticism
type: Concept
issued: 2024-10-23
modified: 2025-02-23
comment: The analysis and evaluation of lesbian films and film history, or film criticism from a lesbian perspective.
alternative label: Lesbian film critique
alternative label: Lesbian film analysis
broader: LGBTQ+ film criticism
change note: Version 4.2.0
has top concept: Subcultures
in scheme: v3

Gay film criticism
type: Concept
issued: 2024-10-23
modified: 2025-02-23
comment: The analysis and evaluation of gay films and film history, or film criticism from a gay perspective.
alternative label: Gay film critique
alternative label: Gay film analysis
broader: LGBTQ+ film criticism
change note: Version 4.2.0
has top concept: Subcultures
in scheme: v3

Bisexual film criticism
type: Concept
issued: 2024-10-23
modified: 2025-02-23
comment: The analysis and evaluation of bisexual films and film history, or film criticism from a bisexual perspective.
alternative label: Bisexual film critique
alternative label: Bisexual film analysis
broader: LGBTQ+ film criticism
change note: Version 4.2.0
has top concept: Subcultures
in scheme: v3

Transgender film criticism
type: Concept
issued: 2024-10-23
modified: 2025-02-23
comment: The analysis and evaluation of trans films and film history, or film criticism from a trans perspective.
alternative label: Transgender film critique
alternative label: Transgender film analysis
alternative label: Trans film criticism
alternative label: Trans film critique
alternative label: Trans film analysis
broader: LGBTQ+ film criticism
change note: Version 4.2.0
has top concept: Subcultures
in scheme: v3

Queer film criticism
type: Concept
issued: 2024-10-23
modified: 2025-02-23
comment: The analysis and evaluation of queer films and film history, or film criticism from a queer perspective.
alternative label: Queer film critique
alternative label: Queer film analysis
broader: LGBTQ+ film criticism
change note: Version 4.2.0
has top concept: Subcultures
in scheme: v3

Decolonial queer theory
type: Concept
issued: 2024-10-23
modified: 2025-02-23
comment: The intersection of decolonial and queer theory, which critiques Eurocentric conceptions of gender and sexuality as a tool of colonization.
alternative label: Queer decoloniality
alternative label: Postcolonial queer theory
alternative label: Queer decolonial theory
alternative label: Queer postcolonial theory
broader: Queer theory
change note: Version 4.2.0
has top concept: Theories
in scheme: v3

Lesbian film festivals
type: Concept
issued: 2024-10-23
modified: 2025-02-23
comment: Organized presentations of films in a single location, often with prizes awarded in various categories. Use in reference to film festivals focusing on films created by lesbians or featuring lesbian characters and themes.
broader: LGBTQ+ film festivals
change note: Version 4.2.0
has top concept: LGBTQ+ film festivals
in scheme: v3

Gay film festivals
type: Concept
issued: 2024-10-23
modified: 2025-02-23
comment: Organized presentations of films in a single location, often with prizes awarded in various categories. Use in reference to film festivals focusing on films created by gay men or featuring gay characters and themes.
broader: LGBTQ+ film festivals
change note: Version 4.2.0
has top concept: LGBTQ+ film festivals
in scheme: v3

Bisexual film festivals
type: Concept
issued: 2024-10-23
modified: 2025-02-23
comment: Organized presentations of films in a single location, often with prizes awarded in various categories. Use in reference to film festivals focusing on films created by bisexual people or featuring bisexual characters and themes.
broader: LGBTQ+ film festivals
change note: Version 4.2.0
has top concept: LGBTQ+ film festivals
in scheme: v3

Transgender film festivals
type: Concept
issued: 2024-10-23
modified: 2025-02-23
comment: Organized presentations of films in a single location, often with prizes awarded in various categories. Use in reference to film festivals focusing on films created by trans people or featuring trans characters and themes.
alternative label: Trans film festivals
broader: LGBTQ+ film festivals
change note: Version 4.2.0
has top concept: LGBTQ+ film festivals
in scheme: v3

Queer film festivals
type: Concept
issued: 2024-10-23
modified: 2025-02-23
comment: Organized presentations of films in a single location, often with prizes awarded in various categories. Use in reference to film festivals focusing on films created by queer people or featuring queer characters and themes.
broader: LGBTQ+ film festivals
change note: Version 4.2.0
has top concept: LGBTQ+ film festivals
in scheme: v3

Non-binary film festivals
type: Concept
issued: 2024-10-23
modified: 2025-02-23
comment: Organized presentations of films in a single location, often with prizes awarded in various categories. Use in reference to film festivals focusing on films created by non-binary people or featuring non-binary characters and themes.
alternative label: Nonbinary film festivals
broader: LGBTQ+ film festivals
change note: Version 4.2.0
has top concept: LGBTQ+ film festivals
in scheme: v3

Intersex film festivals
type: Concept
issued: 2024-10-23
modified: 2025-02-23
comment: Organized presentations of films in a single location, often with prizes awarded in various categories. Use in reference to film festivals focusing on films created by intersex people or featuring intersex characters and themes.
broader: LGBTQ+ film festivals
change note: Version 4.2.0
has top concept: LGBTQ+ film festivals
in scheme: v3

Lesbian documentaries
type: Concept
issued: 2024-10-23
modified: 2025-02-23
comment: Non-fictional films that center lesbians or lesbian topics, created for the purposes of education, advocacy, or personal expression.
alternative label: Lesbian documentary films
broader: LGBTQ+ documentaries
change note: Version 4.2.0
has top concept: Subcultures
in scheme: v3

Gay documentaries
type: Concept
issued: 2024-10-23
modified: 2025-02-23
comment: Non-fictional films that center LGBTQ+ gay men or topics, created for the purposes of education, advocacy, or personal expression.
alternative label: Gay documentary films
broader: LGBTQ+ documentaries
change note: Version 4.2.0
has top concept: Subcultures
in scheme: v3

Bisexual documentaries
type: Concept
issued: 2024-10-23
modified: 2025-02-23
comment: Non-fictional films that center bisexual people or topics, created for the purposes of education, advocacy, or personal expression.
alternative label: Bisexual documentary films
broader: LGBTQ+ documentaries
change note: Version 4.2.0
has top concept: Subcultures
in scheme: v3

Transgender documentaries
type: Concept
issued: 2024-10-23
modified: 2025-02-23
comment: Non-fictional films that center trans people or topics, created for the purposes of education, advocacy, or personal expression.
alternative label: Transgender documentary films
alternative label: Trans documentaries
alternative label: Trans documentary films
broader: LGBTQ+ documentaries
change note: Version 4.2.0
has top concept: Subcultures
in scheme: v3

Queer documentaries
type: Concept
issued: 2024-10-23
modified: 2025-02-23
comment: Non-fictional films that center queer people or topics, created for the purposes of education, advocacy, or personal expression.
alternative label: Queer documentary films
broader: LGBTQ+ documentaries
change note: Version 4.2.0
has top concept: Subcultures
in scheme: v3

Non-binary documentaries
type: Concept
issued: 2024-10-23
modified: 2025-02-23
comment: Non-fictional films that center non-binary people or topics, created for the purposes of education, advocacy, or personal expression.
alternative label: Non-binary documentary films
alternative label: Nonbinary documentaries
alternative label: Nonbinary documentary films
broader: LGBTQ+ documentaries
change note: Version 4.2.0
has top concept: Subcultures
in scheme: v3

Intersex documentaries
type: Concept
issued: 2024-10-23
modified: 2025-02-23
comment: Non-fictional films that center intersex people or topics, created for the purposes of education, advocacy, or personal expression.
alternative label: Intersex documentary films
broader: LGBTQ+ documentaries
change note: Version 4.2.0
has top concept: Subcultures
in scheme: v3

Asexual documentaries
type: Concept
issued: 2024-10-23
modified: 2025-02-23
comment: Non-fictional films that center asexual people or topics, created for the purposes of education, advocacy, or personal expression.
alternative label: Asexual documentary films
broader: LGBTQ+ documentaries
change note: Version 4.2.0
has top concept: Subcultures
in scheme: v3

Aromantic documentaries
type: Concept
issued: 2024-10-23
modified: 2025-02-23
comment: Non-fictional films that center aromantic people or topics, created for the purposes of education, advocacy, or personal expression.
alternative label: Aromantic documentary films
broader: LGBTQ+ documentaries
change note: Version 4.2.0
has top concept: Subcultures
in scheme: v3

Demisexual documentaries
type: Concept
issued: 2024-10-23
modified: 2025-02-23
comment: Non-fictional films that center demisexual people or topics, created for the purposes of education, advocacy, or personal expression.
alternative label: Demisexual documentary films
broader: LGBTQ+ documentaries
change note: Version 4.2.0
has top concept: Subcultures
in scheme: v3

Greyromantic documentaries
type: Concept
issued: 2024-10-23
modified: 2025-02-23
comment: Non-fictional films that center greyromantic people or topics, created for the purposes of education, advocacy, or personal expression.
alternative label: Greyromantic documentary films
broader: LGBTQ+ documentaries
change note: Version 4.2.0
has top concept: Subcultures
in scheme: v3

Megasexual documentaries
type: Concept
issued: 2024-10-23
modified: 2025-02-23
comment: Non-fictional films that center megasexual people or topics, created for the purposes of education, advocacy, or personal expression.
alternative label: Megasexual documentary films
broader: LGBTQ+ documentaries
change note: Version 4.2.0
has top concept: Subcultures
in scheme: v3

LGBTQ+ street fairs
type: Concept
issued: 2024-10-23
modified: 2025-02-23
comment: Festivals held on public streets that celebrate the character of the surrounding neighborhood or community. Use to refer to street fairs specifically celebrating the local LGBTQ+ community.
alternative label: Street fairs (LGBTQ)
alternative label: LGBTQ+ street festivals
alternative label: Street festivals (LGBTQ)
alternative label: LGBTQ+ block parties
alternative label: Block parties (LGBTQ)
broader: Europride
change note: Version 4.2.0
has top concept: Europride
in scheme: v3

LGBTQ+ conferences
type: Concept
issued: 2024-10-23
modified: 2025-02-23
comment: Large formal meetings or assemblies of LGBTQ+ people.
alternative label: Conferences (LGBTQ)
alternative label: LGBTQ+ conventions
alternative label: Conventions (LGBTQ)
broader: Europride
change note: Version 4.2.0
has top concept: Europride
in scheme: v3

Uranic people
type: Concept
issued: 2024-10-23
modified: 2025-02-23
comment: People who are attracted to all genders except women, femmes, and feminine-aligned non-binary people, regardless of what gender they were assigned at birth.
alternative label: Androsexual people
broader: LGBTQ+ people
change note: Version 4.2.0
has top concept: LGBTQ+ people
in scheme: v3

Neptunic people
type: Concept
issued: 2024-10-23
modified: 2025-02-23
comment: People who are attracted to all genders except men, mascs, and masculine-aligned non-binary people, regardless of what gender they were assigned at birth.
alternative label: Gynesexual people
alternative label: Gynosexual people
broader: LGBTQ+ people
change note: Version 4.2.0
has top concept: LGBTQ+ people
in scheme: v3

Saturnic people
type: Concept
issued: 2024-10-23
modified: 2025-02-23
comment: People who are solely attracted to androgynous non-binary people, rather than monogender-aligned people, regardless of what gender they were assigned at birth.
alternative label: Skoliosexual people
broader: LGBTQ+ people
change note: Version 4.2.0
has top concept: LGBTQ+ people
in scheme: v3

Labor trafficking
type: Concept
issued: 2024-10-30
modified: 2025-02-23
comment: Human trafficking for the purpose of labor exploitation, including recruiting, holding, moving, defrauding, and/or coercing people into labor, such as through debt bondage or involuntary servitude, against their will.
alternative label: Forced labor
alternative label: Coerced labor
broader: Human trafficking
change note: Version 4.2.0
has top concept: Human trafficking
in scheme: v3
preferred label: Labour trafficking

Intersex sex workers
type: Concept
issued: 2024-10-30
modified: 2025-02-23
comment: Intersex people who receive money or goods in exchange for sexual services, performances, or companionship. Use to describe intersex people working across the broad spectrum of sex work.
alternative label: Intersex prostitutes
alternative label: Intersex prostitution
broader: LGBTQ+ sex workers
change note: Version 4.2.0
has top concept: Sex workers
in scheme: v3

Non-binary sex workers
type: Concept
issued: 2024-10-30
modified: 2025-02-23
comment: Non-binary people who receive money or goods in exchange for sexual services, performances, or companionship. Use to describe non-binary people working across the broad spectrum of sex work.
alternative label: Nonbinary sex workers
alternative label: Non-binary prostitutes
alternative label: Nonbinary prostitutes
alternative label: Non-binary prostitution
alternative label: Nonbinary prostitution
broader: LGBTQ+ sex workers
change note: Version 4.2.0
has top concept: Sex workers
in scheme: v3

Anti-pornography feminism
type: Concept
issued: 2024-10-30
modified: 2025-02-23
comment: A form of feminism that alleges that pornography is a result and reinforcement of the patriarchy and is thus inherently violent and exploitative.
alternative label: Anti-porn feminism
alternative label: Anti pornography feminism
alternative label: Anti porn feminism
broader: Feminism
change note: Version 4.2.0
has top concept: Feminism
in scheme: v3

Camboys
type: Concept
issued: 2024-10-30
modified: 2025-02-23
comment: Short for "webcam boys," this term refers to men sex workers who exchange sexual services, performances, or companionship via online video calls and livestreams. Use only for individuals who self-identify as camboys; otherwise, use "Cam models."
alternative label: Cam boys
alternative label: Webcam boys
broader: Cam models
change note: Version 4.2.0
has top concept: Sex workers
in scheme: v3

Camgirls
type: Concept
issued: 2024-10-30
modified: 2025-02-23
comment: Short for "webcam girls," this term refers to women sex workers who exchange sexual services, performances, or companionship via online video calls and livestreams. Use only for individuals who self-identify as camgirls; otherwise, use "Cam models."
alternative label: Cam girls
alternative label: Webcam girls
broader: Cam models
change note: Version 4.2.0
has top concept: Sex workers
in scheme: v3

Street sex work
type: Concept
issued: 2024-10-30
modified: 2025-02-23
comment: Sex work that is generally solicited in a public place such as a street, street corner, or park.
alternative label: Street prostitution
broader: Sex work
change note: Version 4.2.0
has top concept: Sex industry
in scheme: v3

Survival sex work
type: Concept
issued: 2024-10-30
modified: 2025-02-23
comment: A form of sex work performed in lieu of other employment or in order to meet immediate needs, such as shelter, food, clothing, familial care, etc. Use only for sex work that is self-described as survival.
alternative label: Survival prostitution
broader: Sex work
change note: Version 4.2.0
has top concept: Sex industry
in scheme: v3

Madams (Sex work)
type: Concept
issued: 2024-10-30
modified: 2025-02-23
comment: People who mediate between sex workers and clients. This term has historically been used to describe women but can be used for individuals of any gender based on their preference. Follow the individual's preference for "Madams," "Pimps," or "Sex work concierges" whenever possible.
alternative label: Procuresses
broader: Third parties (Sex work)
change note: Version 4.2.0
has top concept: Third parties (Sex work)
in scheme: v3

Pimps
type: Concept
issued: 2024-10-30
modified: 2025-02-23
comment: People who mediate between sex workers and clients. Since the 20th century, this term has been used as a derogatory way of describing urban, working-class Black American men, regardless of their involvement in the facilitation of sex work. While some Black Americans--including women--have embraced an evolved version of the word "pimp," often stripped of its association with sex work facilitation, it still carries racist and classist connotations and should be used with caution. Follow the individual's preference for "Pimps," "Madams," or "Sex work concierges" whenever possible.
alternative label: Procurers
broader: Third parties (Sex work)
change note: Version 4.2.0
has top concept: Third parties (Sex work)
in scheme: v3

Sex work concierges
type: Concept
issued: 2024-10-30
modified: 2025-02-23
comment: People who mediate between sex workers and clients. Follow the individual's preference for "Sex work concierges," "Pimps," or "Madams" whenever possible.
broader: Third parties (Sex work)
change note: Version 4.2.0
has top concept: Third parties (Sex work)
in scheme: v3

LGBTQ+ strippers
type: Concept
issued: 2024-10-30
modified: 2025-02-23
comment: LGBTQ+ sex workers who undress to music while using a pole to perform dance moves, whether in a venue like a strip club or by hire at private parties. For stripping performed by amateurs in private settings, use "Stripping."
alternative label: Strippers (LGBTQ)
alternative label: LGBTQ+ stripteasers
alternative label: Stripteasers (LGBTQ)
alternative label: LGBTQ+ pole dancers
alternative label: Pole dancers (LGBTQ)
alternative label: LGBTQ+ peelers
alternative label: Peelers (LGBTQ)
alternative label: LGBTQ+ exotic dancers
alternative label: Exotic dancers (LGBTQ)
broader: LGBTQ+ sex workers
change note: Version 4.2.0
has top concept: Sex workers
in scheme: v3

Sex drive-ins
type: Concept
issued: 2024-10-30
modified: 2025-02-23
comment: Partitioned car garages found in a few countries in Europe that are designed to allow and facilitate sex work in cars. Sex drive-ins are often created by local authorities to help regulate where sex work occurs.
alternative label: Sex boxes
broader: Red light districts
change note: Version 4.2.0
has top concept: Sex industry
in scheme: v3

Lesbian pornography
type: Concept
issued: 2024-10-30
modified: 2025-02-23
comment: Printed or visual materials that explicitly depict sexual acts. Use in reference to pornography featuring lesbian performers and/or made for lesbians.
broader: LGBTQ+ pornography
change note: Version 4.2.0
has top concept: Sex industry
in scheme: v3

Gay pornography
type: Concept
issued: 2024-10-30
modified: 2025-02-23
comment: Printed or visual materials that explicitly depict sexual acts. Use in reference to pornography featuring gay performers and/or made for gay men.
broader: LGBTQ+ pornography
change note: Version 4.2.0
has top concept: Sex industry
in scheme: v3

Bisexual pornography
type: Concept
issued: 2024-10-30
modified: 2025-02-23
comment: Printed or visual materials that explicitly depict sexual acts. Use in reference to pornography featuring bisexual performers and/or made for bisexual people.
broader: LGBTQ+ pornography
change note: Version 4.2.0
has top concept: Sex industry
in scheme: v3

Transgender pornography
type: Concept
issued: 2024-10-30
modified: 2025-02-23
comment: Printed or visual materials that explicitly depict sexual acts. Use in reference to pornography featuring transgender performers and/or made for transgender people.
alternative label: Trans pornography
broader: LGBTQ+ pornography
change note: Version 4.2.0
has top concept: Sex industry
in scheme: v3

Queer pornography
type: Concept
issued: 2024-10-30
modified: 2025-02-23
comment: Printed or visual materials that explicitly depict sexual acts. Use in reference to pornography featuring queer performers and/or made for queer people.
broader: LGBTQ+ pornography
change note: Version 4.2.0
has top concept: Sex industry
in scheme: v3

Intersex pornography
type: Concept
issued: 2024-10-30
modified: 2025-02-23
comment: Printed or visual materials that explicitly depict sexual acts. Use in reference to pornography featuring intersex performers and/or made for intersex people.
broader: LGBTQ+ pornography
change note: Version 4.2.0
has top concept: Sex industry
in scheme: v3

Non-binary pornography
type: Concept
issued: 2024-10-30
modified: 2025-02-23
comment: Printed or visual materials that explicitly depict sexual acts. Use in reference to pornography featuring non-binary performers and/or made for non-binary people.
alternative label: Nonbinary pornography
broader: LGBTQ+ pornography
change note: Version 4.2.0
has top concept: Sex industry
in scheme: v3

Hispanic non-binary people
type: Concept
issued: 2024-11-27
modified: 2025-02-23
comment: Non-binary people who are from or descended from Spain or other regions formerly colonized by Spain that are primarily Spanish-speaking. Only use for individuals who self-identify as Hispanic; do not conflate with Latino/a/x or Chicano/a/x.
alternative label: Hispanic nonbinary people
alternative label: Non-binary Hispanic people
alternative label: Nonbinary Hispanic people
alternative label: Non-binary Hispanics
alternative label: Nonbinary Hispanics
broader: Hispanic LGBTQ+ people
change note: Version 4.2.0
has top concept: LGBTQ+ people
in scheme: v3

Hispanic asexual people
type: Concept
issued: 2024-11-27
modified: 2025-02-23
comment: Asexual people who are from or descended from Spain or other regions formerly colonized by Spain that are primarily Spanish-speaking. Only use for individuals who self-identify as Hispanic; do not conflate with Latino/a/x or Chicano/a/x.
alternative label: Asexual Hispanic people
alternative label: Asexual Hispanics
broader: Hispanic LGBTQ+ people
change note: Version 4.2.0
has top concept: LGBTQ+ people
in scheme: v3

Chicano/a/x asexual people
type: Concept
issued: 2024-12-12
modified: 2025-02-23
comment: Asexual people of Mexican descent born in the United States; only use to describe people who self-identify as Chicano, Chicana, or Chicanx. Do not conflate with Latino/a/x or Hispanic people.
alternative label: Asexual Chicanas
alternative label: Asexual Chicanos
alternative label: Asexual Chicanx people
alternative label: Asexual Chicanxs
alternative label: Chicana asexual people
alternative label: Chicano asexual people
alternative label: Chicanx asexual people
broader: Chicano/a/x LGBTQ+ people
change note: Version 4.2.0
has top concept: LGBTQ+ people
in scheme: v3

LGBTQ+ essays
type: Concept
issued: 2024-12-12
modified: 2025-02-23
comment: Short pieces of prose writing, typically analytical or interpretive, from an LGBTQ+ perspective or addressing LGBTQ+ issues.
alternative label: Essays (LGBTQ)
alternative label: LGBTQ+ papers
alternative label: Papers (LGBTQ)
broader: LGBTQ+ literature
change note: Version 4.2.0
has top concept: Subcultures
in scheme: v3

Hispanic American lesbians
type: Concept
issued: 2024-12-12
modified: 2025-02-23
comment: Lesbians who were born in or currently reside in the United States and are descended from Spain or other regions formerly colonized by Spain that are primarily Spanish-speaking. Only use for individuals who self-identify as Hispanic American; do not conflate with Latino/a/x or Chicano/a/x.
alternative label: Lesbian Hispanic Americans
broader: Hispanic American LGBTQ+ people
change note: Version 4.2.0
has top concept: LGBTQ+ people
in scheme: v3

Hispanic American gay men
type: Concept
issued: 2024-12-12
modified: 2025-02-23
comment: Gay men who were born in or currently reside in the United States and are descended from Spain or other regions formerly colonized by Spain that are primarily Spanish-speaking. Only use for individuals who self-identify as Hispanic American; do not conflate with Latino/a/x or Chicano/a/x.
alternative label: Gay Hispanic Americans
alternative label: Gay Hispanic American men
broader: Hispanic American LGBTQ+ people
change note: Version 4.2.0
has top concept: LGBTQ+ people
in scheme: v3

Hispanic American bisexual people
type: Concept
issued: 2024-12-12
modified: 2025-02-23
comment: Bisexual people who were born in or currently reside in the United States and are descended from Spain or other regions formerly colonized by Spain that are primarily Spanish-speaking. Only use for individuals who self-identify as Hispanic American; do not conflate with Latino/a/x or Chicano/a/x.
alternative label: Bisexual Hispanic Americans
alternative label: Bisexual Hispanic American people
broader: Hispanic American LGBTQ+ people
change note: Version 4.2.0
has top concept: LGBTQ+ people
in scheme: v3

Hispanic American transgender people
type: Concept
issued: 2024-12-12
modified: 2025-02-23
comment: Trans people who were born in or currently reside in the United States and are descended from Spain or other regions formerly colonized by Spain that are primarily Spanish-speaking. Only use for individuals who self-identify as Hispanic American; do not conflate with Latino/a/x or Chicano/a/x.
alternative label: Transgender Hispanic Americans
alternative label: Transgender Hispanic American people
alternative label: Hispanic American trans people
alternative label: Trans Hispanic Americans
alternative label: Trans Hispanic American people
broader: Hispanic American LGBTQ+ people
change note: Version 4.2.0
has top concept: LGBTQ+ people
in scheme: v3

Hispanic American queer people
type: Concept
issued: 2024-12-12
modified: 2025-02-23
comment: Queer people who were born in or currently reside in the United States and are descended from Spain or other regions formerly colonized by Spain that are primarily Spanish-speaking. Only use for individuals who self-identify as Hispanic American; do not conflate with Latino/a/x or Chicano/a/x.
alternative label: Queer Hispanic Americans
alternative label: Queer Hispanic American people
broader: Hispanic American LGBTQ+ people
change note: Version 4.2.0
has top concept: LGBTQ+ people
in scheme: v3

Hispanic American non-binary people
type: Concept
issued: 2024-12-12
modified: 2025-02-23
comment: Non-binary people who were born in or currently reside in the United States and are descended from Spain or other regions formerly colonized by Spain that are primarily Spanish-speaking. Only use for individuals who self-identify as Hispanic American; do not conflate with Latino/a/x or Chicano/a/x.
alternative label: Non-binary Hispanic Americans
alternative label: Non-binary Hispanic American people
alternative label: Hispanic American Nonbinary people
alternative label: Nonbinary Hispanic Americans
alternative label: Nonbinary Hispanic American people
broader: Hispanic American LGBTQ+ people
change note: Version 4.2.0
has top concept: LGBTQ+ people
in scheme: v3

Hispanic American intersex people
type: Concept
issued: 2024-12-12
modified: 2025-02-23
comment: Intersex people who were born in or currently reside in the United States and are descended from Spain or other regions formerly colonized by Spain that are primarily Spanish-speaking. Only use for individuals who self-identify as Hispanic American; do not conflate with Latino/a/x or Chicano/a/x.
alternative label: Intersex Hispanic Americans
alternative label: Intersex Hispanic American people
broader: Hispanic American LGBTQ+ people
change note: Version 4.2.0
has top concept: LGBTQ+ people
in scheme: v3

Hispanic American asexual people
type: Concept
issued: 2024-12-12
modified: 2025-02-23
comment: Asexual people who were born in or currently reside in the United States and are descended from Spain or other regions formerly colonized by Spain that are primarily Spanish-speaking. Only use for individuals who self-identify as Hispanic American; do not conflate with Latino/a/x or Chicano/a/x.
alternative label: Asexual Hispanic Americans
alternative label: Asexual Hispanic American people
broader: Hispanic American LGBTQ+ people
change note: Version 4.2.0
has top concept: LGBTQ+ people
in scheme: v3

Lesbian organizations
type: Concept
issued: 2024-12-12
modified: 2025-02-23
comment: Groups or clubs of lesbians dedicated to a particular interest or activity.
alternative label: Lesbian groups
broader: LGBTQ+ clubs and organizations
change note: Version 4.2.0
has top concept: LGBTQ+ clubs and organizations
in scheme: v3
preferred label: Lesbian organisations

Gay organizations
type: Concept
issued: 2024-12-12
modified: 2025-02-23
comment: Groups or clubs of gay men dedicated to a particular interest or activity.
alternative label: Gay groups
broader: LGBTQ+ clubs and organizations
change note: Version 4.2.0
has top concept: LGBTQ+ clubs and organizations
in scheme: v3
preferred label: Gay organisations

Bisexual organizations
type: Concept
issued: 2024-12-12
modified: 2025-02-23
comment: Groups or clubs of bisexual people dedicated to a particular interest or activity.
alternative label: Bisexual groups
broader: LGBTQ+ clubs and organizations
change note: Version 4.2.0
has top concept: LGBTQ+ clubs and organizations
in scheme: v3
preferred label: Bisexual organisations

Transgender organizations
type: Concept
issued: 2024-12-12
modified: 2025-02-23
comment: Groups or clubs of trans people dedicated to a particular interest or activity.
alternative label: Trans organizations
alternative label: Transgender groups
alternative label: Trans groups
broader: LGBTQ+ clubs and organizations
change note: Version 4.2.0
has top concept: LGBTQ+ clubs and organizations
in scheme: v3
preferred label: Transgender organisations

Queer organizations
type: Concept
issued: 2024-12-12
modified: 2025-02-23
comment: Groups or clubs of queer people dedicated to a particular interest or activity.
alternative label: Queer groups
broader: LGBTQ+ clubs and organizations
change note: Version 4.2.0
has top concept: LGBTQ+ clubs and organizations
in scheme: v3
preferred label: Queer organisations

Intersex organizations
type: Concept
issued: 2024-12-12
modified: 2025-02-23
comment: Groups or clubs of intersex people dedicated to a particular interest or activity.
alternative label: Intersex groups
broader: LGBTQ+ clubs and organizations
change note: Version 4.2.0
has top concept: LGBTQ+ clubs and organizations
in scheme: v3
preferred label: Intersex organisations

Non-binary organizations
type: Concept
issued: 2024-12-12
modified: 2025-02-23
comment: Groups or clubs of non-binary people dedicated to a particular interest or activity.
alternative label: Non-binary groups
alternative label: Nonbinary organizations
alternative label: Nonbinary groups
broader: LGBTQ+ clubs and organizations
change note: Version 4.2.0
has top concept: LGBTQ+ clubs and organizations
in scheme: v3
preferred label: Non-binary organisations

Reproductive health care for intersex people
type: Concept
issued: 2024-12-12
modified: 2025-02-23
comment: Access to and experiences with reproductive health care for intersex people. Reproductive health care includes contraception, abortion, STD testing and treatment, and fertility care.
alternative label: Reproductive healthcare for intersex people
broader: Reproductive health care for LGBTQ+ people
change note: Version 4.2.0
has top concept: Health care for LGBTQ+ people
in scheme: v3

Greyromantic artists
type: Concept
issued: 2024-12-12
modified: 2025-02-23
comment: Greyromantic people who practice any of various creative arts.
broader: LGBTQ+ artists
change note: Version 4.2.0
has top concept: LGBTQ+ people
in scheme: v3

Demisexual artists
type: Concept
issued: 2024-12-12
modified: 2025-02-23
comment: Demisexual people who practice any of various creative arts.
broader: LGBTQ+ artists
change note: Version 4.2.0
has top concept: LGBTQ+ people
in scheme: v3

Megasexual artists
type: Concept
issued: 2024-12-12
modified: 2025-02-23
comment: Megasexual people who practice any of various creative arts.
broader: LGBTQ+ artists
change note: Version 4.2.0
has top concept: LGBTQ+ people
in scheme: v3

Aromantic artists
type: Concept
issued: 2024-12-12
modified: 2025-02-23
comment: Aromantic people who practice any of various creative arts.
broader: LGBTQ+ artists
change note: Version 4.2.0
has top concept: LGBTQ+ people
in scheme: v3

Interviews with lesbians
type: Concept
issued: 2025-02-26
modified: 2025-04-29
comment: Structured conversations in which one participant asks questions and the other(s) provide answers. Use to refer to interviews with lesbian subjects recorded in print, radio, television, etc.
alternative label: Lesbian interviews
broader: Interviews with LGBTQ+ people
change note: Version 4.2.0
has top concept: Interviews with LGBTQ+ people
in scheme: v4

Interviews with gay men
type: Concept
issued: 2025-02-27
modified: 2025-04-29
comment: Structured conversations in which one participant asks questions and the other(s) provide answers. Use to refer to interviews with gay men recorded in print, radio, television, etc.
alternative label: Gay interviews
broader: Interviews with LGBTQ+ people
change note: Version 4.2.0
has top concept: Interviews with LGBTQ+ people
in scheme: v4

Interviews with bisexual people
type: Concept
issued: 2025-02-27
modified: 2025-04-29
comment: Structured conversations in which one participant asks questions and the other(s) provide answers. Use to refer to interviews with bisexual subjects recorded in print, radio, television, etc.
alternative label: Bisexual interviews
broader: Interviews with LGBTQ+ people
change note: Version 4.2.0
has top concept: Interviews with LGBTQ+ people
in scheme: v4

Interviews with transgender people
type: Concept
issued: 2025-02-27
modified: 2025-04-29
comment: Structured conversations in which one participant asks questions and the other(s) provide answers. Use to refer to interviews with trans subjects recorded in print, radio, television, etc.
alternative label: Transgender interviews
alternative label: Interviews with trans people
alternative label: Trans interviews
broader: Interviews with LGBTQ+ people
change note: Version 4.2.0
has top concept: Interviews with LGBTQ+ people
in scheme: v4

Interviews with intersex people
type: Concept
issued: 2025-02-27
modified: 2025-04-29
comment: Structured conversations in which one participant asks questions and the other(s) provide answers. Use to refer to interviews with intersex subjects recorded in print, radio, television, etc.
alternative label: Intersex interviews
broader: Interviews with LGBTQ+ people
change note: Version 4.2.0
has top concept: Interviews with LGBTQ+ people
in scheme: v4

Interviews with demisexual people
type: Concept
issued: 2025-02-27
modified: 2025-04-29
comment: Structured conversations in which one participant asks questions and the other(s) provide answers. Use to refer to interviews with demisexual subjects recorded in print, radio, television, etc.
alternative label: Demisexual interviews
broader: Interviews with LGBTQ+ people
change note: Version 4.2.0
has top concept: Interviews with LGBTQ+ people
in scheme: v4

Interviews with queer people
type: Concept
issued: 2025-02-27
modified: 2025-04-29
comment: Structured conversations in which one participant asks questions and the other(s) provide answers. Use to refer to interviews with queer subjects recorded in print, radio, television, etc.
alternative label: Queer interviews
broader: Interviews with LGBTQ+ people
change note: Version 4.2.0
has top concept: Interviews with LGBTQ+ people
in scheme: v4

LGBTQ+ street interviews
type: Concept
issued: 2025-02-27
modified: 2025-04-29
comment: Interviews in which reporters stop LGBTQ+ people on the street, asking them questions and receiving answers in real time.
alternative label: LGBTQ+ roaming reporting
alternative label: Street interviews (LGBTQ)
alternative label: Roaming reporting (LGBTQ)
broader: Interviews with LGBTQ+ people
change note: Version 4.2.0
has top concept: Interviews with LGBTQ+ people
in scheme: v4

Non-binary authors
type: Concept
issued: 2025-03-13
modified: 2025-03-13
comment: Non-binary creators of written works.
alternative label: Nonbinary authors
alternative label: Non-binary writers
alternative label: Nonbinary writers
broader: LGBTQ+ authors
change note: Version 4.2.0
has top concept: LGBTQ+ people
in scheme: v4
related: Non-binary people's writings

Transgender people's writings
type: Concept
issued: 2025-03-13
modified: 2025-03-13
comment: Written works created by trans people.
alternative label: Trans people's writings
alternative label: Writings of transgender people
alternative label: Writings of trans people
broader: LGBTQ+ people's writings
change note: Version 4.2.0
has top concept: Subcultures
in scheme: v4
related: Transgender authors

LGBTQ+ survivors of cyberbullying
type: Concept
issued: 2025-03-13
modified: 2025-04-01
comment: LGBTQ+ people who have experienced and survived cyberbullying, a form of bullying or harassment that takes place online. Follow the individual's preference for "victims" or "survivors" whenever possible.
alternative label: Survivors of cyberbullying (LGBTQ)
alternative label: LGBTQ+ cyberbullying survivors
alternative label: Cyberbullying survivors (LGBTQ)
broader: LGBTQ+ victims of cyberbullying
change note: Version 4.2.0
has top concept: LGBTQ+ people
in scheme: v4

Lesbian cartoonists
type: Concept
issued: 2025-03-13
modified: 2025-03-13
comment: Lesbians who draw cartoons, comics, or graphic novels.
alternative label: Lesbian comics creators
alternative label: Lesbian cartoon artists
broader: LGBTQ+ cartoonists
change note: Version 4.2.0
has top concept: LGBTQ+ people
in scheme: v4

Gay cartoonists
type: Concept
issued: 2025-03-13
modified: 2025-03-13
comment: Gay men who draw cartoons, comics, or graphic novels.
alternative label: Gay comics creators
alternative label: Gay cartoon artists
broader: LGBTQ+ cartoonists
change note: Version 4.2.0
has top concept: LGBTQ+ people
in scheme: v4

Bisexual cartoonists
type: Concept
issued: 2025-03-13
modified: 2025-03-13
comment: Bisexual people who draw cartoons, comics, or graphic novels.
alternative label: Bisexual comics creators
alternative label: Bisexual cartoon artists
broader: LGBTQ+ cartoonists
change note: Version 4.2.0
has top concept: LGBTQ+ people
in scheme: v4

Transgender cartoonists
type: Concept
issued: 2025-03-13
modified: 2025-03-13
comment: Trans people who draw cartoons, comics, or graphic novels.
alternative label: Transgender comics creators
alternative label: Transgender cartoon artists
alternative label: Trans cartoonists
alternative label: Trans comics creators
alternative label: Trans cartoon artists
broader: LGBTQ+ cartoonists
change note: Version 4.2.0
has top concept: LGBTQ+ people
in scheme: v4

Queer cartoonists
type: Concept
issued: 2025-03-13
modified: 2025-03-13
comment: Queer people who draw cartoons, comics, or graphic novels.
alternative label: Queer comics creators
alternative label: Queer cartoon artists
broader: LGBTQ+ cartoonists
change note: Version 4.2.0
has top concept: LGBTQ+ people
in scheme: v4

Non-binary cartoonists
type: Concept
issued: 2025-03-13
modified: 2025-03-13
comment: Non-binary people who draw cartoons, comics, or graphic novels.
alternative label: Non-binary comics creators
alternative label: Non-binary cartoon artists
alternative label: Nonbinary cartoonists
broader: LGBTQ+ cartoonists
change note: Version 4.2.0
has top concept: LGBTQ+ people
in scheme: v4

Intersex cartoonists
type: Concept
issued: 2025-03-13
modified: 2025-03-13
comment: Intersex people who draw cartoons, comics, or graphic novels.
alternative label: Intersex comics creators
alternative label: Intersex cartoon artists
broader: LGBTQ+ cartoonists
change note: Version 4.2.0
has top concept: LGBTQ+ people
in scheme: v4

Asexual cartoonists
type: Concept
issued: 2025-03-13
modified: 2025-03-13
comment: Asexual people who draw cartoons, comics, or graphic novels.
alternative label: Asexual comics creators
alternative label: Asexual cartoon artists
broader: LGBTQ+ cartoonists
change note: Version 4.2.0
has top concept: LGBTQ+ people
in scheme: v4

Aromantic cartoonists
type: Concept
issued: 2025-03-13
modified: 2025-03-13
comment: Aromantic people who draw cartoons, comics, or graphic novels.
alternative label: Aromantic comics creators
alternative label: Aromantic cartoon artists
broader: LGBTQ+ cartoonists
change note: Version 4.2.0
has top concept: LGBTQ+ people
in scheme: v4

Demisexual cartoonists
type: Concept
issued: 2025-03-13
modified: 2025-03-13
comment: Demisexual people who draw cartoons, comics, or graphic novels.
alternative label: Demisexual comics creators
alternative label: Demisexual cartoon artists
broader: LGBTQ+ cartoonists
change note: Version 4.2.0
has top concept: LGBTQ+ people
in scheme: v4

Greyromantic cartoonists
type: Concept
issued: 2025-03-13
modified: 2025-03-13
comment: Greyromantic people who draw cartoons, comics, or graphic novels.
alternative label: Greyromantic comics creators
alternative label: Greyromantic cartoon artists
broader: LGBTQ+ cartoonists
change note: Version 4.2.0
has top concept: LGBTQ+ people
in scheme: v4

Megasexual cartoonists
type: Concept
issued: 2025-03-13
modified: 2025-03-13
comment: Megasexual people who draw cartoons, comics, or graphic novels.
alternative label: Megasexual comics creators
alternative label: Megasexual cartoon artists
broader: LGBTQ+ cartoonists
change note: Version 4.2.0
has top concept: LGBTQ+ people
in scheme: v4

Asexual celebrities
type: Concept
issued: 2025-03-20
modified: 2025-03-20
comment: Asexual people who have achieved fame and broad public recognition due to the attention given to them by mass media.
alternative label: Asexual celebs
alternative label: Famous asexual people
alternative label: Asexual famous people
broader: LGBTQ+ celebrities
change note: Version 4.2.0
has top concept: LGBTQ+ people
in scheme: v4

Aromantic celebrities
type: Concept
issued: 2025-03-20
modified: 2025-03-20
comment: Aromantic people who have achieved fame and broad public recognition due to the attention given to them by mass media.
alternative label: Aromantic celebs
alternative label: Famous aromantic people
alternative label: Aromantic famous people
broader: LGBTQ+ celebrities
change note: Version 4.2.0
has top concept: LGBTQ+ people
in scheme: v4

Demisexual celebrities
type: Concept
issued: 2025-03-20
modified: 2025-03-20
comment: Demisexual people who have achieved fame and broad public recognition due to the attention given to them by mass media.
alternative label: Demisexual celebs
alternative label: Famous demisexual people
alternative label: Demisexual famous people
broader: LGBTQ+ celebrities
change note: Version 4.2.0
has top concept: LGBTQ+ people
in scheme: v4

Greyromantic celebrities
type: Concept
issued: 2025-03-20
modified: 2025-03-20
comment: Greyromantic people who have achieved fame and broad public recognition due to the attention given to them by mass media.
alternative label: Greyromantic celebs
alternative label: Famous greyromantic people
alternative label: Greyromantic famous people
broader: LGBTQ+ celebrities
change note: Version 4.2.0
has top concept: LGBTQ+ people
in scheme: v4

Megasexual celebrities
type: Concept
issued: 2025-03-20
modified: 2025-03-20
comment: Megasexual people who have achieved fame and broad public recognition due to the attention given to them by mass media.
alternative label: Megasexual celebs
alternative label: Famous megasexual people
alternative label: Megasexual famous people
broader: LGBTQ+ celebrities
change note: Version 4.2.0
has top concept: LGBTQ+ people
in scheme: v4

Lesbian survival guides
type: Concept
issued: 2025-03-20
modified: 2025-03-20
comment: Written publications designed to support lesbians by sharing common advice and community knowledge.
broader: LGBTQ+ survival guides
change note: Version 4.2.0
has top concept: Subcultures
in scheme: v4

Gay survival guides
type: Concept
issued: 2025-03-20
modified: 2025-03-20
comment: Written publications designed to support gay men by sharing common advice and community knowledge.
broader: LGBTQ+ survival guides
change note: Version 4.2.0
has top concept: Subcultures
in scheme: v4

Bisexual survival guides
type: Concept
issued: 2025-03-20
modified: 2025-03-20
comment: Written publications designed to support bisexual people by sharing common advice and community knowledge.
broader: LGBTQ+ survival guides
change note: Version 4.2.0
has top concept: Subcultures
in scheme: v4

Transgender survival guides
type: Concept
issued: 2025-03-20
modified: 2025-03-20
comment: Written publications designed to support trans people by sharing common advice and community knowledge.
alternative label: Trans survival guides
broader: LGBTQ+ survival guides
change note: Version 4.2.0
has top concept: Subcultures
in scheme: v4

Queer survival guides
type: Concept
issued: 2025-03-20
modified: 2025-03-20
comment: Written publications designed to support queer people by sharing common advice and community knowledge.
broader: LGBTQ+ survival guides
change note: Version 4.2.0
has top concept: Subcultures
in scheme: v4

Non-binary survival guides
type: Concept
issued: 2025-03-20
modified: 2025-03-20
comment: Written publications designed to support non-binary people by sharing common advice and community knowledge.
alternative label: Nonbinary survival guides
broader: LGBTQ+ survival guides
change note: Version 4.2.0
has top concept: Subcultures
in scheme: v4

Intersex survival guides
type: Concept
issued: 2025-03-20
modified: 2025-03-20
comment: Written publications designed to support intersex people by sharing common advice and community knowledge.
broader: LGBTQ+ survival guides
change note: Version 4.2.0
has top concept: Subcultures
in scheme: v4

Gay journalists
type: Concept
issued: 2025-03-26
modified: 2025-04-29
comment: Gay men who who gather information in the form of text, audio, or pictures, process it into a newsworthy form, and disseminate it to the public.
broader: LGBTQ+ journalists
change note: Version 4.2.0
has top concept: LGBTQ+ people
in scheme: v4

Lesbian journalists
type: Concept
issued: 2025-03-26
modified: 2025-04-29
comment: Lesbians who gather information in the form of text, audio, or pictures, process it into a newsworthy form, and disseminate it to the public.
broader: LGBTQ+ journalists
change note: Version 4.2.0
has top concept: LGBTQ+ people
in scheme: v4

Asexual journalists
type: Concept
issued: 2025-03-26
modified: 2025-04-29
comment: Asexual people who gather information in the form of text, audio, or pictures, process it into a newsworthy form, and disseminate it to the public.
alternative label: Ace journalists
broader: LGBTQ+ journalists
change note: Version 4.2.0
has top concept: LGBTQ+ people
in scheme: v4

Bisexual journalists
type: Concept
issued: 2025-03-26
modified: 2025-04-29
comment: Bisexual people who gather information in the form of text, audio, or pictures, process it into a newsworthy form, and disseminate it to the public.
alternative label: Bi journalists
broader: LGBTQ+ journalists
change note: Version 4.2.0
has top concept: LGBTQ+ people
in scheme: v4

Intersex journalists
type: Concept
issued: 2025-03-26
modified: 2025-04-29
comment: Intersex people who gather information in the form of text, audio, or pictures, process it into a newsworthy form, and disseminate it to the public.
broader: LGBTQ+ journalists
change note: Version 4.2.0
has top concept: LGBTQ+ people
in scheme: v4

Queer journalists
type: Concept
issued: 2025-03-26
modified: 2025-04-29
comment: Queer people who gather information in the form of text, audio, or pictures, process it into a newsworthy form, and disseminate it to the public.
broader: LGBTQ+ journalists
change note: Version 4.2.0
has top concept: LGBTQ+ people
in scheme: v4

Transgender journalists
type: Concept
issued: 2025-03-26
modified: 2025-04-29
comment: Transgender people who gather information in the form of text, audio, or pictures, process it into a newsworthy form, and disseminate it to the public.
broader: LGBTQ+ journalists
change note: Version 4.2.0
has top concept: LGBTQ+ people
in scheme: v4

Non-binary journalists
type: Concept
issued: 2025-03-26
modified: 2025-04-29
comment: Non-binary people who gather information in the form of text, audio, or pictures, process it into a newsworthy form, and disseminate it to the public.
alternative label: Nonbinary journalists
broader: LGBTQ+ journalists
change note: Version 4.2.0
has top concept: LGBTQ+ people
in scheme: v4

Bisexual pride
type: Concept
issued: 2025-04-23
modified: 2025-04-23
comment: The recognition and celebration of bisexual people and culture, thereby affirming the visibility, dignity, and diversity of bisexual communities.
alternative label: Bi pride
broader: LGBTQ+ pride
change note: Version 4.2.0
has top concept: LGBTQ+ pride
in scheme: v4

Queer pride
type: Concept
issued: 2025-04-23
modified: 2025-04-23
comment: The recognition and celebration of queer people and culture, thereby affirming the visibility, dignity, and diversity of queer communities.
broader: LGBTQ+ pride
change note: Version 4.2.0
has top concept: LGBTQ+ pride
in scheme: v4

Intersex pride
type: Concept
issued: 2025-04-23
modified: 2025-04-23
comment: The recognition and celebration of intersex people and culture, thereby affirming the visibility, dignity, and diversity of intersex communities.
broader: LGBTQ+ pride
change note: Version 4.2.0
has top concept: LGBTQ+ pride
in scheme: v4

Non-binary pride
type: Concept
issued: 2025-04-23
modified: 2025-04-23
comment: The recognition and celebration of non-binary people and culture, thereby affirming the visibility, dignity, and diversity of non-binary communities.
alternative label: Nonbinary pride
broader: LGBTQ+ pride
change note: Version 4.2.0
has top concept: LGBTQ+ pride
in scheme: v4

Asexual pride
type: Concept
issued: 2025-04-23
modified: 2025-04-23
comment: The recognition and celebration of asexual people and culture, thereby affirming the visibility, dignity, and diversity of asexual communities.
alternative label: Ace pride
broader: LGBTQ+ pride
change note: Version 4.2.0
has top concept: LGBTQ+ pride
in scheme: v4

Lesbian dancers
type: Concept
issued: 2025-04-23
modified: 2025-04-23
comment: Lesbians who dance, either professionally or as a hobby.
broader: LGBTQ+ dancers
change note: Version 4.2.0
has top concept: LGBTQ+ people
in scheme: v4

Gay dancers
type: Concept
issued: 2025-04-23
modified: 2025-04-23
comment: Gay men who dance, either professionally or as a hobby.
alternative label: Gay male dancers
broader: LGBTQ+ dancers
change note: Version 4.2.0
has top concept: LGBTQ+ people
in scheme: v4

Bisexual dancers
type: Concept
issued: 2025-04-23
modified: 2025-04-23
comment: Bisexual people who dance, either professionally or as a hobby.
alternative label: Bi dancers
broader: LGBTQ+ dancers
change note: Version 4.2.0
has top concept: LGBTQ+ people
in scheme: v4

Transgender dancers
type: Concept
issued: 2025-04-23
modified: 2025-04-23
comment: Transgender people who dance, either professionally or as a hobby.
alternative label: Trans dancers
broader: LGBTQ+ dancers
change note: Version 4.2.0
has top concept: LGBTQ+ people
in scheme: v4

Queer dancers
type: Concept
issued: 2025-04-23
modified: 2025-04-23
comment: Queer people who dance, either professionally or as a hobby.
broader: LGBTQ+ dancers
change note: Version 4.2.0
has top concept: LGBTQ+ people
in scheme: v4

Non-binary dancers
type: Concept
issued: 2025-04-23
modified: 2025-04-23
comment: Non-binary people who dance, either professionally or as a hobby.
alternative label: Nonbinary dancers
broader: LGBTQ+ dancers
change note: Version 4.2.0
has top concept: LGBTQ+ people
in scheme: v4

Intersex dancers
type: Concept
issued: 2025-04-23
modified: 2025-04-23
comment: Intersex people who dance, either professionally or as a hobby.
broader: LGBTQ+ dancers
change note: Version 4.2.0
has top concept: LGBTQ+ people
in scheme: v4

Lesbian makeup artists
type: Concept
issued: 2025-04-23
modified: 2025-04-23
comment: Lesbians who apply makeup and/or prosthetics on themselves or others, either professionally or as a hobby.
broader: LGBTQ+ makeup artists
change note: Version 4.2.0
has top concept: LGBTQ+ people
in scheme: v4

Gay makeup artists
type: Concept
issued: 2025-04-23
modified: 2025-04-23
comment: Gay men who apply makeup and/or prosthetics on themselves or others, either professionally or as a hobby.
alternative label: Gay male makeup artists
broader: LGBTQ+ makeup artists
change note: Version 4.2.0
has top concept: LGBTQ+ people
in scheme: v4

Bisexual makeup artists
type: Concept
issued: 2025-04-23
modified: 2025-04-23
comment: Bisexual people who apply makeup and/or prosthetics on themselves or others, either professionally or as a hobby.
alternative label: Bi makeup artists
broader: LGBTQ+ makeup artists
change note: Version 4.2.0
has top concept: LGBTQ+ people
in scheme: v4

Transgender makeup artists
type: Concept
issued: 2025-04-23
modified: 2025-04-23
comment: Trans people who apply makeup and/or prosthetics on themselves or others, either professionally or as a hobby.
alternative label: Trans makeup artists
broader: LGBTQ+ makeup artists
change note: Version 4.2.0
has top concept: LGBTQ+ people
in scheme: v4

Queer makeup artists
type: Concept
issued: 2025-04-23
modified: 2025-04-23
comment: Queer people who apply makeup and/or prosthetics on themselves or others, either professionally or as a hobby.
broader: LGBTQ+ makeup artists
change note: Version 4.2.0
has top concept: LGBTQ+ people
in scheme: v4

Non-binary makeup artists
type: Concept
issued: 2025-04-23
modified: 2025-04-23
comment: Non-binary people who apply makeup and/or prosthetics on themselves or others, either professionally or as a hobby.
alternative label: Nonbinary makeup artists
broader: LGBTQ+ makeup artists
change note: Version 4.2.0
has top concept: LGBTQ+ people
in scheme: v4

Intersex makeup artists
type: Concept
issued: 2025-04-23
modified: 2025-04-23
comment: Intersex people who apply makeup and/or prosthetics on themselves or others, either professionally or as a hobby.
broader: LGBTQ+ makeup artists
change note: Version 4.2.0
has top concept: LGBTQ+ people
in scheme: v4

Lesbian fashion designers
type: Concept
issued: 2025-04-23
modified: 2025-04-23
comment: Lesbians who design and create original clothing, accessories, and footwear.
alternative label: Lesbian clothes designers
alternative label: Lesbian clothing designers
broader: LGBTQ+ fashion designers
change note: Version 4.2.0
has top concept: LGBTQ+ people
in scheme: v4

Gay fashion designers
type: Concept
issued: 2025-04-23
modified: 2025-04-23
comment: Gay men who design and create original clothing, accessories, and footwear.
alternative label: Gay male fashion designers
alternative label: Gay clothes designers
alternative label: Gay clothing designers
broader: LGBTQ+ fashion designers
change note: Version 4.2.0
has top concept: LGBTQ+ people
in scheme: v4

Bisexual fashion designers
type: Concept
issued: 2025-04-23
modified: 2025-04-23
comment: Bisexual people who design and create original clothing, accessories, and footwear.
alternative label: Bi fashion designers
alternative label: Bisexual clothes designers
alternative label: Bisexual clothing designers
broader: LGBTQ+ fashion designers
change note: Version 4.2.0
has top concept: LGBTQ+ people
in scheme: v4

Transgender fashion designers
type: Concept
issued: 2025-04-23
modified: 2025-04-23
comment: Trans people who design and create original clothing, accessories, and footwear.
alternative label: Trans fashion designers
alternative label: Transgender clothes designers
alternative label: Transgender clothing designers
broader: LGBTQ+ fashion designers
change note: Version 4.2.0
has top concept: LGBTQ+ people
in scheme: v4

Queer fashion designers
type: Concept
issued: 2025-04-23
modified: 2025-04-23
comment: Queer people who design and create original clothing, accessories, and footwear.
alternative label: Queer clothes designers
alternative label: Queer clothing designers
broader: LGBTQ+ fashion designers
change note: Version 4.2.0
has top concept: LGBTQ+ people
in scheme: v4

Non-binary fashion designers
type: Concept
issued: 2025-04-23
modified: 2025-04-23
comment: Non-binary people who design and create original clothing, accessories, and footwear.
alternative label: Nonbinary fashion designers
alternative label: Non-binary clothes designers
alternative label: Non-binary clothing designers
broader: LGBTQ+ fashion designers
change note: Version 4.2.0
has top concept: LGBTQ+ people
in scheme: v4

Intersex fashion designers
type: Concept
issued: 2025-04-23
modified: 2025-04-23
comment: Intersex people who design and create original clothing, accessories, and footwear.
alternative label: Intersex clothes designers
alternative label: Intersex clothing designers
broader: LGBTQ+ fashion designers
change note: Version 4.2.0
has top concept: LGBTQ+ people
in scheme: v4

Two-Spirit fashion designers
type: Concept
issued: 2025-04-23
modified: 2025-04-23
comment: Two-Spirit people who design and create original clothing, accessories, and footwear.
alternative label: Two Spirit fashion designers
alternative label: Two-Spirited fashion designers
alternative label: Two Spirited fashion designers
alternative label: 2S fashion designers
alternative label: Two-Spirit clothes designers
alternative label: Two-Spirit clothing designers
broader: LGBTQ+ fashion designers
change note: Version 4.2.0
has top concept: LGBTQ+ people
in scheme: v4

Lesbians in arts and media
type: Concept
issued: 2025-04-23
modified: 2025-04-23
comment: Umbrella term for the depiction of lesbians and lesbian communities in different forms of creative activity and cultural production, including literature, visual art, and popular media. Use more specific terms if possible.
broader: LGBTQ+ people in arts and media
change note: Version 4.2.0
has top concept: LGBTQ+ people
in scheme: v4

Gay men in arts and media
type: Concept
issued: 2025-04-23
modified: 2025-04-23
comment: Umbrella term for the depiction of gay men and communities in different forms of creative activity and cultural production, including literature, visual art, and popular media. Use more specific terms if possible.
broader: LGBTQ+ people in arts and media
change note: Version 4.2.0
has top concept: LGBTQ+ people
in scheme: v4

Bisexual people in arts and media
type: Concept
issued: 2025-04-23
modified: 2025-04-23
comment: Umbrella term for the depiction of bisexual people and communities in different forms of creative activity and cultural production, including literature, visual art, and popular media. Use more specific terms if possible.
alternative label: Bi people in arts and media
broader: LGBTQ+ people in arts and media
change note: Version 4.2.0
has top concept: LGBTQ+ people
in scheme: v4

Transgender people in arts and media
type: Concept
issued: 2025-04-23
modified: 2025-04-23
comment: Umbrella term for the depiction of trans people and communities in different forms of creative activity and cultural production, including literature, visual art, and popular media. Use more specific terms if possible.
alternative label: Trans people in arts and media
broader: LGBTQ+ people in arts and media
change note: Version 4.2.0
has top concept: LGBTQ+ people
in scheme: v4

Queer people in arts and media
type: Concept
issued: 2025-04-23
modified: 2025-04-23
comment: Umbrella term for the depiction of queer people and communities in different forms of creative activity and cultural production, including literature, visual art, and popular media. Use more specific terms if possible.
broader: LGBTQ+ people in arts and media
change note: Version 4.2.0
has top concept: LGBTQ+ people
in scheme: v4

Intersex people in arts and media
type: Concept
issued: 2025-04-23
modified: 2025-04-23
comment: Umbrella term for the depiction of intersex people and communities in different forms of creative activity and cultural production, including literature, visual art, and popular media. Use more specific terms if possible.
broader: LGBTQ+ people in arts and media
change note: Version 4.2.0
has top concept: LGBTQ+ people
in scheme: v4

Non-binary people in arts and media
type: Concept
issued: 2025-04-23
modified: 2025-04-23
comment: Umbrella term for the depiction of non-binary people and communities in different forms of creative activity and cultural production, including literature, visual art, and popular media. Use more specific terms if possible.
alternative label: Nonbinary people in arts and media
broader: LGBTQ+ people in arts and media
change note: Version 4.2.0
has top concept: LGBTQ+ people
in scheme: v4

Non-binary people in visual art
type: Concept
issued: 2025-04-23
modified: 2025-04-23
comment: The depiction of non-binary people and communities in visual art, including painting, performance art, sculpture, photography, cinema, etc.
alternative label: Nonbinary people in visual art
alternative label: Non-binary people in art
alternative label: Nonbinary people in art
broader: LGBTQ+ people in visual art
change note: Version 4.2.0
has top concept: LGBTQ+ people
in scheme: v4

Non-binary people in literature
type: Concept
issued: 2025-04-23
modified: 2025-04-23
comment: The depiction of non-binary people in literature.
alternative label: Nonbinary people in literature
broader: LGBTQ+ people in literature
change note: Version 4.2.0
has top concept: LGBTQ+ people
in scheme: v4

Ainu lesbians
type: Concept
issued: 2025-04-24
modified: 2025-04-24
comment: Lesbians who belong to the Ainu, an Indigenous ethnic group that has historically resided in Ainu Mosir, or the land of the Ainu, in what is now known as Japan. Only use to refer to people who self-identify as Ainu.
alternative label: Lesbian Ainu people
broader: Ainu LGBTQ+ people
change note: Version 4.2.0
has top concept: LGBTQ+ people
in scheme: v4

Ainu gay men
type: Concept
issued: 2025-04-24
modified: 2025-04-24
comment: Gay men who belong to the Ainu, an Indigenous ethnic group that has historically resided in Ainu Mosir, or the land of the Ainu, in what is now known as Japan. Only use to refer to people who self-identify as Ainu.
alternative label: Gay Ainu men
broader: Ainu LGBTQ+ people
change note: Version 4.2.0
has top concept: LGBTQ+ people
in scheme: v4

Ainu bisexual people
type: Concept
issued: 2025-04-24
modified: 2025-04-24
comment: Bisexual people who belong to the Ainu, an Indigenous ethnic group that has historically resided in Ainu Mosir, or the land of the Ainu, in what is now known as Japan. Only use to refer to people who self-identify as Ainu.
alternative label: Bisexual Ainu people
broader: Ainu LGBTQ+ people
change note: Version 4.2.0
has top concept: LGBTQ+ people
in scheme: v4

Ainu transgender people
type: Concept
issued: 2025-04-24
modified: 2025-04-24
comment: Trans people who belong to the Ainu, an Indigenous ethnic group that has historically resided in Ainu Mosir, or the land of the Ainu, in what is now known as Japan. Only use to refer to people who self-identify as Ainu.
alternative label: Transgender Ainu people
alternative label: Ainu trans people
alternative label: Trans Ainu people
broader: Ainu LGBTQ+ people
change note: Version 4.2.0
has top concept: LGBTQ+ people
in scheme: v4

Ainu queer people
type: Concept
issued: 2025-04-24
modified: 2025-04-24
comment: Queer people who belong to the Ainu, an Indigenous ethnic group that has historically resided in Ainu Mosir, or the land of the Ainu, in what is now known as Japan. Only use to refer to people who self-identify as Ainu.
alternative label: Queer Ainu people
broader: Ainu LGBTQ+ people
change note: Version 4.2.0
has top concept: LGBTQ+ people
in scheme: v4

Ainu intersex people
type: Concept
issued: 2025-04-24
modified: 2025-04-24
comment: Intersex people who belong to the Ainu, an Indigenous ethnic group that has historically resided in Ainu Mosir, or the land of the Ainu, in what is now known as Japan. Only use to refer to people who self-identify as Ainu.
alternative label: Intersex Ainu people
broader: Ainu LGBTQ+ people
change note: Version 4.2.0
has top concept: LGBTQ+ people
in scheme: v4

Ainu non-binary people
type: Concept
issued: 2025-04-24
modified: 2025-04-24
comment: Non-binary people who belong to the Ainu, an Indigenous ethnic group that has historically resided in Ainu Mosir, or the land of the Ainu, in what is now known as Japan. Only use to refer to people who self-identify as Ainu.
alternative label: Non-binary Ainu people
alternative label: Ainu nonbinary people
alternative label: Nonbinary Ainu people
broader: Ainu LGBTQ+ people
change note: Version 4.2.0
has top concept: LGBTQ+ people
in scheme: v4

Ainu asexual people
type: Concept
issued: 2025-04-24
modified: 2025-04-24
comment: Asexual people who belong to the Ainu, an Indigenous ethnic group that has historically resided in Ainu Mosir, or the land of the Ainu, in what is now known as Japan. Only use to refer to people who self-identify as Ainu.
alternative label: Asexual Ainu people
broader: Ainu LGBTQ+ people
change note: Version 4.2.0
has top concept: LGBTQ+ people
in scheme: v4

Ryukyuan lesbians
type: Concept
issued: 2025-04-24
modified: 2025-04-24
comment: Lesbians who belong to the Ryukyuan, an ethnic group indigenous to the Ryukyu archipelago in what is now known as Japan. Only use to refer to people who self-identify as Ryukyuan.
alternative label: Lesbian Ryukyuan people
alternative label: Lesbian Ryukyuans
alternative label: Ryūkyūan lesbians
alternative label: Lesbian Ryūkyūan people
alternative label: Lesbian Ryūkyūans
broader: Ryukyuan LGBTQ+ people
change note: Version 4.2.0
has top concept: LGBTQ+ people
in scheme: v4

Ryukyuan gay men
type: Concept
issued: 2025-04-24
modified: 2025-04-24
comment: Gay men who belong to the Ryukyuan, an ethnic group indigenous to the Ryukyu archipelago in what is now known as Japan. Only use to refer to people who self-identify as Ryukyuan.
alternative label: Gay Ryukyuan men
alternative label: Gay Ryukyuans
alternative label: Ryūkyūan gay men
alternative label: Gay Ryūkyūan men
alternative label: Gay Ryūkyūans
broader: Ryukyuan LGBTQ+ people
change note: Version 4.2.0
has top concept: LGBTQ+ people
in scheme: v4

Ryukyuan bisexual people
type: Concept
issued: 2025-04-24
modified: 2025-04-24
comment: Bisexual people who belong to the Ryukyuan, an ethnic group indigenous to the Ryukyu archipelago in what is now known as Japan. Only use to refer to people who self-identify as Ryukyuan.
alternative label: Bisexual Ryukyuan people
alternative label: Bisexual Ryukyuans
alternative label: Ryūkyūan bisexual people
alternative label: Bisexual Ryūkyūan people
alternative label: Bisexual Ryūkyūans
broader: Ryukyuan LGBTQ+ people
change note: Version 4.2.0
has top concept: LGBTQ+ people
in scheme: v4

Ryukyuan transgender people
type: Concept
issued: 2025-04-24
modified: 2025-04-24
comment: Trans people who belong to the Ryukyuan, an ethnic group indigenous to the Ryukyu archipelago in what is now known as Japan. Only use to refer to people who self-identify as Ryukyuan.
alternative label: Transgender Ryukyuan people
alternative label: Transgender Ryukyuans
alternative label: Ryūkyūan transgender people
alternative label: Transgender Ryūkyūan people
alternative label: Transgender Ryūkyūans
alternative label: Ryukyuan trans people
alternative label: Trans Ryukyuan people
alternative label: Trans Ryukyans
alternative label: Ryūkyūan trans people
alternative label: Trans Ryūkyūan people
alternative label: Trans Ryūkyūans
broader: Ryukyuan LGBTQ+ people
change note: Version 4.2.0
has top concept: LGBTQ+ people
in scheme: v4

Ryukyuan queer people
type: Concept
issued: 2025-04-24
modified: 2025-04-24
comment: Queer people who belong to the Ryukyuan, an ethnic group indigenous to the Ryukyu archipelago in what is now known as Japan. Only use to refer to people who self-identify as Ryukyuan.
alternative label: Queer Ryukyuan people
alternative label: Queer Ryukyuans
alternative label: Ryūkyūan queer people
alternative label: Queer Ryūkyūan people
alternative label: Queer Ryūkyūans
broader: Ryukyuan LGBTQ+ people
change note: Version 4.2.0
has top concept: LGBTQ+ people
in scheme: v4

Ryukyuan intersex people
type: Concept
issued: 2025-04-24
modified: 2025-04-24
comment: Intersex people who belong to the Ryukyuan, an ethnic group indigenous to the Ryukyu archipelago in what is now known as Japan. Only use to refer to people who self-identify as Ryukyuan.
alternative label: Intersex Ryukyuan people
alternative label: Intersex Ryukyuans
alternative label: Ryūkyūan intersex people
alternative label: Intersex Ryūkyūan people
alternative label: Intersex Ryūkyūans
broader: Ryukyuan LGBTQ+ people
change note: Version 4.2.0
has top concept: LGBTQ+ people
in scheme: v4

Ryukyuan non-binary people
type: Concept
issued: 2025-04-24
modified: 2025-04-24
comment: Non-binary people who belong to the Ryukyuan, an ethnic group indigenous to the Ryukyu archipelago in what is now known as Japan. Only use to refer to people who self-identify as Ryukyuan.
alternative label: Non-binary Ryukyuan people
alternative label: Non-binary Ryukyuans
alternative label: Ryūkyūan non-binary people
alternative label: Non-binary Ryūkyūan people
alternative label: Non-binary Ryūkyūans
alternative label: Ryukyuan nonbinary people
alternative label: Nonbinary Ryukyuan people
alternative label: Nonbinary Ryukyans
alternative label: Ryūkyūan nonbinary people
alternative label: Nonbinary Ryūkyūan people
alternative label: Nonbinary Ryūkyūans
broader: Ryukyuan LGBTQ+ people
change note: Version 4.2.0
has top concept: LGBTQ+ people
in scheme: v4

Ryukyuan asexual people
type: Concept
issued: 2025-04-24
modified: 2025-04-24
comment: Asexual people who belong to the Ryukyuan, an ethnic group indigenous to the Ryukyu archipelago in what is now known as Japan. Only use to refer to people who self-identify as Ryukyuan.
alternative label: Asexual Ryukyuan people
alternative label: Asexual Ryukyuans
alternative label: Ryūkyūan asexual people
alternative label: Asexual Ryūkyūan people
alternative label: Asexual Ryūkyūans
broader: Ryukyuan LGBTQ+ people
change note: Version 4.2.0
has top concept: LGBTQ+ people
in scheme: v4

Sámi asexual people
type: Concept
issued: 2025-04-24
modified: 2025-04-24
comment: Asexual people who belong to the traditionally Sámi-speaking Indigenous people of the Sápmi, which encompasses large parts of the regions now known as Norway, Sweden, Finland, and of the Kola Peninsula in Russia. Only use to refer to people who self-identify as Sámi.
alternative label: Asexual Sámi people
alternative label: Asexual Sámis
broader: Sámi LGBTQ+ people
change note: Version 4.2.0
has top concept: LGBTQ+ people
in scheme: v4

Sámi bisexual people
type: Concept
issued: 2025-04-24
modified: 2025-04-24
comment: Bisexual people who belong to the traditionally Sámi-speaking Indigenous people of the Sápmi, which encompasses large parts of the regions now known as Norway, Sweden, Finland, and of the Kola Peninsula in Russia. Only use to refer to people who self-identify as Sámi.
alternative label: Bisexual Sámi people
alternative label: Bisexual Sámis
broader: Sámi LGBTQ+ people
change note: Version 4.2.0
has top concept: LGBTQ+ people
in scheme: v4

Sámi gay men
type: Concept
issued: 2025-04-24
modified: 2025-04-24
comment: Gay men who belong to the traditionally Sámi-speaking Indigenous people of the Sápmi, which encompasses large parts of the regions now known as Norway, Sweden, Finland, and of the Kola Peninsula in Russia. Only use to refer to people who self-identify as Sámi.
alternative label: Gay Sámi men
alternative label: Gay Sámis
broader: Sámi LGBTQ+ people
change note: Version 4.2.0
has top concept: LGBTQ+ people
in scheme: v4

Sámi lesbians
type: Concept
issued: 2025-04-24
modified: 2025-04-24
comment: Lesbians who belong to the traditionally Sámi-speaking Indigenous people of the Sápmi, which encompasses large parts of the regions now known as Norway, Sweden, Finland, and of the Kola Peninsula in Russia. Only use to refer to people who self-identify as Sámi.
alternative label: Lesbian Sámi people
alternative label: Lesbian Sámis
broader: Sámi LGBTQ+ people
change note: Version 4.2.0
has top concept: LGBTQ+ people
in scheme: v4

Sámi intersex people
type: Concept
issued: 2025-04-24
modified: 2025-04-24
comment: Intersex people who belong to the traditionally Sámi-speaking Indigenous people of the Sápmi, which encompasses large parts of the regions now known as Norway, Sweden, Finland, and of the Kola Peninsula in Russia. Only use to refer to people who self-identify as Sámi.
alternative label: Intersex Sámi people
alternative label: Intersex Sámis
broader: Sámi LGBTQ+ people
change note: Version 4.2.0
has top concept: LGBTQ+ people
in scheme: v4

Sámi non-binary people
type: Concept
issued: 2025-04-24
modified: 2025-04-24
comment: Non-binary people who belong to the traditionally Sámi-speaking Indigenous people of the Sápmi, which encompasses large parts of the regions now known as Norway, Sweden, Finland, and of the Kola Peninsula in Russia. Only use to refer to people who self-identify as Sámi.
alternative label: Non-binary Sámi people
alternative label: Nonbinary Sámi people
alternative label: Non-binary Sámis
alternative label: Nonbinary Sámis
broader: Sámi LGBTQ+ people
change note: Version 4.2.0
has top concept: LGBTQ+ people
in scheme: v4

Sámi queer people
type: Concept
issued: 2025-04-24
modified: 2025-04-24
comment: Queer people who belong to the traditionally Sámi-speaking Indigenous people of the Sápmi, which encompasses large parts of the regions now known as Norway, Sweden, Finland, and of the Kola Peninsula in Russia. Only use to refer to people who self-identify as Sámi.
alternative label: Queer Sámi people
alternative label: Queer Sámis
broader: Sámi LGBTQ+ people
change note: Version 4.2.0
has top concept: LGBTQ+ people
in scheme: v4

Sámi transgender people
type: Concept
issued: 2025-04-24
modified: 2025-04-24
comment: Trans people who belong to the traditionally Sámi-speaking Indigenous people of the Sápmi, which encompasses large parts of the regions now known as Norway, Sweden, Finland, and of the Kola Peninsula in Russia. Only use to refer to people who self-identify as Sámi.
alternative label: Transgender Sámi people
alternative label: Transgender Sámis
alternative label: Trans Sámi people
alternative label: Trans Sámis
alternative label: Sámi trans people
broader: Sámi LGBTQ+ people
change note: Version 4.2.0
has top concept: LGBTQ+ people
in scheme: v4

Paragraph 175
type: Concept
issued: 2026-02-11
modified: 2026-02-11
comment: Paragraph 175, known formally as §175 StGB and also referred to as Section 175 in English, was a provision of the German Criminal Code adopted after the unification of Germany in 1871. Its original purpose was to criminalize sexual acts between men, but it was expanded to include sexual acts between women in 1907. A repeal was attempted in 1929, but the Nazi Party prevented implementation of the repeal. Nazi expansion of Paragraph 175 resulted in those convicted under the provision being put in concentration camps. After WWII, the statute was used to keep LGBTQ+ people in concentration camps imprisoned. East Germany abolished Paragraph 175 in 1950, while West Germany retained and continued prosecutions. It was eliminated during the reconciliation of East and West German legal codes in 1994.
alternative label: Section 175
broader: Criminalization of homosexuality
change note: Version 4.2.0
has top concept: Law
in scheme: v4

Romani lesbians
type: Concept
issued: 2026-02-23
modified: 2026-02-23
comment: Lesbians who are Romani or descend from this traditionally nomadic Indo-European people; only use to refer to people who self-identify as Romani.
change note: Version 4.2.0
in scheme: v4

Romani gay men
type: Concept
issued: 2026-02-23
modified: 2026-02-23
comment: Gay men who are Romani or descend from this traditionally nomadic Indo-European people; only use to refer to people who self-identify as Romani.
change note: Version 4.2.0
in scheme: v4

Lesbian academic journals
type: Concept
issued: 2026-02-23
modified: 2026-02-23
comment: Academic journals focusing on lesbian identities, issues, or culture(s).
broader: LGBTQ+ academic journals
change note: Version 4.2.0
has top concept: LGBTQ+ periodicals
in scheme: v4

Gay academic journals
type: Concept
issued: 2026-02-23
modified: 2026-02-23
comment: Academic journals focusing on gay men's identities, issues, or culture(s).
broader: LGBTQ+ academic journals
change note: Version 4.2.0
has top concept: LGBTQ+ periodicals
in scheme: v4

Bisexual academic journals
type: Concept
issued: 2026-02-23
modified: 2026-02-23
comment: Academic journals focusing on bisexual identities, issues, or culture(s).
alternative label: Bi academic journals
broader: LGBTQ+ academic journals
change note: Version 4.2.0
has top concept: LGBTQ+ periodicals
in scheme: v4

Transgender academic journals
type: Concept
issued: 2026-02-23
modified: 2026-02-23
comment: Academic journals focusing on transgender identities, issues, or culture(s).
alternative label: Trans academic journals
broader: LGBTQ+ academic journals
change note: Version 4.2.0
has top concept: LGBTQ+ periodicals
in scheme: v4

Queer academic journals
type: Concept
issued: 2026-02-23
modified: 2026-02-23
comment: Academic journals focusing on queer identities, issues, or culture(s).
broader: LGBTQ+ academic journals
change note: Version 4.2.0
has top concept: LGBTQ+ periodicals
in scheme: v4

Intersex academic journals
type: Concept
issued: 2026-02-23
modified: 2026-02-23
comment: Academic journals focusing on intersex identities, issues, or culture(s).
broader: LGBTQ+ academic journals
change note: Version 4.2.0
has top concept: LGBTQ+ periodicals
in scheme: v4

Asexual academic journals
type: Concept
issued: 2026-02-23
modified: 2026-02-23
comment: Academic journals focusing on asexual identities, issues, or culture(s).
alternative label: Ace academic journals
broader: LGBTQ+ academic journals
change note: Version 4.2.0
has top concept: LGBTQ+ periodicals
in scheme: v4

Non-binary academic journals
type: Concept
issued: 2026-02-23
modified: 2026-02-26
comment: Academic journals focusing on non-binary identities, issues, or culture(s).
alternative label: Nonbinary academic journals
broader: LGBTQ+ academic journals
change note: Version 4.2.0
has top concept: LGBTQ+ periodicals
in scheme: v4

Non-binary podcasts
type: Concept
issued: 2026-02-23
modified: 2026-02-23
comment: A recorded series (primarily in audio, but sometimes with a video component) with recurring hosts that feature content about non-binary people and/or non-binary issues and that are available digitally for streaming or download. Podcasts are typically episodic and may feature different guests.
alternative label: Nonbinary podcasts
broader: LGBTQ+ podcasts
change note: Version 4.2.0
has top concept: LGBTQ+ podcasts
in scheme: v4

Intersex podcasts
type: Concept
issued: 2026-02-23
modified: 2026-02-23
comment: A recorded series (primarily in audio, but sometimes with a video component) with recurring hosts that feature content about intersex people and/or intersex issues and that are available digitally for streaming or download. Podcasts are typically episodic and may feature different guests.
broader: LGBTQ+ podcasts
change note: Version 4.2.0
has top concept: LGBTQ+ podcasts
in scheme: v4

Interviews with non-binary people
type: Concept
issued: 2026-02-23
modified: 2026-02-23
comment: Structured conversations in which one participant asks questions and the other(s) provide answers. Use to refer to interviews with non-binary subjects recorded in print, radio, television, etc.
alternative label: Interviews with nonbinary people
broader: Interviews with LGBTQ+ people
change note: Version 4.2.0
has top concept: Interviews with LGBTQ+ people
in scheme: v4

Canadian lesbians
type: Concept
issued: 2026-02-23
modified: 2026-02-23
comment: Lesbians who were born, raised, or currently reside in Canada, or who hold Canadian citizenship. Only use to describe people who self-identify as Canadian and lesbian.
alternative label: Lesbian Canadians
broader: Canadian LGBTQ+ people
change note: Version 4.2.0
has top concept: LGBTQ+ people
in scheme: v4

Canadian gay men
type: Concept
issued: 2026-02-23
modified: 2026-02-23
comment: Gay men who were born, raised, or currently reside in Canada, or who hold Canadian citizenship. Only use to describe people who self-identify as Canadian and gay.
alternative label: Gay Canadian men
alternative label: Gay Canadians
broader: Canadian LGBTQ+ people
change note: Version 4.2.0
has top concept: LGBTQ+ people
in scheme: v4

Canadian bisexual people
type: Concept
issued: 2026-02-23
modified: 2026-02-23
comment: Bisexual people who were born, raised, or currently reside in Canada, or who hold Canadian citizenship. Only use to describe people who self-identify as Canadian and bisexual.
alternative label: Bisexual Canadian people
alternative label: Bi Canadian people
alternative label: Bisexual Canadians
alternative label: Bi Canadians
broader: Canadian LGBTQ+ people
change note: Version 4.2.0
has top concept: LGBTQ+ people
in scheme: v4

Canadian transgender people
type: Concept
issued: 2026-02-23
modified: 2026-02-23
comment: Transgender people who were born, raised, or currently reside in Canada, or who hold Canadian citizenship. Only use to describe people who self-identify as Canadian and transgender.
alternative label: Transgender Canadian people
alternative label: Transgender Canadians
alternative label: Trans Canadian people
alternative label: Trans Canadians
broader: Canadian LGBTQ+ people
change note: Version 4.2.0
has top concept: LGBTQ+ people
in scheme: v4

Canadian queer people
type: Concept
issued: 2026-02-23
modified: 2026-02-23
comment: Queer people who were born, raised, or currently reside in Canada, or who hold Canadian citizenship. Only use to describe people who self-identify as Canadian and queer.
alternative label: Queer Canadians
alternative label: Queer Canadian people
broader: Canadian LGBTQ+ people
change note: Version 4.2.0
has top concept: LGBTQ+ people
in scheme: v4

Canadian non-binary people
type: Concept
issued: 2026-02-23
modified: 2026-02-23
comment: Non-binary people who were born, raised, or currently reside in Canada, or who hold Canadian citizenship. Only use to describe people who self-identify as Canadian and non-binary.
alternative label: Non-binary Canadian people
alternative label: Non-binary Canadians
alternative label: Nonbinary Canadian people
alternative label: Nonbinary Canadians
alternative label: Canadian nonbinary people
broader: Canadian LGBTQ+ people
change note: Version 4.2.0
has top concept: LGBTQ+ people
in scheme: v4

Canadian intersex people
type: Concept
issued: 2026-02-23
modified: 2026-02-23
comment: Intersex people who were born, raised, or currently reside in Canada, or who hold Canadian citizenship. Only use to describe people who self-identify as Canadian and intersex.
alternative label: Intersex Canadians
alternative label: Intersex Canadian people
broader: Canadian LGBTQ+ people
change note: Version 4.2.0
has top concept: LGBTQ+ people
in scheme: v4

Canadian asexual people
type: Concept
issued: 2026-02-23
modified: 2026-02-23
comment: Asexual people who were born, raised, or currently reside in Canada, or who hold Canadian citizenship. Only use to describe people who self-identify as Canadian and asexual.
alternative label: Asexual Canadians
alternative label: Asexual Canadian people
alternative label: Ace Canadians
alternative label: Ace Canadian people
broader: Canadian LGBTQ+ people
change note: Version 4.2.0
has top concept: LGBTQ+ people
in scheme: v4

Canadian aromantic people
type: Concept
issued: 2026-02-23
modified: 2026-02-23
comment: Aromantic people who were born, raised, or currently reside in Canada, or who hold Canadian citizenship. Only use to describe people who self-identify as Canadian and aromantic.
alternative label: Aromantic Canadian people
alternative label: Aromantic Canadians
alternative label: Aro Canadian people
alternative label: Aro Canadians
broader: Canadian LGBTQ+ people
change note: Version 4.2.0
has top concept: LGBTQ+ people
in scheme: v4

Gay shepherds
type: Concept
issued: 2026-02-24
modified: 2026-02-24
comment: Gay men who tend sheep.
broader: LGBTQ+ shepherds
change note: Version 4.2.0
has top concept: LGBTQ+ people
in scheme: v4

Lesbian shepherds
type: Concept
issued: 2026-02-24
modified: 2026-02-24
comment: Lesbians who tend sheep.
broader: LGBTQ+ shepherds
change note: Version 4.2.0
has top concept: LGBTQ+ people
in scheme: v4

Bisexual shepherds
type: Concept
issued: 2026-02-24
modified: 2026-02-24
comment: Bisexual people who tend sheep.
alternative label: Bi shepherds
broader: LGBTQ+ shepherds
change note: Version 4.2.0
has top concept: LGBTQ+ people
in scheme: v4

Transgender shepherds
type: Concept
issued: 2026-02-24
modified: 2026-02-24
comment: Transgender people who tend sheep.
alternative label: Trans shepherds
broader: LGBTQ+ shepherds
change note: Version 4.2.0
has top concept: LGBTQ+ people
in scheme: v4

Queer shepherds
type: Concept
issued: 2026-02-24
modified: 2026-02-24
comment: Queer people who tend sheep.
broader: LGBTQ+ shepherds
change note: Version 4.2.0
has top concept: LGBTQ+ people
in scheme: v4

Non-binary shepherds
type: Concept
issued: 2026-02-24
modified: 2026-02-27
comment: Non-binary people who tend sheep.
alternative label: Nonbinary shepherds
broader: LGBTQ+ shepherds
change note: Version 4.2.0
has top concept: LGBTQ+ people
in scheme: v4

Intersex shepherds
type: Concept
issued: 2026-02-24
modified: 2026-02-24
comment: Intersex people who tend sheep.
broader: LGBTQ+ shepherds
change note: Version 4.2.0
has top concept: LGBTQ+ people
in scheme: v4

Asexual shepherds
type: Concept
issued: 2026-02-24
modified: 2026-02-24
comment: Asexual people who tend sheep.
alternative label: Ace shepherds
broader: LGBTQ+ shepherds
change note: Version 4.2.0
has top concept: LGBTQ+ people
in scheme: v4

Lesbian cattle herders
type: Concept
issued: 2026-02-24
modified: 2026-02-24
comment: Lesbians who tend cattle.
broader: LGBTQ+ cattle herders
change note: Version 4.2.0
has top concept: LGBTQ+ people
in scheme: v4

Gay cattle herders
type: Concept
issued: 2026-02-24
modified: 2026-02-24
comment: Gay men who tend cattle.
broader: LGBTQ+ cattle herders
change note: Version 4.2.0
has top concept: LGBTQ+ people
in scheme: v4

Bisexual cattle herders
type: Concept
issued: 2026-02-24
modified: 2026-02-24
comment: Bisexual people who tend cattle.
alternative label: Bi cattle herders
broader: LGBTQ+ cattle herders
change note: Version 4.2.0
has top concept: LGBTQ+ people
in scheme: v4

Transgender cattle herders
type: Concept
issued: 2026-02-24
modified: 2026-02-24
comment: Transgender people who tend cattle.
alternative label: Trans cattle herders
broader: LGBTQ+ cattle herders
change note: Version 4.2.0
has top concept: LGBTQ+ people
in scheme: v4

Queer cattle herders
type: Concept
issued: 2026-02-24
modified: 2026-02-24
comment: Queer people who tend cattle.
broader: LGBTQ+ cattle herders
change note: Version 4.2.0
has top concept: LGBTQ+ people
in scheme: v4

Non-binary cattle herders
type: Concept
issued: 2026-02-24
modified: 2026-02-27
comment: Non-binary people who tend cattle.
alternative label: Nonbinary cattle herders
broader: LGBTQ+ cattle herders
change note: Version 4.2.0
has top concept: LGBTQ+ people
in scheme: v4

Intersex cattle herders
type: Concept
issued: 2026-02-24
modified: 2026-02-24
comment: Intersex people who tend cattle.
broader: LGBTQ+ cattle herders
change note: Version 4.2.0
has top concept: LGBTQ+ people
in scheme: v4

Asexual cattle herders
type: Concept
issued: 2026-02-24
modified: 2026-02-24
comment: Asexual people who tend cattle.
alternative label: Ace cattle herders
broader: LGBTQ+ cattle herders
change note: Version 4.2.0
has top concept: LGBTQ+ people
in scheme: v4

Interracial LGBTQ+ marriage
type: Concept
issued: 2026-02-24
modified: 2026-02-24
comment: Marriages between LGBTQ+ people who do not identify with the same race or racialized ethnicity. Only use for marriages in which the individuals identify as being in an interracial LGBTQ+ marriage.
alternative label: Mixed-race LGBTQ+ marriage
broader: Marriage
change note: Version 4.2.0
has top concept: Living arrangements
in scheme: v4

Non-binary victims of bullying
type: Concept
issued: 2026-02-24
modified: 2026-02-24
comment: Non-binary people who have experienced bullying due to their gender identity and may or may not have survived; follow the individual's preference for "victims" or "survivors" whenever possible.
alternative label: Nonbinary victims of bullying
broader: LGBTQ+ victims of bullying
change note: Version 4.2.0
has top concept: LGBTQ+ people
in scheme: v4

Non-binary libraries
type: Concept
issued: 2026-02-24
modified: 2026-02-24
comment: Libraries that hold materials primarily pertaining to non-binary people or intended for use by non-binary people.
alternative label: Nonbinary libraries
broader: LGBTQ+ libraries
change note: Version 4.2.0
has top concept: LGBTQ+ cultural heritage institutions
in scheme: v4

Interviews with non-binary people
type: Concept
issued: 2026-02-24
modified: 2026-02-24
comment: Structured conversations in which one participant asks questions and the other(s) provide answers. Use to refer to interviews with non-binary subjects recorded in print, radio, television, etc.
alternative label: Interviews with nonbinary people
alternative label: Non-binary interview
alternative label: Nonbinary interviews
broader: Interviews with LGBTQ+ people
change note: Version 4.2.0
has top concept: Interviews with LGBTQ+ people
in scheme: v4

Gay police officers
type: Concept
issued: 2026-02-24
modified: 2026-02-24
comment: Gay men who are members of a police force.
alternative label: Gay cops
broader: LGBTQ+ police officers
change note: Version 4.2.0
has top concept: LGBTQ+ people
in scheme: v4

Lesbian police officers
type: Concept
issued: 2026-02-24
modified: 2026-02-24
comment: Lesbians who are members of a police force.
alternative label: Lesbian cops
broader: LGBTQ+ police officers
change note: Version 4.2.0
has top concept: LGBTQ+ people
in scheme: v4

Bisexual police officers
type: Concept
issued: 2026-02-24
modified: 2026-02-24
comment: Bisexual people who are members of a police force.
alternative label: Bi police officers
alternative label: Bisexual cops
alternative label: Bi cops
broader: LGBTQ+ police officers
change note: Version 4.2.0
has top concept: LGBTQ+ people
in scheme: v4

Asexual police officers
type: Concept
issued: 2026-02-24
modified: 2026-02-24
comment: Asexual people who are members of a police force.
alternative label: Ace police officers
alternative label: Ace cops
broader: LGBTQ+ police officers
change note: Version 4.2.0
has top concept: LGBTQ+ people
in scheme: v4

Intersex police officers
type: Concept
issued: 2026-02-24
modified: 2026-02-24
comment: Intersex people who are members of a police force.
alternative label: Intersex cops
broader: LGBTQ+ police officers
change note: Version 4.2.0
has top concept: LGBTQ+ people
in scheme: v4

Non-binary police officers
type: Concept
issued: 2026-02-24
modified: 2026-02-24
comment: Non-binary people who are members of a police force.
alternative label: Nonbinary police officers
alternative label: Non-binary cops
alternative label: Nonbinary cops
broader: LGBTQ+ police officers
change note: Version 4.2.0
has top concept: LGBTQ+ people
in scheme: v4

Transgender police officers
type: Concept
issued: 2026-02-24
modified: 2026-02-24
comment: Transgender people who are members of a police force.
alternative label: Transgender cops
alternative label: Trans police officers
alternative label: Trans cops
broader: LGBTQ+ police officers
change note: Version 4.2.0
has top concept: LGBTQ+ people
in scheme: v4

Queer police officers
type: Concept
issued: 2026-02-24
modified: 2026-02-24
comment: Queer people who are members of a police force.
alternative label: Queer cops
broader: LGBTQ+ police officers
change note: Version 4.2.0
has top concept: LGBTQ+ people
in scheme: v4

Gay composers
type: Concept
issued: 2026-02-24
modified: 2026-02-24
comment: Gay men who create and arrange original music.
broader: LGBTQ+ composers
change note: Version 4.2.0
has top concept: LGBTQ+ people
in scheme: v4

Lesbian composers
type: Concept
issued: 2026-02-24
modified: 2026-02-24
comment: Lesbians who create and arrange original music.
broader: LGBTQ+ composers
change note: Version 4.2.0
has top concept: LGBTQ+ people
in scheme: v4

Bisexual composers
type: Concept
issued: 2026-02-24
modified: 2026-02-24
comment: Bisexual people who create and arrange original music.
alternative label: Bi composers
broader: LGBTQ+ composers
change note: Version 4.2.0
has top concept: LGBTQ+ people
in scheme: v4

Asexual composers
type: Concept
issued: 2026-02-24
modified: 2026-02-24
comment: Asexual people who create and arrange original music.
alternative label: Ace composers
broader: LGBTQ+ composers
change note: Version 4.2.0
has top concept: LGBTQ+ people
in scheme: v4

Intersex composers
type: Concept
issued: 2026-02-24
modified: 2026-02-24
comment: Intersex people who create and arrange original music.
broader: LGBTQ+ composers
change note: Version 4.2.0
has top concept: LGBTQ+ people
in scheme: v4

Non-binary composers
type: Concept
issued: 2026-02-24
modified: 2026-02-24
comment: Non-binary people who create and arrange original music.
alternative label: Nonbinary composers
broader: LGBTQ+ composers
change note: Version 4.2.0
has top concept: LGBTQ+ people
in scheme: v4

Transgender composers
type: Concept
issued: 2026-02-24
modified: 2026-02-24
comment: Transgender people who create and arrange original music.
alternative label: Trans composers
broader: LGBTQ+ composers
change note: Version 4.2.0
has top concept: LGBTQ+ people
in scheme: v4

Queer composers
type: Concept
issued: 2026-02-24
modified: 2026-02-24
comment: Queer people who create and arrange original music.
broader: LGBTQ+ composers
change note: Version 4.2.0
has top concept: LGBTQ+ people
in scheme: v4

Gay architects
type: Concept
issued: 2026-03-03
modified: 2026-03-03
comment: Gay men who professionally design buildings and are qualified to plan and supervise their construction.
broader: LGBTQ+ architects
change note: Version 4.2.0
has top concept: LGBTQ+ people
in scheme: v4

Lesbian architects
type: Concept
issued: 2026-03-03
modified: 2026-03-03
comment: Lesbians who professionally design buildings and are qualified to plan and supervise their construction.
broader: LGBTQ+ architects
change note: Version 4.2.0
has top concept: LGBTQ+ people
in scheme: v4

Bisexual architects
type: Concept
issued: 2026-03-03
modified: 2026-03-03
comment: Bisexual people who professionally design buildings and are qualified to plan and supervise their construction.
alternative label: Bi architects
broader: LGBTQ+ architects
change note: Version 4.2.0
has top concept: LGBTQ+ people
in scheme: v4

Intersex architects
type: Concept
issued: 2026-03-03
modified: 2026-03-03
comment: Intersex people who professionally design buildings and are qualified to plan and supervise their construction.
broader: LGBTQ+ architects
change note: Version 4.2.0
has top concept: LGBTQ+ people
in scheme: v4

Asexual architects
type: Concept
issued: 2026-03-03
modified: 2026-03-03
comment: Asexual people who professionally design buildings and are qualified to plan and supervise their construction.
alternative label: Ace architects
broader: LGBTQ+ architects
change note: Version 4.2.0
has top concept: LGBTQ+ people
in scheme: v4

Non-binary architects
type: Concept
issued: 2026-03-03
modified: 2026-03-03
comment: Non-binary people who professionally design buildings and are qualified to plan and supervise their construction.
alternative label: Nonbinary architects
broader: LGBTQ+ architects
change note: Version 4.2.0
has top concept: LGBTQ+ people
in scheme: v4

Transgender architects
type: Concept
issued: 2026-03-03
modified: 2026-03-03
comment: Transgender people who professionally design buildings and are qualified to plan and supervise their construction.
alternative label: Trans architects
broader: LGBTQ+ architects
change note: Version 4.2.0
has top concept: LGBTQ+ people
in scheme: v4

Queer architects
type: Concept
issued: 2026-03-03
modified: 2026-03-03
comment: Queer people who professionally design buildings and are qualified to plan and supervise their construction.
broader: LGBTQ+ architects
change note: Version 4.2.0
has top concept: LGBTQ+ people
in scheme: v4

Sex shops
type: Concept
issued: 2019-05-14
modified: 2025-02-23
replaces: sexShops
comment: Retailers that sell products related to sex and sexual entertainment, including sex toys, lingerie, pornography, and other related products.
alternative label: Adult entertainment stores
alternative label: Adult shops
alternative label: Adult stores
alternative label: Erotic shops
alternative label: Erotic stores
alternative label: Porn stores
alternative label: Porn shops
alternative label: Sex stores
alternative label: Adult entertainment shops
alternative label: Tiendas de entretenimiento adulto
broader: Sex industry
change note: Version 4.2.0
has top concept: Sex industry
in scheme: v3
preferred label: Tiendas sexuales
related: Sex accessories

Sex cinemas
type: Concept
issued: 2019-05-14
modified: 2025-02-23
replaces: sexCinemas
comment: Movie theatres that primarily show pornographic films. Patrons engaging in nudity and public masturbation or sex may be explicitly permitted by the theatre or merely tolerated.
comment: Cines que proyectan principalmente películas pornográficas. El teatro puede permitir explícitamente o simplemente tolerar que los espectadores se desnuden o se masturben o practiquen sexo en público.
alternative label: Adult movie theatres
alternative label: Adult cinemas
alternative label: Adult movie theaters
alternative label: Erotic cinemas
alternative label: Erotic theaters
alternative label: Erotic theatres
alternative label: Sex theaters
alternative label: Sex theatres
alternative label: Cines de películas para adultos
alternative label: Cines porno
broader: Sex industry
change note: Version 4.2.0
has top concept: Sex industry
in scheme: v3
preferred label: Cines de sexo
related: LGBTQ+ porn films

AIDS information centers
type: Concept
issued: 2019-05-14
modified: 2025-02-23
replaces: AIDSInformationCentres
comment: Institutions dedicated to education, prevention, and treatment of HIV/AIDS; AIDS information centers often provide services like HIV counseling and testing services.
comment: Instituciones dedicadas a la educación, la prevención y el tratamiento del VIH/SIDA; los centros de información sobre el SIDA suelen ofrecer servicios como asesoramiento y pruebas de VIH.
broader: LGBTQ+ information centers
change note: Version 4.2.0
has top concept: LGBTQ+ centers
in scheme: v3
preferred label: Centros de información sobre el SIDA
preferred label: AIDS information centres
related: HIV/AIDS

ARC (AIDS-Related Complex)
type: Concept
issued: 2019-05-14
modified: 2025-02-23
replaces: ARC
comment: Abbreviation for AIDS-related complex, a term used early in the AIDS epidemic to describe people with symptomatic HIV infections who have not been formally diagnosed with AIDS. Since 2000, clinical use of the term has been largely discontinued.
comment: Abreviatura del complejo relacionado al SIDA, término utilizado a principios de la epidemia del SIDA para describir a personas con infecciones sintomáticas de VIH que no fueron diagnosticadas formalmente con SIDA. Desde 2000, en gran medida, el uso clínico del término fue abandonado.
alternative label: AIDS Related Complex
alternative label: ARC
alternative label: CRA
broader: HIV/AIDS
change note: Version 4.2.0
has top concept: STDs
in scheme: v3
preferred label: CRA (Complejo relacionado al SIDA)
related: Kaposi's sarcoma

Akava'ine
type: Concept
issued: 2019-05-14
modified: 2025-02-23
replaces: akavaine
comment: A Cook Islands Māori word referring to transgender people of Māori descent from the Cook Islands.
comment: Una palabra maorí de las Islas Cook que se refiere a las personas transgénero de ascendencia maorí de las Islas Cook.
broader: Non-Euro-American gender and sexual identities
broader: MVPFAFF+
change note: Version 4.2.0
has top concept: Gender
in scheme: v3

Ali
type: Concept
issued: 2019-05-14
modified: 2025-02-23
replaces: ali
comment: Tamil slur for effeminate gay man; directly translates to hermaphrodite.
comment: Insulto tamil para un hombre gay afeminado; se traduce como hermafrodita.
broader: Non-Euro-American gender and sexual identities
broader: Slurs
change note: Version 4.2.0
has top concept: Gender
in scheme: v3

Amazons
type: Concept
issued: 2019-05-14
modified: 2025-02-23
replaces: amazons
comment: Nation of all-female warriors in Greek mythology and Classical antiquity; from the Early Modern period, their name has become a term for woman warriors in general as well as a cultural symbol invoked in lesbian communities.
comment: Nación de guerreras exclusivamente mujeres en la mitología griega y la antigüedad clásica. Desde el período moderno temprano, su nombre se ha convertido en un término para las mujeres guerreras en general, así como en un símbolo cultural invocado en las comunidades lesbianas.
broader: Females
change note: Version 4.2.0
has top concept: Gender
in scheme: v3
preferred label: Amazonas
related: Lesbians

Anal beads
type: Concept
issued: 2019-05-14
modified: 2025-02-23
replaces: analBeads
comment: A sex toy used in anal play that consists of multiple attached spheres (or balls) that are continuously inserted through the anus into the rectum and then removed with varying speeds.
comment: Un juguete sexual utilizado para el juego anal, que consta de múltiples esferas (o bolas) adheridas que se insertan continuamente a través del ano hasta el recto y luego son removidas a diferentes velocidades.
alternative label: Cuentas anales
alternative label: Bolas anales
broader: Sex accessories
change note: Version 4.2.0
has top concept: Sex accessories
in scheme: v3
preferred label: Perlas anales
related: Anal play

Anti-bisexual discrimination
type: Concept
issued: 2019-05-14
modified: 2025-02-23
replaces: antiBisexualDiscrimination
comment: The unjust or prejudicial treatment of bisexual people due to their sexual identity; may include the denial of legal rights, employment, and housing.
comment: El trato injusto o perjudicial hacia personas bisexuales por su identidad sexual; puede incluir la negación de derechos legales, empleo y vivienda.
broader: LGBTQ+ discrimination
change note: Version 4.2.0
has top concept: LGBTQ+ discrimination
in scheme: v3
preferred label: Discriminación anti-bisexual
related: Biphobia

Anti-gay discrimination
type: Concept
issued: 2019-05-14
modified: 2025-02-23
replaces: antiGayDiscrimination
comment: The unjust or prejudicial treatment of gay men due to their sexual identity; may include the denial of legal rights, employment, and housing.
comment: El trato injusto o perjudicial hacia hombres gay por su identidad sexual; puede incluir la negación de derechos legales, empleo y vivienda.
broader: LGBTQ+ discrimination
change note: Version 4.2.0
has top concept: LGBTQ+ discrimination
in scheme: v3
preferred label: Discriminación anti-gay
related: Homophobia

Anti-lesbian discrimination
type: Concept
issued: 2019-05-14
modified: 2025-02-23
replaces: antiLesbianDiscrimination
comment: The unjust or prejudicial treatment of lesbians due to their sexual identity; may include the denial of legal rights, employment, and housing.
comment: El trato injusto o perjudicial hacia las lesbianas por su identidad sexual; puede incluir la negación de derechos legales, empleo y vivienda.
broader: LGBTQ+ discrimination
change note: Version 4.2.0
has top concept: LGBTQ+ discrimination
in scheme: v3
preferred label: Discriminación anti-lesbiana
related: Lesbophobia

Anti-queer discrimination
type: Concept
issued: 2019-05-14
modified: 2025-02-23
replaces: antiQueerDiscrimination
comment: The unjust or prejudicial treatment of queer people due to their identity; may include the denial of legal rights, employment, and housing.
comment: El trato injusto o perjudicial hacia las personas queer por su identidad; puede incluir la negación de derechos legales, empleo y vivienda.
broader: LGBTQ+ discrimination
change note: Version 4.2.0
has top concept: LGBTQ+ discrimination
in scheme: v3
preferred label: Discriminación anti-queer
related: Queerphobia

Autoeroticism
type: Concept
issued: 2019-05-14
modified: 2025-02-23
replaces: autoeroticism
comment: Practice of sexually stimulating oneself.
comment: Práctica de estimularse sexualmente.
change note: Version 4.2.0
in scheme: v3
preferred label: Autoerotismo
related: Masturbation

Bading
type: Concept
issued: 2019-05-14
modified: 2025-02-23
replaces: bading
comment: Derogatory Filipino term referring to gay men who crossdress.
comment: Término filipino despectivo que se refiere a los hombres gay que se transforman.
broader: Non-Euro-American gender and sexual identities
broader: Slurs
change note: Version 4.2.0
has top concept: Gender
in scheme: v3

Ballgags
type: Concept
issued: 2019-05-14
modified: 2025-02-23
replaces: ballgags
comment: Silicone, rubber, or other types of balls that are strapped in a person’s mouth to prevent them from speaking, typically during sex.
comment: Pelotas de silicona, goma u otros materiales atadas a la boca de una persona para impedirle hablar, usualmente durante el sexo.
alternative label: Mordazas de boca
broader: Sex accessories
change note: Version 4.2.0
has top concept: Sex accessories
in scheme: v3
preferred label: Mordazas

Bantut
type: Concept
issued: 2019-05-14
modified: 2025-02-23
replaces: bantut
comment: Filipino term for gay men who assume the clothes and/or mannerisms of women.
comment: Término filipino para referirse a un hombre gay que adopta la vestimenta y/o los gestos de una mujer.
broader: Non-Euro-American gender and sexual identities
broader: Slurs
change note: Version 4.2.0
has top concept: Gender
in scheme: v3

Afro-Canadian bisexual people
type: Concept
issued: 2019-05-14
modified: 2025-02-23
replaces: bisexualAfroCanadians
comment: Bisexual people of African descent born in Canada or bisexual people born in African countries who live in or have a strong connection to Canada. Use for individuals who self-identify as Afro-Canadian.
comment: Personas bisexuales de ascendencia africana nacidas en Canadá o personas bisexuales nacidas en países africanos que viven o tienen una conexión fuerte con Canadá. Utilícese para personas que se autoidentifiquen como afrocanadienses.
alternative label: Bisexual Afro-Canadian people
alternative label: Bisexual Afro-Canadians
alternative label: Afrocanadienses bisexuales
alternative label: Bisexuales afrocanadienses
broader: Afro-Canadian LGBTQ+ people
broader: Black bisexual people
change note: Version 4.2.0
has top concept: LGBTQ+ people
in scheme: v3
preferred label: Personas bisexuales afrocanadienses

Afro-Caribbean bisexual people
type: Concept
issued: 2019-05-14
modified: 2025-02-23
replaces: bisexualAfroCaribbeans
comment: Bisexual people of African descent born in the Caribbean or bisexual people born in African countries who live in or have a strong connection to the Caribbean. Only use for individuals who self-identify as Afro-Caribbean.
comment: Personas bisexuales de ascendencia africana nacidas en el Caribe o personas bisexuales nacidas en países africanos que viven o tienen una conexión fuerte con el Caribe. Utilícese únicamente para personas que se identifiquen como afrocaribeñas.
alternative label: Bisexual Afro-Caribbean people
alternative label: Bisexual Afro-Caribbeans
alternative label: Personas afrocaribeñas bisexuales
alternative label: Afrocaribeños bisexuales
alternative label: Afrocaribeñas bisexuales
broader: Afro-Caribbean LGBTQ+ people
broader: Black bisexual people
change note: Version 4.2.0
has top concept: LGBTQ+ people
in scheme: v3
preferred label: Personas bisexuales afrocaribeñas

Afro-European bisexual people
type: Concept
issued: 2019-05-14
modified: 2025-02-23
replaces: bisexualAfroEuropeans
comment: Bisexual people of African descent born in European countries or bisexual people born in African countries who live in or have a strong connection to Europe. Only use for individuals who self-identify as Afro-European.
comment: Personas bisexuales de ascendencia africana nacidas en países europeos o personas bisexuales nacidas en países africanos que viven o tienen una conexión fuerte con Europa. Utilícese únicamente para personas que se identifiquen como afroeuropeas.
alternative label: Bisexual Afro-European people
alternative label: Bisexual Afro-Europeans
alternative label: Personas afroeuropeas bisexuales
alternative label: Afroeuropeos bisexuales
alternative label: Afroeuropeas bisexuales
broader: Afro-European LGBTQ+ people
broader: Black bisexual people
change note: Version 4.2.0
has top concept: LGBTQ+ people
in scheme: v3
preferred label: Personas bisexuales afroeuropeas

Afro-Latin American bisexual people
type: Concept
issued: 2019-05-14
modified: 2025-02-23
replaces: bisexualAfroLatinAmericans
comment: Bisexual people of African descent born in Latin American countries or bisexual people born in African countries who live in or have a strong connection to Latin America. Only use for individuals who self-identify as Afro-Latin American.
comment: Personas bisexuales afrodescendientes nacidas en países latinoamericanos o personas bisexuales nacidas en países africanos que viven o tienen una fuerte conexión con América Latina. Utilícese únicamente para personas que se identifiquen como afrolatinoamericanas.
alternative label: Bisexual Afro-Latin Americans
alternative label: Personas afrolatinoamericanas bisexuales
alternative label: Afrolatinoamericanos bisexuales
alternative label: Afrolatinoamericanas bisexuales
broader: Afro-Latin American LGBTQ+ people
broader: Black bisexual people
change note: Version 4.2.0
has top concept: LGBTQ+ people
in scheme: v3
preferred label: Personas bisexuales afrolatinoamericanas

Asian American bisexual people
type: Concept
issued: 2019-05-14
modified: 2025-02-23
replaces: bisexualAsianAmericans
comment: Bisexual people of Asian heritage or descent born in the United States or born in Asian countries who live in or have a strong connection to the United States. Only use for individuals who self-identify as Asian American.
comment: Personas bisexuales de herencia o ascendencia asiática nacidas en Estados Unidos o personas bisexuales nacidas en países asiáticos que viven en o tienen una conexión fuerte con los Estados Unidos. Utilícese para personas que se autoidentifiquen como asiático-americanas.
alternative label: Bisexual Asian American people
alternative label: Bisexual Asian Americans
alternative label: Personas asiático-americanas bisexuales
alternative label: Asiático-americanos bisexuales
alternative label: Asiático-americanas bisexuales
broader: Asian American LGBTQ+ people
broader: Asian bisexual people
change note: Version 4.2.0
has top concept: LGBTQ+ people
in scheme: v3
preferred label: Personas bisexuales asiático-americanas

Asian bisexual people
type: Concept
issued: 2019-05-14
modified: 2025-02-23
replaces: bisexualAsians
comment: Bisexual people of Asian heritage or descent, living in Asia or part of the Asian diaspora. Only use for people who self-identify as Asian.
comment: Personas bisexuales nacidas en países asiáticos o descendientes de ellos. Utilícese únicamente para personas que se autoidentifiquen como asiáticas.
alternative label: Bisexual Asian people
alternative label: Bisexual Asians
alternative label: Personas asiáticas bisexuales
alternative label: Asiáticos bisexuales
alternative label: Asiáticas bisexuales
broader: Asian LGBTQ+ people
change note: Version 4.2.0
has top concept: LGBTQ+ people
in scheme: v3
narrower: Asian American bisexual people
preferred label: Personas bisexuales asiáticas

Bisexual bars
type: Concept
issued: 2019-05-14
modified: 2026-01-24
replaces: bisexualBars
comment: Drinking establishments that primarily cater to bisexual people.
comment: Establecimientos para beber que atienden principalmente a personas bisexuales.
alternative label: Barras bisexuales
broader: LGBTQ+ bars
change note: Version 4.2.0
has top concept: LGBTQ+ meeting places
in scheme: v3
preferred label: Bares bisexuales
related: Bisexual people

Bisexual beaches
type: Concept
issued: 2019-05-14
modified: 2025-02-23
replaces: bisexualBeaches
comment: Beaches set aside for use by bisexual people or beaches known to be frequented by bisexual people.
comment: Playas reservadas para el uso de personas bisexuales o playas conocidas por ser frecuentadas por personas bisexuales.
broader: LGBTQ+ beaches
change note: Version 4.2.0
has top concept: LGBTQ+ meeting places
in scheme: v3
preferred label: Playas bisexuales
related: Bisexual people

Bisexual bookshops
type: Concept
issued: 2019-05-14
modified: 2025-02-23
replaces: bisexualBookshops
comment: Bookshops that sell materials intended for use by bisexual people or addressing topics related to bisexuality.
comment: Librerías que venden materiales destinados a personas bisexuales o que abordan temas relacionados con la bisexualidad.
broader: LGBTQ+ bookshops
change note: Version 4.2.0
has top concept: LGBTQ+ bookshops
in scheme: v3
preferred label: Librerías bisexuales
related: Bisexual people

Bisexual community centers
type: Concept
issued: 2019-05-14
modified: 2025-02-23
replaces: bisexualCommunityCentres
comment: Spaces in which people from bisexual communities meet for social, education, recreational, or organizing activities.
comment: Espacios en los que personas de comunidades bisexuales se reúnen para actividades sociales, educativas, recreativas u organizativas.
broader: LGBTQ+ community centers
change note: Version 4.2.0
has top concept: LGBTQ+ centers
in scheme: v3
preferred label: Centros comunitarios bisexuales
preferred label: Bisexual community centres
related: Bisexual people

Bisexual couples
type: Concept
issued: 2019-05-14
modified: 2025-02-23
replaces: bisexualCouples
comment: Partnerships in which both people are bisexual.
comment: Relaciones en las que ambas personas son bisexuales.
broader: LGBTQ+ couples
change note: Version 4.2.0
has top concept: Relationship satisfaction
in scheme: v3
preferred label: Parejas bisexuales
related: Bisexual relationships

Mixed-orientation marriage
type: Concept
issued: 2019-05-14
modified: 2026-02-23
replaces: mixed-orientationMarriage
comment: Marriages between individuals who do not share the same sexual orientation (e.g., bisexual-heterosexual marriage, allosexual-asexual marriage).
comment: Matrimonios entre personas que no comparten la misma orientación sexual (por ejemplo, matrimonio bisexual-heterosexual, matrimonio alosexual-asexual).
alternative label: Bisexual marriage
alternative label: Casamiento bisexual
alternative label: Casamiento de orientación mixta
broader: Marriage
change note: Version 4.2.0
has top concept: Living arrangements
in scheme: v3
narrower: Lavender marriages
preferred label: Matrimonio de orientación mixta

Bisexual Pagans
type: Concept
issued: 2019-05-14
modified: 2025-02-23
replaces: bisexualPagans
comment: Bisexual people who are members of polytheistic religions or other religions outside of the dominant culture that typically incorporate nature worship and/or the sacred feminine, such as Wicca, Druidry, Heathenry, etc. Use to describe bisexual people who self-identify as Pagan.
comment: Publicaciones impresas o digitales serializadas sobre la bisexualidad o temas bisexuales (y generalmente producidas por personas u organizaciones bisexuales) que contienen noticias, artículos, columnas, correspondencia y anuncios.
alternative label: Diarios bisexuales
broader: LGBTQ+ Pagans
change note: Version 4.2.0
has top concept: LGBTQ+ African religions
in scheme: v3
preferred label: Periódicos bisexuales
related: Bisexual witches

Parents of bisexual people
type: Concept
issued: 2019-05-14
modified: 2025-02-23
replaces: parentsOfBisexualPeople
comment: People who act as parents to one or more bisexual person. For parents who are themselves bisexual, use the term "Bisexual parents."
comment: Personas que actúan como padres de una o más personas bisexuales. Para padres que son bisexuales, utilice el término "madres y padres bisexuales".
alternative label: Bisexual people’s parents
alternative label: Padres de personas bisexuales
alternative label: Madres de personas bisexuales
broader: Parents of LGBTQ+ people
change note: Version 4.2.0
has top concept: Family members
in scheme: v3
preferred label: Madres y padres de personas bisexuales
related: Bisexual people

Bisexual political activists
type: Concept
issued: 2019-05-14
modified: 2025-02-23
replaces: bisexualPoliticalActivists
comment: Bisexual individuals working to bring about political or social change through public organizing.
comment: Personas bisexuales que tienen condiciones de salud a largo plazo que requieren atención médica continua y/o que impactan o limitan significativamente la vida diaria; algunas, pero no todas, las personas con enfermedades crónicas se consideran discapacitadas.
alternative label: Personas con enfermedades crónicas bisexuales
alternative label: Enfermos crónicos bisexuales
alternative label: Enfermas crónicas bisexuales
broader: LGBTQ+ political activists
change note: Version 4.2.0
has top concept: LGBTQ+ people
in scheme: v3
preferred label: Personas bisexuales con enfermedades crónicas
related: Bisexual activism

Bisexual radio
type: Concept
issued: 2019-05-14
modified: 2026-02-23
replaces: bisexualRadio
comment: Auditory content broadcast on the radio (analog or digital) about bisexuality and bisexual issues.
comment: Personas bisexuales que son miembros de la Iglesia protestante.
broader: LGBTQ+ radio
change note: Version 4.2.0
has top concept: LGBTQ+ radio
in scheme: v3
preferred label: Protestantes bisexuales
related: Bisexual podcasts

Bisexual rights
type: Concept
issued: 2019-05-14
modified: 2025-02-23
replaces: bisexualRights
comment: Legal, social, or ethical principles of freedom or entitlement held by bisexual people.
comment: Contenido auditivo emitido por radio (analógica o digital) sobre la bisexualidad y asuntos bisexuales.
broader: LGBTQ+ civil rights
change note: Version 4.2.0
has top concept: Human rights
in scheme: v3
preferred label: Radio bisexual
related: Bisexual activism

Bisexual survivors of hate crimes
type: Concept
issued: 2019-05-14
modified: 2025-02-23
replaces: bisexualSurvivorsOfHateCrimes
comment: Bisexual people who have experienced and survived hate crimes; follow the individual's preference for "victims" or "survivors" whenever possible.
comment: Campo académico de investigación y estudio sobre la bisexualidad, personas bisexuales y comunidades bisexuales.
broader: Bisexual victims of hate crimes
broader: LGBTQ+ survivors of hate crimes
change note: Version 4.2.0
has top concept: LGBTQ+ people
in scheme: v3
preferred label: Estudios bisexuales

Bisexual survivors of rape
type: Concept
issued: 2019-05-14
modified: 2025-02-23
replaces: bisexualSurvivorsOfRape
comment: Bisexual people who have experienced and survived rape; follow the individual's preference for "victims" or "survivors" whenever possible.
comment: Personas bisexuales que han sufrido y sobrevivido al acoso por su identidad sexual; siga la preferencia del individuo sobre el uso de "víctimas" o "sobrevivientes" siempre que sea posible.
broader: Bisexual victims of rape
broader: LGBTQ+ survivors of rape
change note: Version 4.2.0
has top concept: LGBTQ+ people
in scheme: v3
preferred label: Sobrevivientes bisexuales de acoso

Bisexual survivors of sexual abuse
type: Concept
issued: 2019-05-14
modified: 2025-02-23
replaces: bisexualSurvivorsOfSexualAbuse
comment: Bisexual people who have experienced and survived sexual abuse; follow the individual's preference for "victims" or "survivors" whenever possible.
comment: Personas bisexuales que han sufrido y sobrevivido crímenes de odio; siga la preferencia del individuo sobre el uso de "víctimas" o "sobrevivientes" siempre que sea posible.
broader: Bisexual victims of sexual abuse
broader: LGBTQ+ survivors of sexual abuse
change note: Version 4.2.0
has top concept: LGBTQ+ people
in scheme: v3
preferred label: Sobrevivientes bisexuales de crímenes de odio

Bisexual survivors of war
type: Concept
issued: 2019-05-14
modified: 2025-02-23
replaces: bisexualSurvivorsOfWar
comment: Bisexual people who have experienced and survived war; follow the individual's preference for "victims" or "survivors" whenever possible.
comment: Personas bisexuales que han sufrido y sobrevivido una violación; siga la preferencia del individuo sobre el uso de "víctimas" o "sobrevivientes" siempre que sea posible.
broader: Bisexual victims of war
broader: LGBTQ+ survivors of war
change note: Version 4.2.0
has top concept: LGBTQ+ people
in scheme: v3
preferred label: Sobrevivientes bisexuales de violación

Bisexual television
type: Concept
issued: 2019-05-14
modified: 2025-02-23
replaces: bisexualTelevision
comment: Television shows featuring bisexual characters or themes.
comment: Programas de televisión con personajes o temas bisexuales.
broader: LGBTQ+ television
change note: Version 4.2.0
has top concept: LGBTQ+ television
in scheme: v3
preferred label: Televisión bisexual
related: Bisexual characters

Bisexual theater
type: Concept
issued: 2019-05-14
modified: 2025-02-23
replaces: bisexualTheatre
comment: Works in the performance arts that focus on bisexual characters, communities, or issues.
comment: Trabajos en las artes escénicas que se centran en personajes, comunidades o problemas bisexuales.
broader: LGBTQ+ theater
change note: Version 4.2.0
has top concept: LGBTQ+ theater
in scheme: v3
preferred label: Teatro bisexual
preferred label: Bisexual theatre
related: Bisexual drama

Bisexual victims of hate crimes
type: Concept
issued: 2019-05-14
modified: 2025-02-23
replaces: bisexualVictimsOfHateCrimes
comment: Bisexual people who have experienced hate crimes and may or may not have survived; follow the individual's preference for "victims" or "survivors" whenever possible.
comment: Personas bisexuales que han sufrido crímenes de odio y pueden haber sobrevivido o no; siga la preferencia de la persona sobre el uso de "víctimas" o "sobrevivientes" siempre que sea posible.
broader: LGBTQ+ victims of hate crimes
change note: Version 4.2.0
has top concept: LGBTQ+ people
in scheme: v3
narrower: Bisexual survivors of hate crimes
preferred label: Víctimas bisexuales de crímenes de odio

Bisexual victims of rape
type: Concept
issued: 2019-05-14
modified: 2025-02-23
replaces: bisexualVictimsOfRape
comment: Bisexual people who have experienced rape and may or may not have survived; follow the individual's preference for "victims" or "survivors" whenever possible.
comment: Personas bisexuales que han sufrido una violación y pueden haber sobrevivido o no; siga la preferencia de la persona sobre el uso de "víctimas" o "sobrevivientes" siempre que sea posible.
broader: LGBTQ+ victims of rape
change note: Version 4.2.0
has top concept: LGBTQ+ people
in scheme: v3
narrower: Bisexual survivors of rape
preferred label: Víctimas bisexuales de violación

Bisexual victims of sexual abuse
type: Concept
issued: 2019-05-14
modified: 2025-02-23
replaces: bisexualVictimsOfSexualAbuse
comment: Bisexual people who have experienced sexual abuse and may or may not have survived; follow the individual's preference for "victims" or "survivors" whenever possible.
comment: Personas bisexuales que han sufrido abuso sexual y pueden haber sobrevivido o no; siga la preferencia del individuo sobre el uso de "víctimas" o "sobrevivientes" siempre que sea posible.
broader: LGBTQ+ victims of sexual abuse
change note: Version 4.2.0
has top concept: LGBTQ+ people
in scheme: v3
narrower: Bisexual survivors of sexual abuse
preferred label: Víctimas bisexuales de abuso sexual

Bisexual victims of war
type: Concept
issued: 2019-05-14
modified: 2025-02-23
replaces: bisexualVictimsOfWar
comment: Bisexual people who have experienced war and may or may not have survived; follow the individual's preference for "victims" or "survivors" whenever possible.
comment: Personas bisexuales que han sufrido la guerra y que pueden haber sobrevivido o no; siga la preferencia del individuo sobre el uso de "víctimas" o "sobrevivientes" siempre que sea posible.
broader: LGBTQ+ victims of war
change note: Version 4.2.0
has top concept: LGBTQ+ people
in scheme: v3
narrower: Bisexual survivors of war
preferred label: Víctimas bisexuales de guerra

Bisexual youth literature
type: Concept
issued: 2019-05-14
modified: 2025-02-23
replaces: bisexualYouthLiterature
comment: Written literary works for an audience of readers from 12-18 years of age, also known as young adult literature or YA; use in reference to youth literature focusing on bisexual characters or themes.
comment: Obras literarias escritas para una audiencia de lectores de 12 a 18 años de edad, también conocida como literatura para adultos jóvenes o YA; utilícese en referencia a la literatura juvenil que se centra en personajes o temas bisexuales.
broader: LGBTQ+ youth literature
change note: Version 4.2.0
has top concept: Subcultures
in scheme: v3
preferred label: Literatura juvenil bisexual
related: Bisexual youth

Sex dolls
type: Concept
issued: 2019-05-14
modified: 2025-02-23
replaces: sexDolls
comment: Sex toys designed to mimic parts of or the entirety of the body.
comment: Juguetes sexuales diseñados para imitar partes o la totalidad del cuerpo.
alternative label: Blow up dolls
alternative label: Inflatable dolls
alternative label: Muñecas inflables
broader: Sex accessories
change note: Version 4.2.0
has top concept: Sex accessories
in scheme: v3
preferred label: Muñecas sexuales
related: Inflation (Erotic)

Changing rooms
type: Concept
issued: 2019-05-14
modified: 2025-02-23
replaces: changingRooms
comment: Rooms or areas in public or commercial spaces where people can change their clothes with varying degrees of privacy.
comment: Cuartos o áreas en espacios públicos o comerciales donde las personas pueden cambiarse de ropa con distintos grados de privacidad.
alternative label: Camerines
alternative label: Vestuarios
alternative label: Camarines
broader: Public facilities
change note: Version 4.2.0
has top concept: Public facilities
in scheme: v3
preferred label: Camerinos
related: Bathroom bans

Chest harnesses
type: Concept
issued: 2019-05-14
modified: 2025-02-23
replaces: chestHarnesses
comment: Wearable accessories, typically consisting of leather straps and metal rings or points of attachment, that fit around the chest and shoulders like a vest. May be worn as a fashion statement, to signal one's belonging to the leather or BDSM communities, or to restrict the wearer's movement during sex.
alternative label: Arneses pectorales
broader: Harnesses
change note: Version 4.2.0
has top concept: Sex accessories
in scheme: v3
preferred label: Arneses de pecho

Children's sexuality
type: Concept
issued: 2019-05-14
modified: 2025-02-23
replaces: childrensSexuality
comment: The sexual behavior of children, include children's sense of their sexual orientation.
comment: El comportamiento sexual de los niños, incluyendo el sentido de los niños sobre su orientación sexual.
alternative label: Sexualidad juvenil
broader: Sexuality
change note: Version 4.2.0
has top concept: Sexuality
in scheme: v3
preferred label: Sexualidad infantil
related: Children

Cut men
type: Concept
issued: 2019-05-14
modified: 2025-02-23
replaces: cutMen
comment: Men whose penises are circumcised (i.e., the foreskin of the penis has been surgically removed).
comment: Hombres cuyos penes están circuncidados (es decir, el prepucio del pene ha sido extirpado quirúrgicamente).
alternative label: Circumcised men
change note: Version 4.2.0
in scheme: v3
preferred label: Hombres circuncidados
related: Circumcision

Civil union documents
type: Concept
issued: 2019-05-14
modified: 2025-02-23
replaces: civilUnionDocuments
comment: Legal documents certifying civil unions established in compliance with the laws of certain jurisdictions.
comment: Documentos legales que certifican uniones civiles establecidas en conformidad con las leyes de determinadas jurisdicciones.
broader: Civil unions
broader: Official documentation
change note: Version 4.2.0
has top concept: Living arrangements
in scheme: v3
preferred label: Documentos de unión civil

Civil union certificates
type: Concept
issued: 2019-05-14
modified: 2025-02-23
replaces: civilUnionCertificates
comment: Official certificates certifying civil unions established in compliance with the laws of certain jurisdictions.
comment: Certificados oficiales que acreditan uniones civiles establecidas en conformidad con las leyes de determinadas jurisdicciones.
broader: Civil unions
broader: Official documentation
change note: Version 4.2.0
has top concept: Living arrangements
in scheme: v3
preferred label: Ceritificados de unión civil

Clit rings
type: Concept
issued: 2019-05-14
modified: 2025-02-23
replaces: clitRings
comment: Genital piercings placed directly through the hood of the clitoris, typically worn for aesthetic purposes or to enhance sexual arousal.
comment: Perforaciones genitales colocadas directamente a través del capuchón del clítoris, generalmente usadas para fines estéticos o para aumentar la excitación sexual.
broader: Sex accessories
change note: Version 4.2.0
has top concept: Sex accessories
in scheme: v3
preferred label: Anillos de clítoris
related: Clitoris

Clones (Gay culture)
type: Concept
issued: 2019-05-14
modified: 2025-02-23
replaces: clonesGayMen
comment: Historical term for gay men who dress in a particular masculine fashion; often used in the Castro District of San Francisco.
comment: Término histórico para hombres gay que visten de una manera masculina particular; se utiliza a menudo en el distrito Castro de San Francisco.
alternative label: Clones (Gay men)
alternative label: Clones
alternative label: Clones gay
broader: Gay men
broader: LGBTQ+ historical terms
change note: Version 4.2.0
has top concept: LGBTQ+ people
in scheme: v3
preferred label: Clones (cultura gay)

Cock rings
type: Concept
issued: 2019-05-14
modified: 2025-02-23
replaces: cockRings
comment: Rings or circular sex toys worn on the penis to maintain an erection and prevent orgasm.
comment: Anillos o juguetes sexuales circulares que se colocan en el pene para mantener la erección y prevenir el orgasmo.
broader: Sex accessories
change note: Version 4.2.0
has top concept: Sex accessories
in scheme: v3
preferred label: Anillos para el pene
related: Penis

Collars
type: Concept
issued: 2019-05-14
modified: 2025-02-23
replaces: collars
comment: Straps or bands of material worn around the neck. May be worn as a fashion statement, to signal "ownership" by a dominant partner within the context of a BDSM relationship, or during sex to restrict the wearer's movement and breath control.
broader: Sex accessories
change note: Version 4.2.0
has top concept: Sex accessories
in scheme: v3
preferred label: Collares
related: Body adornment

Common law marriage
type: Concept
issued: 2019-05-14
modified: 2025-02-23
replaces: commonLawMarriage
comment: Legal framework in which two partners are considered married without having formally registered their relationship as a civil or religious marriage. Common law marriage grants certain economic rights and legal privileges.
comment: Marco jurídico en el que dos cónyuges se consideran casados ​​sin haber registrado formalmente su relación como matrimonio civil o religioso. El matrimonio de hecho otorga ciertos derechos económicos y privilegios legales.
alternative label: Pareja de hecho
alternative label: Unión de hecho
broader: Marriage
broader: Marriage law
change note: Version 4.2.0
has top concept: Living arrangements
in scheme: v3
preferred label: Matrimonio de hecho

Condoms
type: Concept
issued: 2019-05-14
modified: 2025-02-23
replaces: condoms
comment: Latex contraceptives used to cover penises during sexual activity for the purposes of preventing STIs and/or pregnancy.
comment: Anticonceptivos de látex utilizados para cubrir penes durante actividad sexual con el fin de prevenir ITS y/o embarazo.
alternative label: Prophylactics
alternative label: Rubbers
alternative label: Preservativos
alternative label: Gomas
alternative label: Profiláctico
alternative label: Forros
broader: Sex accessories
change note: Version 4.2.0
has top concept: Sex accessories
in scheme: v3
preferred label: Condones
related: Safer sex

Second parent adoption
type: Concept
issued: 2019-05-14
modified: 2025-02-23
replaces: secondParentAdoption
comment: An adoption process by which a legal child-parent relationship is established by granting the “second” parent the same rights as the “first” parent without the “first” or legal parent relinquishing any parental rights. A second or co-parent adoption can be important for LGBTQ+ parents to protect their parental rights as the relationship of the non-biological parent may not be recognized in some jurisdictions without such an adoption.
comment: Un proceso de adopción mediante el cual se establece una relación legal entre padres e hijos otorgando al “segundo” padre los mismos derechos que al “primer” padre sin que el “primer” padre o padre legal renuncie a ningún derecho de paternidad. Una segunda adopción o una adopción conjunta puede ser importante para que los padres LGBTQ+ protejan sus derechos de paternidad, ya que la relación del padre no biológico puede no ser reconocida en algunas jurisdicciones sin dicha adopción.
alternative label: Co-parent adoption
alternative label: Adopción co-parental
broader: LGBTQ+ adoption
change note: Version 4.2.0
has top concept: LGBTQ+ family planning
in scheme: v3
preferred label: Adopción por segundo padre
related: LGBTQ+ personal and family law

Dandyism
type: Concept
issued: 2019-05-14
modified: 2025-02-23
replaces: dandyism
comment: The style or conduct of a dandy.
comment: El estilo o la conducta de un dandi.
broader: Subcultures
change note: Version 4.2.0
has top concept: Subcultures
in scheme: v3
preferred label: Dandismo
related: Dandies

Decadence
type: Concept
issued: 2019-05-14
modified: 2025-02-23
replaces: decadence
comment: A way of life characterized by mannerisms and affectations marked by excess.
comment: Una forma de vida caracterizada por manierismos y afectaciones marcadas por el exceso.
broader: Subcultures
change note: Version 4.2.0
has top concept: Subcultures
in scheme: v3
preferred label: Decadencia
related: Sexual identity

Dental dams
type: Concept
issued: 2019-05-14
modified: 2025-02-23
replaces: dentalDams
comment: A square sheet of latex or polyurethane used to create a barrier between the mouth and the vagina or anus during oral sex.
comment: Una lámina cuadrada de látex o poliuretano utilizada para crear una barrera entre la boca y la vagina o el ano durante el sexo oral.
alternative label: Latex barriers
alternative label: Barreras de látex
alternative label: Diques dentales
alternative label: Diques de goma
alternative label: Barreras bucales
broader: Sex accessories
change note: Version 4.2.0
has top concept: Sex accessories
in scheme: v3
preferred label: Presas dentales
related: Safer sex

DSM (Diagnostic and Statistical Manual of Mental Disorders)
type: Concept
issued: 2019-05-14
modified: 2025-02-23
replaces: DSM
comment: The Diagnostic and Statistical Manual of Mental Disorders, produced by the American Psychiatric Association; can be used in reference to the DSM's historical or present day descriptions of LGBTQ+ identities and practices.
comment: El Manual Diagnóstico y Estadístico de los Trastornos Mentales, elaborado por la Asociación Estadounidense de Psiquiatría; se puede utilizar en referencia a las descripciones históricas o actuales del MDE de las identidades y prácticas LGBTQ+.
alternative label: DSM
alternative label: Diagnostic and Statistical Manual of Mental Disorders
change note: Version 4.2.0
in scheme: v3
preferred label: MDE (Manual diagnóstico y estadístico de los trastornos mentales)
related: Mental health care for LGBTQ+ people

Disorders of sexual development
type: Concept
issued: 2019-05-14
modified: 2025-02-23
replaces: disordersOfSexualDevelopment
comment: Term used within medical contexts to refer to a wide range of variations in sex characteristics. Many people with intersex variations consider these terms to be stigmatizing and pathologizing, though they often still encounter them in their medical records.
comment: Término utilizado en contextos médicos para referirse a una amplia gama de variaciones en las características sexuales. Muchas personas con variaciones intersex consideran que estos términos son estigmatizantes y patologizantes, aunque a menudo todavía los encuentran en sus registros médicos.
alternative label: Disorders of sex development
alternative label: Desórdenes del desarrollo sexual
broader: Intersex
change note: Version 4.2.0
has top concept: Sex (Body)
in scheme: v3
preferred label: Trastornos del desarrollo sexual
related: Medicalization

Dyke demonstrations
type: Concept
issued: 2019-05-14
modified: 2025-04-23
replaces: dykeMarches
comment: Marches, rallies, and other large, public gatherings organized to protest discrimination against dykes and advocate for dyke visibility, rights, and issues. This term should only be used to describe demonstrations explicitly for lesbians who identify as dykes or that are centered on the dyke identity and politics. Otherwise, use the more general term "Lesbian demonstrations."
comment: Marchas, protestas y otros encuentros centrados en la visibilidad, los asuntos y los derechos de las lesbianas. Utilícese únicamente para describir marchas explícitamente a favor de las bolleras o centradas en la identidad y la política de las bolleras. De lo contrario, utilícese el término más general "marchas de lesbianas".
alternative label: Dyke marches
alternative label: Dyke rallies
alternative label: Dyke protests
alternative label: Marchas dyke
alternative label: Marchas de lesbianas
broader: Lesbian demonstrations
change note: Version 4.2.0
has top concept: LGBTQ+ activism
in scheme: v3
preferred label: Marcha de las bolleras
related: Dyke solidarity

Ecofeminism
type: Concept
issued: 2019-05-14
modified: 2025-02-23
replaces: ecofeminism
comment: Political and philosophical movement that views feminism and concerns for the environment as inherently related.
comment: Movimiento político y filosófico que considera que el feminismo y la preocupación por el medio ambiente están intrínsecamente relacionados.
broader: Feminism
change note: Version 4.2.0
has top concept: Feminism
in scheme: v3
preferred label: Ecofeminismo
related: Eco-feminists

Ego-dystonic sexual orientation
type: Concept
issued: 2019-05-14
modified: 2025-02-23
replaces: ego-dystonicSexualOrientation
comment: Internal conflict caused by having a sexual identity or attraction that is at odds with one’s idealized self-image.
comment: Conflicto interno causado por tener una identidad o atracción sexual que está en desacuerdo con la autoimagen idealizada.
alternative label: Ego-dystonic homosexuality
alternative label: Homosexualidad egodistónica
broader: Mental disorders
change note: Version 4.2.0
has top concept: Mental disorders
in scheme: v3
preferred label: Orientación sexual egodistónica
related: Conversion therapy
related: Internalized homophobia

Electroshock therapy
type: Concept
issued: 2019-05-14
modified: 2025-02-23
replaces: electroshockTherapy
comment: A form of psychiatric treatment for major depression, bipolar depression, and other mental health conditions that usually consists of brief electrical pulses to the brain through electrodes on the head that induce controlled seizures. Electroshock therapy has historically been used as an attempt to "cure" homosexuality and other non-normative sexualities and sexual practices.
comment: Una forma de tratamiento psiquiátrico para la depresión mayor, la depresión bipolar y otras condiciones de salud mental que generalmente consiste de breves pulsos eléctricos al cerebro a través de electrodos en la cabeza que inducen convulsiones controladas. Históricamente, la terapia de electroshock se ha utilizado como un intento para "curar" la homosexualidad y otras sexualidades y prácticas sexuales no normativas.
alternative label: Electric shock therapy
alternative label: Electroconvulsive therapy
alternative label: Terapia de electro shock
alternative label: Terapia electroconvulsiva
broader: Therapies
change note: Version 4.2.0
has top concept: Medical care
in scheme: v3
preferred label: Terapia de electroshock
related: Detention of LGBTQ+ people under a hospital order

Escort services
type: Concept
issued: 2019-05-14
modified: 2025-02-23
replaces: escortServices
comment: Agencies that serve to connect paying clients with escorts offering services by appointment. Escort services may be less stigmatized than other forms of sex work, in part because it tends to be safer for escorts and because some escorts offer a broader range of services, including accompaniment or entertainment without the promise of sexual contact. However, the tendency to frame escorting as separate from or superior to other forms of sex work obscures the labor undertaken by escorts and perpetuates discrimination against the most marginalized and vulnerable sex workers.
comment: Agencias que ponen en contacto a clientes de pago con acompañantes que ofrecen servicios con cita previa. Los servicios de acompañantes pueden estar menos estigmatizados que otras formas de trabajo sexual, en parte porque tienden a ser más seguros para los acompañantes y porque algunos de ellos ofrecen una gama más amplia de servicios, incluido el acompañamiento o el entretenimiento sin la promesa de contacto sexual. Sin embargo, la tendencia a considerar el acompañamiento como algo distinto o superior a otras formas de trabajo sexual oculta el trabajo que realizan los acompañantes y perpetúa la discriminación contra los trabajadores sexuales más marginados y vulnerables.
broader: Sex work
change note: Version 4.2.0
has top concept: Sex industry
in scheme: v3
preferred label: Servicios de acompañantes
related: Escorts

Escorts
type: Concept
issued: 2019-05-14
modified: 2025-02-23
replaces: escorts
comment: Sex workers whose clients are required to make appointments for their services. Unlike sex workers who solicit clients on the street or in institutions like brothels, escorts typically advertise their services online, whether independently or through agencies. Escorting may be less stigmatized than other forms of sex work, in part because it tends to be safer for escorts and because some escorts offer a broader range of services, including accompaniment or entertainment without the promise of sexual contact. However, the tendency to frame escorting as separate from or superior to other forms of sex work obscures the labor undertaken by escorts and perpetuates discrimination against the most marginalized and vulnerable sex workers.
comment: Trabajadores sexuales cuyos clientes deben tener una cita previa por servicios. A diferencia de los trabajadores sexuales que solicitan clientes en la calle o en instituciones como burdeles, los acompañantes suelen anunciar sus servicios en Internet, ya sea de forma independiente o a través de agencias. El acompañamiento puede estar menos estigmatizado que otras formas de trabajo sexual, en parte porque tiende a ser más seguro para los acompañantes y porque algunos de ellos ofrecen una gama más amplia de servicios, incluido el acompañamiento o el entretenimiento sin la promesa de contacto sexual. Sin embargo, la tendencia a considerar el acompañamiento como algo distinto o superior a otras formas de trabajo sexual oculta el trabajo que realizan los acompañantes y perpetúa la discriminación contra los trabajadores sexuales más marginados y vulnerables.
alternative label: Call boys
alternative label: Call girls
alternative label: Acompañante
broader: Sex workers
change note: Version 4.2.0
has top concept: Sex workers
in scheme: v3
preferred label: Acompañantes
related: Escort services

Ex-gay movement
type: Concept
issued: 2019-05-14
modified: 2025-02-23
replaces: ex-gayMovement
comment: People and organizations that encourage people to resist entering or pursuing same-sex relationships, to eliminate homosexual desires, to develop heterosexual desires, and/or to enter into heterosexual relationships.
comment: Personas y organizaciones que alientan a las personas a resistirse a entablar o mantener relaciones con personas del mismo sexo, a eliminar los deseos homosexuales, a desarrollar deseos heterosexuales y/o a entablar relaciones heterosexuales.
broader: Social movements
change note: Version 4.2.0
has top concept: Social movements
in scheme: v3
preferred label: Movimiento ex-gay
related: Conversion therapy
related: Heterosexism

Fa'afatama
type: Concept
issued: 2019-05-14
modified: 2025-02-23
replaces: faafatama
comment: In New Zealand, Samoan people who were assigned female at birth but behave in masculine ways and may consider themselves men.
comment: En Nueva Zelanda, los samoanos a quienes se les asignó al sexo femenino al nacer pero que se comportan de manera masculina y pueden considerarse hombres.
broader: Non-Euro-American gender and sexual identities
change note: Version 4.2.0
has top concept: Gender
in scheme: v3
related: Fa'afafine

Fakaleitī
type: Concept
issued: 2019-05-14
modified: 2025-02-23
replaces: fakaleiti
comment: Tongan people assigned male at birth who behave in an effeminate manner.
comment: Personas tonganas asignadas al sexo masculino al nacer que se comportan de forma afeminada.
alternative label: Fakaleiti
broader: Non-Euro-American gender and sexual identities
broader: MVPFAFF+
change note: Version 4.2.0
has top concept: Gender
in scheme: v3

Women's friendships
type: Concept
issued: 2019-05-14
modified: 2025-02-23
replaces: womensFriendships
comment: Connections based on affection and trust between two or more women.
comment: Conexiones basadas en el afecto y la confianza entre dos o más mujeres.
alternative label: Female friendships
alternative label: Amistades femininas
alternative label: Amistades de mujeres
broader: Friendships
broader: Homosociality
change note: Version 4.2.0
has top concept: Relationship satisfaction
in scheme: v3
preferred label: Amistades entre mujeres

First-wave feminism
type: Concept
issued: 2019-05-14
modified: 2025-02-23
replaces: firstWaveFeminism
comment: Period of women's rights activism in the 19th and early 20th centuries that was primarily focused on legal rights such as women's right to vote.
comment: Período de activismo por los derechos de las mujeres en el siglo XIX y principios del XX que se centró principalmente en derechos legales como el derecho de las mujeres al voto.
alternative label: First wave feminism
alternative label: Feminismo de la primera ola
broader: Feminism
change note: Version 4.2.0
has top concept: Feminism
in scheme: v3
preferred label: Primera ola del feminismo
related: First-wave feminists

Forced castration
type: Concept
issued: 2019-05-14
modified: 2025-02-23
replaces: forcedCastration
comment: Forced or coerced removal of the testes or use of the testes, typically through surgical or chemical means, enacted by legal authorities or as a hate crime.
comment: Extirpación forzada o bajo coacción de los testículos o la utilización de los mismos, normalmente por medios quirúrgicos o químicos, por las autoridades legales o como crimen de odio.
broader: Anti-gay violence
broader: Castration
change note: Version 4.2.0
has top concept: Anti-LGBTQ+ violence
in scheme: v3
preferred label: Castración forzada

Foreskin restoration
type: Concept
issued: 2019-05-14
modified: 2025-02-23
replaces: foreskinRestoration
comment: The process of altering a circumcised penis to reconstruct or restore the foreskin.
comment: El proceso de alterar un pene circuncidado para reconstruir o restaurar el prepucio.
alternative label: Uncircumcision
change note: Version 4.2.0
in scheme: v3
preferred label: Restauración prepucial
related: Circumcision

Foster parents
type: Concept
issued: 2019-05-14
modified: 2025-02-23
replaces: fosterParents
comment: A person or family unit who takes in and cares for a child or children on behalf of the state.
comment: Una persona o unidad familiar que acoge y cuida a un niño o niños en nombre del Estado.
alternative label: Madres de acogida
alternative label: Padres de acogida
alternative label: Padres de crianza
alternative label: Madres de crianza
alternative label: Madres y padres de crianza
broader: Parents
change note: Version 4.2.0
has top concept: Family members
in scheme: v3
preferred label: Madres y padres de acogida
related: Social parenthood

Fricatrices
type: Concept
issued: 2019-05-14
modified: 2025-02-23
replaces: fricatrices
comment: A historical term for lesbians. Only use in a historical context.
comment: Un término histórico para las lesbianas. Utilícese únicamente en un contexto histórico.
broader: LGBTQ+ historical terms
change note: Version 4.2.0
has top concept: LGBTQ+ historical terms
in scheme: v3
related: Lesbians

G-spot
type: Concept
issued: 2019-05-14
modified: 2025-03-20
replaces: g-spot
comment: Commonly characterized as an erogenous area of the front anterior wall of the vagina that, when stimulated, can lead to sexual arousal, orgasms, and/or ejaculation.
comment: Comúnmente se caracteriza como un área erógena de la pared anterior de la vagina que, cuando se estimula, puede provocar excitación sexual, orgasmos y/o eyaculación.
broader: Clitoris
broader: Vagina
change note: Version 4.2.0
has top concept: Erogenous body parts
in scheme: v3
preferred label: Punto G

Gay activism
type: Concept
issued: 2019-05-14
modified: 2025-02-23
replaces: gayActivism
comment: Direct action and organizing to achieve political or social change and acceptance for gay men.
comment: Acción directa y organización para lograr el cambio político o social y la aceptación de los hombres gay.
broader: LGBTQ+ activism
change note: Version 4.2.0
has top concept: LGBTQ+ activism
in scheme: v3
preferred label: Activismo gay
related: Gay political activists

African American gay men
type: Concept
issued: 2019-05-14
modified: 2025-02-23
replaces: gayAfricanAmericans
comment: Gay men of African descent born in the United States or gay men born in African countries who live in or have a strong connection to the United States. Use for individuals who self-identity as African American. Follow the individual’s preference for African American or Black whenever possible.
comment: Hombres gay de ascendencia africana nacidos en los Estados Unidos o hombres gay nacidos en países africanos que viven o tienen una conexión fuerte con los Estados Unidos. Utilícese para personas que se autoidentifiquen como afroamericanas.
alternative label: Gay African American people
alternative label: Gay African Americans
alternative label: Afroamericanos gay||
broader: African American LGBTQ+ people
change note: Version 4.2.0
has top concept: LGBTQ+ people
in scheme: v3
preferred label: Hombres gay afroamericanos
related: Down-low

Asian American gay men
type: Concept
issued: 2019-05-14
modified: 2025-02-23
replaces: gayAsianAmericans
comment: Gay men of Asian heritage or descent born in the United States or born in Asian countries who live in or have a strong connection to the United States. Only use for individuals who self-identify as Asian American.
comment: Hombres gay de herencia o ascendencia asiática nacidos en Estados Unidos u hombres gay nacidos en países asiáticos que viven en o tienen una conexión fuerte con Estados Unidos. Utilícese para personas que se autoidentifiquen como asiático-americanos.
alternative label: Gay Asian American people
alternative label: Gay Asian Americans
alternative label: Asiático-americanos gay
broader: Asian American LGBTQ+ people
broader: Asian gay men
change note: Version 4.2.0
has top concept: LGBTQ+ people
in scheme: v3
preferred label: Hombres gay asiático-americanos

Asian gay men
type: Concept
issued: 2019-05-14
modified: 2025-02-23
replaces: gayAsians
comment: Gay men of Asian heritage or descent, living in Asia or part of the Asian diaspora. Only use for people who self-identify as Asian.
comment: Hombres gay nacidos en países asiáticos o descendientes de ellos. Utilícese únicamente para personas que se autoidentifiquen como asiáticas.
alternative label: Gaysians
alternative label: Gay Asians
alternative label: Hombres asiáticos gay
alternative label: Asiáticos gay
broader: Asian LGBTQ+ people
change note: Version 4.2.0
has top concept: LGBTQ+ people
in scheme: v3
narrower: Asian American gay men
preferred label: Hombres gay asiáticos

Gay choruses
type: Concept
issued: 2019-05-14
modified: 2025-02-23
replaces: gayChoruses
comment: Organized groups of gay men who sing together.
comment: Grupos organizados de hombres gay que cantan juntos.
alternative label: Gay choirs
broader: LGBTQ+ choruses
change note: Version 4.2.0
has top concept: LGBTQ+ choruses
in scheme: v3
preferred label: Coros gay
related: Lesbian choruses

Gay discos
type: Concept
issued: 2019-05-14
modified: 2025-02-23
replaces: gayDiscos
comment: Nightlife entertainment venues or clubs where people dance to recorded music; use in reference to discos that primarily cater to gay men.
comment: Lugares o clubes de entretenimiento nocturno donde se baila con música grabada; utilícese en referencia a discotecas que principalmente atienden a hombres gay.
alternative label: Gay discotheques
alternative label: Gay night clubs
alternative label: Gay nightclubs
alternative label: Discos gay
alternative label: Clubs gay
broader: LGBTQ+ night life
change note: Version 4.2.0
has top concept: LGBTQ+ night life
in scheme: v3
preferred label: Discotecas gay
related: LGBTQ+ bars

Gay drama
type: Concept
issued: 2019-05-14
modified: 2025-02-23
replaces: gayDrama
comment: Works of fiction written to be performed; use in reference to dramatic works focusing on gay characters or themes.
comment: Obras de ficción escritas para ser puestas en escena; utilícese en referencia a obras dramáticas que se centran en personajes o temas gay.
broader: LGBTQ+ drama
change note: Version 4.2.0
has top concept: Subcultures
in scheme: v3
preferred label: Drama gay
related: Gay authors

Gay information centers
type: Concept
issued: 2019-05-14
modified: 2025-02-23
replaces: gayInformationCentres
comment: Institutions providing education, support, and information about gay men and gay communities to gay men.
comment: Instituciones que brindan educación, apoyo e información sobre hombres gay y comunidades gay a hombres gay.
broader: LGBTQ+ information centers
change note: Version 4.2.0
has top concept: LGBTQ+ centers
in scheme: v3
preferred label: Centros de información gay
preferred label: Gay information centres
related: Gay movement

Parents of gay men
type: Concept
issued: 2019-05-14
modified: 2025-02-23
replaces: parentsOfGayMen
comment: People who act as parents to one or more gay man. For parents who are themselves gay, use the term "Gay parents."
comment: Personas que actúan como padres de uno o más hombres gay. Para padres que son gay, utilice el término "madres y padres gay".
alternative label: Gay men's parents
alternative label: Madres de hombres gay
alternative label: Padres de hombres gay
broader: Parents of LGBTQ+ people
change note: Version 4.2.0
has top concept: Family members
in scheme: v3
preferred label: Madres y padres de hombres gay
related: Gay men

Gay Muslims
type: Concept
issued: 2019-05-14
modified: 2025-02-23
replaces: gayMuslims
comment: Gay men who are Muslim.
comment: Musicales creados por directores gay, que representan a hombres gay o a personas consideradas importantes dentro de la cultura gay.
broader: LGBTQ+ Muslims
change note: Version 4.2.0
has top concept: LGBTQ+ African religions
in scheme: v3
preferred label: Musicales gay

Gay Pagans
type: Concept
issued: 2019-05-14
modified: 2025-02-23
replaces: gayPagans
comment: Gay men who are members of polytheistic religions or other religions outside of the dominant culture that typically incorporate nature worship and/or the sacred feminine, such as Wicca, Druidry, Heathenry, etc. Use to describe gay men who self-identify as Pagan.
comment: Óperas creadas por directores gay, que representan a hombres gay o a personas consideradas importantes dentro de la cultura gay.
broader: LGBTQ+ Pagans
change note: Version 4.2.0
has top concept: LGBTQ+ African religions
in scheme: v3
preferred label: Óperas gay
related: Gay witches

Gay poetry
type: Concept
issued: 2019-05-14
modified: 2025-02-23
replaces: gayPoetry
comment: Literary work, typically written in verse, that focuses on gay characters, themes, or identity.
comment: Obras literarias, normalmente escritas en verso, que se centran en personajes, temas o identidades gay.
broader: LGBTQ+ poetry
change note: Version 4.2.0
has top concept: Subcultures
in scheme: v3
preferred label: Poesía gay
related: Gay authors

Gay political activists
type: Concept
issued: 2019-05-14
modified: 2025-02-23
replaces: gayPoliticalActivists
comment: Gay men working to bring about political or social change through public organizing.
comment: Hombres gay que trabajan para lograr cambios políticos o sociales a través de la organización pública.
broader: LGBTQ+ political activists
change note: Version 4.2.0
has top concept: LGBTQ+ people
in scheme: v3
preferred label: Activistas políticos gay
related: Gay activism

Gay pride
type: Concept
issued: 2019-05-14
modified: 2025-02-23
replaces: gayPride
comment: The recognition and celebration of gay people and culture, thereby affirming the visibility, dignity, and diversity of gay communities. This term can be used to refer to gay men specifically, but it is often used as an umbrella term for LGBTQ+ pride as a whole, particularly in historical contexts.
comment: La celebración y el reconocimiento de las identidades LGBTQ+, que afirma la visibilidad, dignidad y diversidad de las comunidades LGBTQ+. Si bien "orgullo gay" puede referirse específicamente a hombres gay, se usa más comúnmente como un término abarcador para el orgullo LGBTQ+ en general.
broader: LGBTQ+ pride
change note: Version 4.2.0
has top concept: LGBTQ+ pride
in scheme: v3
preferred label: Orgullo gay

Gay sensibility
type: Concept
issued: 2019-05-14
modified: 2025-02-23
replaces: gaySensibility
comment: A way of reading and looking at cultural texts (books, movies, television, magazines, etc.) through a gay lens, often including the appropriation of texts otherwise thought of as heterosexual.
comment: Una forma de leer y mirar textos culturales (libros, películas, televisión, revistas, etc.) a través de un lente gay, a menudo incluyendo la apropiación de textos que, de lo contrario, se considerarían heterosexuales.
change note: Version 4.2.0
in scheme: v3
preferred label: Sensibilidad gay
related: Lesbian sensibility

Gay sports clubs
type: Concept
issued: 2019-05-14
modified: 2025-02-23
replaces: gaySportsClubs
comment: Groups of gay men formed for the purpose of playing sports; includes professional and amateur sports clubs.
comment: Grupos de hombres gay formados con el fin de practicar deportes; incluye clubes deportivos profesionales y amateurs.
broader: LGBTQ+ sports clubs
change note: Version 4.2.0
has top concept: LGBTQ+ clubs and organizations
in scheme: v3
preferred label: Clubs de deporte gay
related: Gay athletes

Gay survivors of hate crimes
type: Concept
issued: 2019-05-14
modified: 2025-02-23
replaces: gaySurvivorsOfHateCrimes
comment: Gay men who have experienced and survived hate crimes; follow the individual's preference for "victims" or "survivors" whenever possible.
comment: Hombres gay que han sufrido y sobrevivido a crímenes de odio; siga la preferencia de la persona sobre el uso de "víctimas" o "sobrevivientes" siempre que sea posible.
broader: Gay victims of hate crimes
broader: LGBTQ+ survivors of hate crimes
change note: Version 4.2.0
has top concept: LGBTQ+ people
in scheme: v3
preferred label: Sobrevivientes gay de crímenes de odio

Gay survivors of rape
type: Concept
issued: 2019-05-14
modified: 2025-02-23
replaces: gaySurvivorsOfRape
comment: Gay men who have experienced and survived rape; follow the individual's preference for "victims" or "survivors" whenever possible.
comment: Hombres gay que han sufrido y sobrevivido a una violación; siga la preferencia de la persona sobre el uso de "víctimas" o "sobrevivientes" siempre que sea posible.
broader: Gay victims of rape
broader: LGBTQ+ survivors of rape
change note: Version 4.2.0
has top concept: LGBTQ+ people
in scheme: v3
preferred label: Sobrevivientes gay de violación

Gay survivors of sexual abuse
type: Concept
issued: 2019-05-14
modified: 2025-02-23
replaces: gaySurvivorsOfSexualAbuse
comment: Gay men who have experienced and survived sexual abuse; follow the individual's preference for "victims" or "survivors" whenever possible.
comment: Hombres gay que han sufrido y sobrevivido a abusos sexuales; siga la preferencia de la persona sobre el uso de "víctimas" o "sobrevivientes" siempre que sea posible.
broader: Gay victims of sexual abuse
broader: LGBTQ+ survivors of sexual abuse
change note: Version 4.2.0
has top concept: LGBTQ+ people
in scheme: v3
preferred label: Sobrevivientes gay de abuso sexual

Gay survivors of war
type: Concept
issued: 2019-05-14
modified: 2025-02-23
replaces: gaySurvivorsOfWar
comment: Gay men who have experienced and survived war; follow the individual's preference for "victims" or "survivors" whenever possible.
comment: Hombres gay que han sufrido y sobrevivido a la guerra; siga la preferencia de la persona sobre el uso de "víctimas" o "sobrevivientes" siempre que sea posible.
broader: Gay victims of war
broader: LGBTQ+ survivors of war
change note: Version 4.2.0
has top concept: LGBTQ+ people
in scheme: v3
preferred label: Sobrevivientes gay de guerra

Gay television
type: Concept
issued: 2019-05-14
modified: 2025-02-23
replaces: gayTelevision
comment: Television shows featuring gay men or themes.
comment: Programas de televisión que presentan temas u hombres gay.
broader: LGBTQ+ television
change note: Version 4.2.0
has top concept: LGBTQ+ television
in scheme: v3
preferred label: Televisión gay
related: Gay movement

Gay trade union groups
type: Concept
issued: 2019-05-14
modified: 2025-02-23
replaces: gayTradeUnionGroups
comment: Organized groups of gay workers who are united to make decisions relating to the conditions affecting their labor.
comment: Grupos organizados de trabajadores gay que se unen para tomar decisiones relacionadas con las condiciones que afectan su trabajo.
broader: Gay movement
change note: Version 4.2.0
has top concept: Social movements
in scheme: v3
preferred label: Grupos sindicales gay
related: Lesbian trade union groups

Gay victims of sexual abuse
type: Concept
issued: 2019-05-14
modified: 2025-02-23
replaces: gayVictimsOfSexualAbuse
comment: Gay men who have experienced sexual abuse and may or may not have survived; follow the individual's preference for "victims" or "survivors" whenever possible.
comment: Hombres gay que han sufrido abuso sexual y pueden haber sobrevivido o no; siga la preferencia de la persona sobre el uso de "víctimas" o "sobrevivientes" siempre que sea posible.
broader: LGBTQ+ victims of sexual abuse
change note: Version 4.2.0
has top concept: LGBTQ+ people
in scheme: v3
narrower: Gay survivors of sexual abuse
preferred label: Víctimas gay de abuso sexual

Gay victims of hate crimes
type: Concept
issued: 2019-05-14
modified: 2025-02-23
replaces: gayVictimsOfHateCrimes
comment: Gay men who have experienced hate crimes and may or may not have survived; follow the individual's preference for "victims" or "survivors" whenever possible.
comment: Hombres gay que han sufrido crímenes de odio y pueden haber sobrevivido o no; siga la preferencia de la persona sobre el uso de "víctimas" o "sobrevivientes" siempre que sea posible.
broader: LGBTQ+ victims of hate crimes
change note: Version 4.2.0
has top concept: LGBTQ+ people
in scheme: v3
narrower: Gay survivors of hate crimes
preferred label: Víctimas gay de crímenes de odio

Gay victims of rape
type: Concept
issued: 2019-05-14
modified: 2025-02-23
replaces: gayVictimsOfRape
comment: Gay men who have experienced rape and may or may not have survived; follow the individual's preference for "victims" or "survivors" whenever possible.
comment: Hombres gay que han sufrido una violación y pueden haber sobrevivido o no; siga la preferencia de la persona sobre el uso de "víctimas" o "sobrevivientes" siempre que sea posible.
broader: LGBTQ+ victims of rape
change note: Version 4.2.0
has top concept: LGBTQ+ people
in scheme: v3
narrower: Gay survivors of rape
preferred label: Víctimas gay de violación

Gay victims of war
type: Concept
issued: 2019-05-14
modified: 2025-02-23
replaces: gayVictimsOfWar
comment: Gay men who have experienced war and may or may not have survived; follow the individual's preference for "victims" or "survivors" whenever possible.
comment: Hombres gay que han sufrido la guerra y que pueden haber sobrevivido o no; siga la preferencia de la persona sobre el uso de "víctimas" o "sobrevivientes" siempre que sea posible.
broader: LGBTQ+ victims of war
change note: Version 4.2.0
has top concept: LGBTQ+ people
in scheme: v3
narrower: Gay survivors of war
preferred label: Víctimas gay de guerra

LGBTQ+ neighborhoods
type: Concept
issued: 2019-05-14
modified: 2025-02-23
replaces: LGBTQNeighbourhoods
comment: Districts or portions of towns or cities that are (typically unofficial) social and/or residential centers for LGBTQ+ people and communities.
comment: Distritos o partes de pueblos o ciudades que son (usualmente de forma informal) centros sociales y/o residenciales para personas y comunidades LGBTQ+.
alternative label: Vecindarios LGBTQ+
alternative label: Vecindarios LGBTQ
change note: Version 4.2.0
in scheme: v3
preferred label: Barrios LGBTQ+
preferred label: LGBTQ+ neighbourhoods
related: LGBTQ+ communities

Gaydar
type: Concept
issued: 2019-05-14
modified: 2025-02-23
replaces: gaydar
comment: Term describing a person's intuitive ability to identify others' sexual orientations.
comment: Término que describe la capacidad intuitiva de una persona para identificar las orientaciones sexuales de las demás personas.
change note: Version 4.2.0
in scheme: v3
preferred label: Radar gay
related: Sexual orientation

Gonadal dysgenesis
type: Concept
issued: 2019-05-14
modified: 2025-02-23
replaces: gonadalDysgenesis
comment: A term that refers to a group of different variations that affect the development of the gonads before birth.
comment: Término que hace referencia a un grupo de diferentes variaciones que afectan el desarrollo de las gónadas antes del nacimiento.
alternative label: Síndrome de Swyer
broader: Intersex variations
change note: Version 4.2.0
has top concept: Sex (Body)
in scheme: v3
narrower: Mixed gonadal dysgenesis
preferred label: Disgenesia gonadal

Hair
type: Concept
issued: 2019-05-14
modified: 2025-02-23
replaces: hair
comment: Threadlike strands of keratin growing out of the skin on the body. Use in reference to hair as a secondary sex characteristic or as a form of self expression.
comment: Hilos de queratina que crecen de la piel en el cuerpo. Utilícese en referencia al cabello como característica sexual secundaria o como forma de autoexpresión.
alternative label: Cabello
alternative label: Vello
broader: Secondary sex characteristics
change note: Version 4.2.0
has top concept: Sex (Body)
in scheme: v3
narrower: Mustaches
preferred label: Pelo

Halloween (LGBTQ+ culture)
type: Concept
issued: 2019-05-14
modified: 2025-02-23
replaces: halloween
comment: The celebration of Halloween, often called Gay Christmas, by LGBTQ+ people. Typically involves dressing in drag or elaborate costumes as a form of gender play and attending large parties in LGBTQ+ neighborhoods or establishments.
comment: La celebración de Halloween, a menudo llamada Navidad Gay, por personas LGBTQ+. Por lo general, implica vestirse en drag o disfraces elaborados como forma de jugar con el género y asistir a grandes fiestas en vecindarios o establecimientos LGBTQ+.
alternative label: Gay Christmas
alternative label: Gay Halloween
alternative label: Navidad gay
alternative label: Halloween gay
broader: Europride
change note: Version 4.2.0
has top concept: Europride
in scheme: v3
preferred label: Halloween (Cultura LGBTQ+)
related: Costumes

Heterosexual identity
type: Concept
issued: 2019-05-14
modified: 2025-02-23
replaces: heterosexualIdentity
comment: Term used to describe the sexual identity of individuals who are romantically and/or sexually attracted to people assigned the “opposite” sex at birth.
comment: Término utilizado para describir la identidad sexual de las personas que se sienten atraídas romántica y/o sexualmente por personas asignadas al sexo “opuesto” al nacer.
broader: Sexual identity
change note: Version 4.2.0
has top concept: Sexual identity
in scheme: v3
preferred label: Identidad heterosexual
related: Heterosexuals

Heterosociality
type: Concept
issued: 2019-05-14
modified: 2025-02-23
replaces: heterosociality
comment: In sociology, this term is used to describe social relations and bonds between members of the opposite sex or gender in a given culture. Typically excludes romantic and sexual relationships.
comment: En la sociología, este término se utiliza para describir las relaciones sociales y los vínculos entre miembros del sexo o género opuesto en una cultura determinada. Normalmente excluye las relaciones románticas y sexuales.
alternative label: Heterosexual social relationships
alternative label: Heterosocial bonds
alternative label: Relaciones sociales heterosexuales
alternative label: Vínculos heterosociales
broader: Relationship satisfaction
change note: Version 4.2.0
has top concept: Relationship satisfaction
in scheme: v3
preferred label: Heterosocialidad
related: Homosociality

HIV tests
type: Concept
issued: 2019-05-14
modified: 2025-02-23
replaces: HIVTests
comment: Medical tests used to determine the presence of HIV antibodies or antigens in an individual's blood, saliva, or urine.
comment: Pruebas médicas utilizadas para determinar la presencia de anticuerpos o antígenos del VIH en la sangre, la saliva o la orina de una persona.
alternative label: Exámenes de VIH
change note: Version 4.2.0
in scheme: v3
preferred label: Pruebas de VIH
related: HIV/AIDS

Seroconversion
type: Concept
issued: 2019-05-14
modified: 2025-02-23
replaces: seroconversion
comment: Term used to describe the period of time between exposure to a virus and when antibodies for the virus are detectable; often used in reference to HIV testing when a test changes from HIV negative to HIV positive.
comment: Término utilizado para describir el período de tiempo entre la exposición a un virus y el momento en que los anticuerpos contra el virus son detectables; a menudo se utiliza en referencia a la prueba del VIH cuando una prueba cambia de VIH negativa a VIH positiva.
alternative label: HIV-seroconversion
alternative label: Seroconversión-VIH
change note: Version 4.2.0
in scheme: v3
preferred label: Seroconversión
related: HIV/AIDS

Murders of LGBTQ+ people
type: Concept
issued: 2019-05-14
modified: 2025-02-23
replaces: murdersOfLGBTQPeople
comment: Intentional killing of LGBTQ+ people due to their gender and/or sexual identities.
comment: Asesinato intencional de personas LGBTQ+ debido a su género y/o identidad sexual.
alternative label: Homicides of LGBTQ people
alternative label: Murders of LGBTQ people
alternative label: Homicidios de personas LGBTQ+
broader: Anti-LGBTQ+ violence
change note: Version 4.2.0
has top concept: Anti-LGBTQ+ violence
in scheme: v3
preferred label: Asesinatos de personas LGBTQ+
related: Hate crimes

Sexual sterilization
type: Concept
issued: 2019-05-14
modified: 2025-02-23
replaces: sexualSterilisation
comment: Refers to any type of medical treatment that intentionally leaves an individual sterile or unable to reproduce. This term encompasses both voluntary and involuntary sterilization.
comment: Se refiere a cualquier tipo de tratamiento médico que intencionalmente deja a una persona estéril o incapaz de reproducirse. Este término abarca tanto la esterilización voluntaria como la involuntaria.
change note: Version 4.2.0
in scheme: v3
preferred label: Esterilización sexual
preferred label: Sexual sterilisation
related: Female genital mutilation

Jogappa
type: Concept
issued: 2019-05-14
modified: 2025-02-23
replaces: jogappa
comment: In India, this term is used to describe people assigned male at birth who become genderfluid in a spiritual conversion.
comment: En India, este término se utiliza para describir a las personas asignadas al sexo masculino al nacer y que asumen un género fluido a través de una conversión espiritual.
broader: Non-Euro-American gender and sexual identities
change note: Version 4.2.0
has top concept: Gender
in scheme: v3
related: Hijras

Kabuki
type: Concept
issued: 2019-05-14
modified: 2025-02-23
replaces: kabuki
comment: A form of theatre in Japan that often features crossdressing actors. Historically, female performers played both male and female roles, but women were later banned from performing and were replaced with male performers who played both male and female roles.
comment: Un tipo de teatro en Japón donde a menudo figuran actores transformistas. Históricamente, actrices asumían los roles masculinos y femeninos, pero eventualmente se le prohibió a las mujeres presentarse en el escenario y fueron reemplazadas por actores que asumían los roles masculinos y femeninos.
broader: LGBTQ+ theater
change note: Version 4.2.0
has top concept: LGBTQ+ theater
in scheme: v3
related: Crossdressing

Khusra
type: Concept
issued: 2019-05-14
modified: 2025-02-23
replaces: khusra
comment: A term used in Pakistan and Northern India to describe third-gender people, typically people assigned male at birth who identify as female.
comment: Término utilizado en Pakistán y el norte de la India para describir a personas del tercer género, normalmente personas asignadas al sexo masculino al nacer y que se autoidentifican como mujeres.
broader: Non-Euro-American gender and sexual identities
change note: Version 4.2.0
has top concept: Gender
in scheme: v3
related: Hijras

Kinnar
type: Concept
issued: 2019-05-14
modified: 2025-02-23
replaces: kinnar
comment: A variant term for hijra used in northern India.
comment: Variante del término "hijra" utilizado en el norte de India.
broader: Non-Euro-American gender and sexual identities
change note: Version 4.2.0
has top concept: Gender
in scheme: v3
related: Hijras

Kothis
type: Concept
issued: 2019-05-14
modified: 2025-02-23
replaces: kothi
comment: In South Asia, this term is used to describe people who are assigned male at birth who exhibit feminine characteristics. Please note that not all kothis identify as hijra or transgender.
comment: En el sur de Asia, este término se utiliza para describir a las personas asignadas al sexo masculino al nacer que presentan características femeninas. No todas las kothis se autoidentifican como hijra o transgénero.
broader: Non-Euro-American gender and sexual identities
change note: Version 4.2.0
has top concept: Gender
in scheme: v3
related: Hijras

Leashes
type: Concept
issued: 2019-05-14
modified: 2025-02-23
replaces: leashes
comment: A length of rope or similar material used to control an individual, often to increase sexual arousal.
comment: Un trozo de cuerda o material similar utilizado para controlar a una persona, a menudo para aumentar la excitación sexual.
broader: Sex accessories
change note: Version 4.2.0
has top concept: Sex accessories
in scheme: v3
preferred label: Correas
related: Restraints

Lesbian activism
type: Concept
issued: 2019-05-14
modified: 2025-02-23
replaces: lesbianActivism
comment: Direct action and organizing to achieve political or social change and acceptance for lesbians.
comment: Acción directa y organización para lograr cambio político o social y la aceptación de las lesbianas.
broader: LGBTQ+ activism
change note: Version 4.2.0
has top concept: LGBTQ+ activism
in scheme: v3
preferred label: Activismo lésbico
related: Lesbian political activists

Asian American lesbians
type: Concept
issued: 2019-05-14
modified: 2025-02-23
replaces: lesbianAsianAmericans
comment: Lesbians of Asian heritage or descent born in the United States or born in Asian countries who live in or have a strong connection to the United States. Only use for individuals who self-identify as Asian American.
comment: Lesbianas de herencia o ascendencia asiática nacidas en Estados Unidos o lesbianas nacidas en países asiáticos que viven en o tienen una conexión fuerte con los Estados Unidos. Utilícese para personas que se autoidentifiquen como asiático-americanas.
alternative label: Lesbian Asian Americans
alternative label: Asiático-americanas lesbianas
broader: Asian American LGBTQ+ people
broader: Asian lesbians
change note: Version 4.2.0
has top concept: LGBTQ+ people
in scheme: v3
preferred label: Lesbianas asiático-americanas

Asian lesbians
type: Concept
issued: 2019-05-14
modified: 2025-02-23
replaces: lesbianAsians
comment: Lesbians of Asian heritage or descent, living in Asia or part of the Asian diaspora. Only use for people who self-identify as Asian.
comment: Lesbianas de herencia o ascendencia asiática, que viven en Asia o forman parte de la diáspora asiática. Utilícese únicamente para personas que se autoidentifiquen como asiáticas."
alternative label: Lesbian Asians
alternative label: Asiáticas lesbianas
broader: Asian LGBTQ+ people
change note: Version 4.2.0
has top concept: LGBTQ+ people
in scheme: v3
narrower: Asian American lesbians
preferred label: Lesbianas asiáticas

Lesbian bookshops
type: Concept
issued: 2019-05-14
modified: 2025-02-23
replaces: lesbianBookshops
comment: Bookshops that sell materials intended for use by lesbians or addressing topics related to lesbian communities.
comment: Librerías que venden materiales destinados a ser usado por lesbianas o que abordan temas relacionados con las comunidades lésbicas.
broader: LGBTQ+ bookshops
change note: Version 4.2.0
has top concept: LGBTQ+ bookshops
in scheme: v3
preferred label: Librerías lésbicas
related: Women's bookshops

Lesbian couples
type: Concept
issued: 2019-05-14
modified: 2025-02-23
replaces: lesbianCouples
comment: Partnerships in which both people are lesbians.
comment: Parejas en las que ambas personas son lesbianas.
alternative label: Parejas de lesbianas
broader: LGBTQ+ couples
change note: Version 4.2.0
has top concept: Relationship satisfaction
in scheme: v3
preferred label: Parejas lésbicas
related: Boston marriages

Lesbian information centers
type: Concept
issued: 2019-05-14
modified: 2025-02-23
replaces: lesbianInformationCentres
comment: Institutions providing education, support, and information about lesbian identity and lesbian communities to lesbians.
comment: Instituciones que brindan educación, apoyo e información sobre la identidad lésbica y las comunidades lésbicas a las lesbianas.
broader: LGBTQ+ information centers
change note: Version 4.2.0
has top concept: LGBTQ+ centers
in scheme: v3
preferred label: Centros de información para lesbianas
preferred label: Lesbian information centres
related: Lesbian movement

Lesbian drama
type: Concept
issued: 2019-05-14
modified: 2025-02-23
replaces: lesbianDrama
comment: Works of fiction written to be performed; use in reference to dramatic works focusing on lesbian characters or themes.
comment: Obras de ficción escritas para ser puestas en escena; utilícese en referencia a obras dramáticas que se centran en personajes o temas lésbicos.
broader: LGBTQ+ drama
change note: Version 4.2.0
has top concept: Subcultures
in scheme: v3
preferred label: Drama lésbico
related: Lesbian authors

Lesbian families
type: Concept
issued: 2019-05-14
modified: 2025-02-23
replaces: lesbianFamilies
comment: Families, whether biological, adoptive, or chosen, in which one or more individuals identify as lesbian.
comment: Familias, ya sean biológicas, adoptivas o elegidas, en las que una o más personas se autoidentifican como lesbianas.
alternative label: Familias lesbianas
broader: LGBTQ+ families
change note: Version 4.2.0
has top concept: LGBTQ+ families
in scheme: v3
preferred label: Familias lésbicas
related: Children of lesbians

Lesbian land
type: Concept
issued: 2019-05-14
modified: 2025-02-23
replaces: lesbianLand
comment: Rural communities populated only by lesbians.
comment: Comunidades rurales habitadas únicamente por lesbianas.
broader: Lesbian separatism
change note: Version 4.2.0
has top concept: Lesbian separatism
in scheme: v3
preferred label: Tierra lesbiana
related: Lesbian movement

Lesbian liberation
type: Concept
issued: 2019-05-14
modified: 2025-02-23
replaces: lesbianLiberation
comment: Liberation movement that began in the 1970s to direct more attention to lesbian and feminist issues within the larger gay liberation movement and in national discourse.
comment: Movimiento de liberación que comenzó en la década de 1970 para dirigir más atención hacia las cuestiones lésbicas y feministas dentro del movimiento de liberación gay más amplio y en el discurso nacional.
alternative label: Liberación lésbica
broader: LGBTQ+ social processes
change note: Version 4.2.0
has top concept: LGBTQ+ social processes
in scheme: v3
preferred label: Liberación lesbiana
related: Gay liberation

Lesbian libraries
type: Concept
issued: 2019-05-14
modified: 2025-02-23
replaces: lesbianLibraries
comment: Libraries that hold materials primarily pertaining to lesbians or intended for use by lesbians.
comment: Bibliotecas que contienen materiales relacionados principalmente con lesbianas o destinados a ser utilizados por lesbianas.
alternative label: Bibliotecas lésbicas
broader: LGBTQ+ libraries
broader: Women's libraries
change note: Version 4.2.0
has top concept: LGBTQ+ cultural heritage institutions
in scheme: v3
preferred label: Bibliotecas lesbianas

Lesbian nation
type: Concept
issued: 2019-05-14
modified: 2025-02-23
replaces: lesbianNation
comment: An imagined autonomous, international lesbian community that is set apart from men.
comment: Una comunidad imaginada lésbica, internacional y autónoma, separada de los hombres.
alternative label: Nación lesbiana
broader: Lesbian separatism
change note: Version 4.2.0
has top concept: Lesbian separatism
in scheme: v3
preferred label: Nación lésbica
related: Lesbian movement

Lesbian poetry
type: Concept
issued: 2019-05-14
modified: 2025-02-23
replaces: lesbianPoetry
comment: Literary work, typically written in verse, that focuses on lesbian characters, lesbian themes, or lesbian identity.
comment: Obras literarias, normalmente escritas en verso, que se centran en personajes lésbicos, temas lésbicos o identidad lésbica.
alternative label: Poesía lesbiana
broader: LGBTQ+ poetry
change note: Version 4.2.0
has top concept: Subcultures
in scheme: v3
preferred label: Poesía lésbica
related: Lesbian authors

Lesbian political activists
type: Concept
issued: 2019-05-14
modified: 2025-02-23
replaces: lesbianPoliticalActivists
comment: Lesbians working to bring about political or social change through public organizing.
comment: Lesbianas que trabajan para lograr cambios políticos o sociales a través de la organización pública.
alternative label: Activistas politicas lésbicas
broader: LGBTQ+ political activists
change note: Version 4.2.0
has top concept: LGBTQ+ people
in scheme: v3
preferred label: Activistas políticas lesbianas
related: Lesbian activism

Lesbian sensibility
type: Concept
issued: 2019-05-14
modified: 2025-02-23
replaces: lesbianSensibility
comment: A way of reading and looking at cultural texts (books, movies, television, magazines, etc.) through a lesbian lens, often including the appropriation of texts otherwise thought of as heterosexual.
comment: Una forma de leer y mirar textos culturales (libros, películas, televisión, revistas, etc.) a través de un lente lésbico, lo cual a menudo incluye la apropiación de textos considerados heterosexuales.
change note: Version 4.2.0
in scheme: v3
preferred label: Sensibilidad lésbica
related: Gay sensibility

Lesbian sports clubs
type: Concept
issued: 2019-05-14
modified: 2025-02-23
replaces: lesbianSportsClubs
comment: Groups of lesbians formed for the purpose of playing sports; includes professional and amateur sports clubs.
comment: Grupos de lesbianas formados con el fin de practicar deportes; incluye clubes deportivos profesionales y amateurs.
alternative label: Clubs de deportes lésbicos
broader: LGBTQ+ sports clubs
change note: Version 4.2.0
has top concept: LGBTQ+ clubs and organizations
in scheme: v3
preferred label: Clubs deportivos lésbicos
related: Lesbian athletes

Lesbian survivors of hate crimes
type: Concept
issued: 2019-05-14
modified: 2025-02-23
replaces: lesbianSurvivorsOfHateCrimes
comment: Lesbians who have experienced and survived hate crimes; follow the individual's preference for "victims" or "survivors" whenever possible.
comment: Lesbianas que han sufrido y sobrevivido crímenes de odio; siga la preferencia de la persona sobre el uso de "víctimas" o "sobrevivientes" siempre que sea posible.
alternative label: Lesbianas sobrevivientes de crímenes de odio
broader: Lesbian victims of hate crimes
broader: LGBTQ+ survivors of hate crimes
change note: Version 4.2.0
has top concept: LGBTQ+ people
in scheme: v3
preferred label: Sobrevivientes lesbianas de crímenes de odio

Lesbian survivors of sexual abuse
type: Concept
issued: 2019-05-14
modified: 2025-02-23
replaces: lesbianSurvivorsOfSexualAbuse
comment: Lesbians who have experienced and survived sexual abuse; follow the individual's preference for "victims" or "survivors" whenever possible.
comment: Lesbianas que han sufrido y sobrevivido abusos sexuales; siga la preferencia de la persona sobre el uso de "víctimas" o "sobrevivientes" siempre que sea posible.
alternative label: Lesbianas sobrevivientes de abuso sexual
broader: Lesbian victims of sexual abuse
broader: LGBTQ+ survivors of sexual abuse
change note: Version 4.2.0
has top concept: LGBTQ+ people
in scheme: v3
preferred label: Sobrevivientes lesbianas de abuso sexual

Lesbian survivors of war
type: Concept
issued: 2019-05-14
modified: 2025-02-23
replaces: lesbianSurvivorsOfWar
comment: Lesbians who have experienced and survived war; follow the individual's preference for "victims" or "survivors" whenever possible.
comment: Lesbianas que han sufrido y sobrevivido la guerra; siga la preferencia de la persona sobre el uso de "víctimas" o "sobrevivientes" siempre que sea posible.
alternative label: Lesbianas sobrevivientes de guerra
broader: Lesbian victims of war
broader: LGBTQ+ survivors of war
change note: Version 4.2.0
has top concept: LGBTQ+ people
in scheme: v3
preferred label: Sobrevivientes lesbianas de guerra

Lesbian television
type: Concept
issued: 2019-05-14
modified: 2025-02-23
replaces: lesbianTelevision
comment: Television shows featuring lesbian characters or themes.
comment: Programas de televisión con personajes o temas lésbicos.
broader: LGBTQ+ television
change note: Version 4.2.0
has top concept: LGBTQ+ television
in scheme: v3
preferred label: Televisión lésbica
related: Lesbian movement

Lesbian trade union groups
type: Concept
issued: 2019-05-14
modified: 2025-02-23
replaces: lesbianTradeUnionGroups
comment: Organized groups of lesbian workers who are united to make decisions relating to the conditions affecting their labor.
comment: Grupos organizados de trabajadoras lesbianas que se unen para tomar decisiones relacionadas con las condiciones que afectan su trabajo.
broader: Lesbian movement
change note: Version 4.2.0
has top concept: Social movements
in scheme: v3
preferred label: Grupos sindicales lésbicos
related: Gay trade union groups

Lesbian victims of hate crimes
type: Concept
issued: 2019-05-14
modified: 2025-02-23
replaces: lesbianVictimsOfHateCrimes
comment: Lesbians who have experienced hate crimes and may or may not have survived; follow the individual's preference for "victims" or "survivors" whenever possible.
comment: Lesbianas que han sufrido crímenes de odio y que pueden o no haber sobrevivido; siga la preferencia de la persona sobre el uso de "víctimas" o "sobrevivientes" siempre que sea posible.
alternative label: Víctimas lésbicas de crímenes de odio
broader: LGBTQ+ victims of hate crimes
change note: Version 4.2.0
has top concept: LGBTQ+ people
in scheme: v3
narrower: Lesbian survivors of hate crimes
preferred label: Víctimas lesbianas de crímenes de odio

Lesbian victims of sexual abuse
type: Concept
issued: 2019-05-14
modified: 2025-02-23
replaces: lesbianVictimsOfSexualAbuse
comment: Lesbians who have experienced sexual abuse and may or may not have survived; follow the individual's preference for "victims" or "survivors" whenever possible.
comment: Lesbianas que han sufrido abuso sexual y que pueden o no haber sobrevivido; siga la preferencia de la persona sobre el uso de "víctimas" o "sobrevivientes" siempre que sea posible.
alternative label: Víctimas lésbicas de acoso sexual
broader: LGBTQ+ victims of sexual abuse
change note: Version 4.2.0
has top concept: LGBTQ+ people
in scheme: v3
narrower: Lesbian survivors of sexual abuse
preferred label: Víctimas lesbianas de acoso sexual

Lesbian victims of war
type: Concept
issued: 2019-05-14
modified: 2025-02-23
replaces: lesbianVictimsOfWar
comment: Lesbians who have experienced war and may or may not have survived; follow the individual's preference for "victims" or "survivors" whenever possible.
comment: Lesbianas que han sufrido la guerra y que pueden o no haber sobrevivido; siga la preferencia de la persona sobre el uso de "víctimas" o "sobrevivientes" siempre que sea posible.
alternative label: Víctimas lésbicas de guerra
preferred label: Víctimas lesbianas de guerra
broader: LGBTQ+ victims of war
change note: Version 4.2.0
has top concept: LGBTQ+ people
in scheme: v3
narrower: Lesbian survivors of war

Lesbian youth literature
type: Concept
issued: 2019-05-14
modified: 2025-02-23
replaces: lesbianYouthLiterature
comment: Written literary works for an audience of readers from 12-18 years of age, also known as young adult literature or YA; use in reference to youth literature focusing on lesbian characters or themes.
comment: Obras literarias escritas para una audiencia de lectores de 12 a 18 años de edad, también conocida como literatura para adultos jóvenes o YA (por sus siglas en inglés); utilícese en referencia a la literatura juvenil centrada en personajes o temas lésbicos.
broader: LGBTQ+ youth literature
change note: Version 4.2.0
has top concept: Subcultures
in scheme: v3
preferred label: Literatura juvenil lésbica
related: Lesbian youth

Parents of lesbians
type: Concept
issued: 2019-05-14
modified: 2025-02-23
replaces: parentsOfLesbians
comment: People who act as parents to one or more lesbian. For parents who are themselves lesbians, use the term "Lesbian parents."
comment: Personas que actúan como padres de una o más lesbianas. Para padres que son lesbianas, utilice el término "madres y padres lesbianas".
alternative label: Lesbians' parents
alternative label: Madres de lesbianas
alternative label: Padres de lesbianas
broader: Parents of LGBTQ+ people
change note: Version 4.2.0
has top concept: Family members
in scheme: v3
preferred label: Madres y padres de lesbianas
related: Lesbians

LGBTQ+ action campaigns
type: Concept
issued: 2019-05-14
modified: 2025-02-23
replaces: LGBTQActionCampaigns
comment: A series of organized events or efforts centered around raising awareness or achieving a particular political, social, or cultural goal or action benefiting LGBTQ+ people and communities.
comment: Una serie de eventos o esfuerzos organizados centrados en crear conciencia o lograr un objetivo o acción política, social o cultural particular que beneficie a las personas y comunidades LGBTQ+.
alternative label: LGBTQ action campaigns
alternative label: Campañas de acción LGBTQ
broader: LGBTQ+ direct action
change note: Version 4.2.0
has top concept: LGBTQ+ activism
in scheme: v3
narrower: LGBTQ+ demonstrations
preferred label: Campañas de acción LGBTQ+

LGBTQ+ art censorship
type: Concept
issued: 2019-05-14
modified: 2025-02-23
replaces: LGBTQArtCensorship
comment: Suppression or prohibition of art by LGBTQ+ artists or about LGBTQ+ issues; includes censorship on the basis of religious, moral, political, and/or social objections.
comment: Supresión o prohibición del arte por parte de artistas LGBTQ+ o sobre asuntos LGBTQ+; incluye la censura basada en objeciones religiosas, morales, políticas y/o sociales.
alternative label: LGBTQ art censorship
alternative label: Censura de arte LGBTQ
broader: LGBTQ+ censorship
change note: Version 4.2.0
has top concept: Censorship
in scheme: v3
preferred label: Censura de arte LGBTQ+
related: LGBTQ+ arts

LGBTQ+ book clubs
type: Concept
issued: 2019-05-14
modified: 2025-02-23
replaces: LGBTQBookClubs
comment: Groups of people gathering regularly to read and discuss written works; use in reference to book clubs with primarily LGBTQ+ membership or book clubs focused on books by LGBTQ+ authors or featuring LGBTQ+ characters and themes.
comment: Grupos de personas que se reúnen periódicamente para leer y discutir trabajos escritos; utilícese en referencia a clubes de lectura con membresía principalmente LGBTQ+ o clubes de lectura centrados en libros de autores LGBTQ+ o que presentan personajes y temas LGBTQ+.
alternative label: LGBTQ book clubs
alternative label: Clubes de lectura LGBTQ
broader: LGBTQ+ clubs and organizations
change note: Version 4.2.0
has top concept: LGBTQ+ clubs and organizations
in scheme: v3
preferred label: Clubes de lectura LGBTQ+
related: LGBTQ+ books

LGBTQ+ challenged books
type: Concept
issued: 2019-05-14
modified: 2025-02-23
replaces: LGBTQChallengedBooks
comment: Books about LGBTQ+ people and issues or written by LGBTQ+ authors that individuals or organizations have attempted to restrict or remove from school curricula, library circulation, or sale.
comment: Libros sobre personas y temas LGBTQ+ o escritos por autores LGBTQ+ que personas u organizaciones han intentado restringir o eliminar de los planes de estudio escolares, la circulación en bibliotecas o la venta.
alternative label: LGBTQ challenged books
alternative label: Libros desafiados LGBTQ
alternative label: Libros impugnados LGBTQ+
broader: LGBTQ+ books
change note: Version 4.2.0
has top concept: LGBTQ+ books
in scheme: v3
preferred label: Libros desafiados LGBTQ+
related: LGBTQ+ book censorship

LGBTQ+ civil disobedience
type: Concept
issued: 2019-05-14
modified: 2025-02-23
replaces: LGBTQCivilDisobedience
comment: The active, professed refusal of LGBTQ+ people to obey certain laws or governmental orders as a form of activism and resistance.
comment: La negación activa y declarada de personas LGBTQ+ a obedecer ciertas leyes u órdenes gubernamentales como forma de activismo y resistencia.
alternative label: LGBTQ civil disobedience
alternative label: Desobediencia civil (LGBTQ)
broader: LGBTQ+ direct action
change note: Version 4.2.0
has top concept: LGBTQ+ activism
in scheme: v3
preferred label: Desobediencia civil LGBTQ+
related: Arrests of LGBTQ+ people

LGBTQ+ co-mothers
type: Concept
issued: 2019-05-14
modified: 2025-02-23
replaces: LGBTQCoMothers
comment: Co-parenting mothers who are LGBTQ+ people. They may or may not be partners.
comment: Madres coparentales que son personas LGBTQ+. Pueden o no ser pareja.
alternative label: LGBTQ co-mothers
alternative label: Co-madres LGBTQ
alternative label: Co-mamás LGBTQ
broader: LGBTQ+ co-parents
broader: Mothers
change note: Version 4.2.0
has top concept: LGBTQ+ families
in scheme: v3
preferred label: Co-madres LGBTQ+

LGBTQ+ co-parenthood
type: Concept
issued: 2019-05-14
modified: 2025-02-23
replaces: LGBTQCoParenthood
comment: The state, experience, and condition of being an LGBTQ+ parent who is parenting with one or more people.
comment: El estado, la experiencia y la condición de ser un padre LGBTQ+ que cría con una o más personas.
alternative label: LGBTQ co-parenthood
alternative label: Co-paternidad LGBTQ+
alternative label: Co-maternidad LGBTQ+
broader: LGBTQ+ parenthood
change note: Version 4.2.0
has top concept: LGBTQ+ parenthood
in scheme: v3
preferred label: Co-maternidad y co-paternidad LGBTQ+
related: LGBTQ+ co-parents

LGBTQ+ conscientious objection
type: Concept
issued: 2019-05-14
modified: 2025-02-23
replaces: LGBTQConscientiousObjection
comment: LGBTQ+ people exercising their right to refuse to perform military service or participate in same-sex marriages on the grounds of freedom of thought, conscience, and/or religion.
comment: Personas LGBTQ+ que ejercen su derecho a negarse a realizar el servicio militar o participar de matrimonios entre personas del mismo sexo por motivos de libertad de pensamiento, conciencia y/o religión.
alternative label: LGBTQ conscientious objection
alternative label: Objeción de conciencia LGBTQ
broader: LGBTQ+ direct action
change note: Version 4.2.0
has top concept: LGBTQ+ activism
in scheme: v3
preferred label: Objeción de conciencia LGBTQ+
related: Same-sex marriage

LGBTQ+ defamation campaigns
type: Concept
issued: 2019-05-14
modified: 2025-02-23
replaces: LGBTQDefamationCampaigns
comment: Publication and dissemination of false statements about LGBTQ+ people, groups, or communities in order to harm their reputations.
comment: Publicación y difusión de declaraciones falsas sobre personas, grupos o comunidades LGBTQ+ con el fin de dañar su reputación.
alternative label: LGBTQ smear campaigns
alternative label: LGBTQ defamation campaigns
broader: LGBTQ+ persecutions
change note: Version 4.2.0
has top concept: LGBTQ+ persecutions
in scheme: v3
preferred label: Campañas de difamación LGBTQ+
related: Hate speech

LGBTQ+ older people's organizations
type: Concept
issued: 2019-05-14
modified: 2025-02-23
replaces: LGBTQOlderPeoplesOrganisations
comment: Organized groups that serve the needs and interests of older LGBTQ+ people, typically those 60 years and older.
comment: Grupos organizados que atienden las necesidades y los intereses de personas mayores LGBTQ+, generalmente aquellas de 60 años o más.
alternative label: Organizaciones para personas envejecientes LGBTQ+
alternative label: Organizaciones para personas LGBTQ+ de tercera edad
alternative label: Organizaciones para personas en su tercera edad (LGBTQ)
broader: LGBTQ+ clubs and organizations
change note: Version 4.2.0
has top concept: LGBTQ+ clubs and organizations
in scheme: v3
preferred label: Organizaciones para personas LGBTQ+ en su tercera edad
preferred label: LGBTQ+ older people's organisations
related: LGBTQ+ older people

LGBTQ+ emancipation
type: Concept
issued: 2019-05-14
modified: 2025-02-23
replaces: LGBTQEmancipation
comment: Term used to describe efforts to obtain LGBTQ+ political rights or equality.
comment: Término utilizado para describir los esfuerzos para obtener igualdad o derechos políticos LGBTQ+.
alternative label: LGBTQ emancipation
alternative label: Emancipación LGBTQ
broader: LGBTQ+ social processes
change note: Version 4.2.0
has top concept: LGBTQ+ social processes
in scheme: v3
preferred label: Emancipación LGBTQ+
related: Gay liberation

LGBTQ+ veterans
type: Concept
issued: 2019-05-14
modified: 2025-02-23
replaces: LGBTQVeterans
comment: LGBTQ+ people who have served in but are no longer active members of the military or armed forces.
comment: Personas LGBTQ+ que han servido pero que ya no son miembros activos del ejército o de las fuerzas armadas.
alternative label: LGBTQ ex-military personnel
alternative label: LGBTQ veterans
broader: LGBTQ+ people
change note: Version 4.2.0
has top concept: LGBTQ+ people
in scheme: v3
preferred label: Veteranos LGBTQ+
related: LGBTQ+ people in the military

LGBTQ+ health care centers
type: Concept
issued: 2019-05-14
modified: 2025-02-23
replaces: LGBTQHealthCareCentres
comment: Institutions providing health services for LGBTQ+ people.
comment: Instituciones que brindan servicios de salud para personas LGBTQ+.
broader: LGBTQ+ centers
change note: Version 4.2.0
has top concept: LGBTQ+ centers
in scheme: v3
preferred label: Centros de salud LGBTQ+
preferred label: LGBTQ+ health care centres
related: Health care for LGBTQ+ people

LGBTQ+ unhoused people
type: Concept
issued: 2019-05-14
modified: 2025-02-23
replaces: LGBTQHomelessPeople
comment: LGBTQ+ people who do not have access to stable, safe, and adequate housing; includes people living in emergency shelters; transitional housing, and on the street.
comment: Personas LGBTQ+ que no tienen acceso a una vivienda estable, segura y adecuada; incluye a personas que viven en refugios de emergencia, viviendas de transición y en la calle.
alternative label: Unhoused people (LGBT)
alternative label: LGBTQ+ homeless people
alternative label: LGBTQ+ houseless people
alternative label: LGBTQ+ unsheltered people
broader: LGBTQ+ people
change note: Version 4.2.0
has top concept: LGBTQ+ people
in scheme: v3
narrower: LGBTQ+ unhoused youth
preferred label: Personas LGBTQ+ sin hogar

LGBTQ+ incarceration
type: Concept
issued: 2019-05-14
modified: 2025-04-17
replaces: LGBTQImprisonment
comment: The restraint of an LGBTQ+ person's liberty against their will, with or without legal process, whether by a government authority, institution, or extrajudicial actors. Generally, this refers to physical and/or legal confinement within a jail, prison, detention center, etc. It may also include the forced confinement of LGBTQ+ people within hospitals and other healthcare facilities.
comment: Confinamiento, incluida la restricción física y/o legal, de personas LGBTQ+ por parte de una institución o autoridad. Típicamente se utiliza para describir el confinamiento en una prisión pública o privada sentenciado por un tribunal dentro de un sistema penal.
alternative label: LGBTQ+ imprisonment
alternative label: Incarceration (LGBTQ)
alternative label: Imprisonment (LGBTQ)
alternative label: Encarcelamiento LGBTQ
broader: Detention of LGBTQ+ people
change note: Version 4.2.0
has top concept: Detention of LGBTQ+ people
in scheme: v3
preferred label: Encarcelamiento LGBTQ+
related: LGBTQ+ incarcerated people

LGBTQ+ incest victims
type: Concept
issued: 2019-05-14
modified: 2025-02-23
replaces: LGBTQIncestVictims
comment: LGBTQ+ people who have experienced incest and may or may not have survived; follow individuals' preference for "victims" or "survivors" whenever possible.
comment: Personas LGBTQ+ que han sufrido el incesto y que pueden o no haber sobrevivido; siga la preferencia de la persona sobre el uso de "víctimas" o "sobrevivientes" siempre que sea posible.
alternative label: LGBTQ victims of incest
alternative label: LGBTQ incest victims
broader: LGBTQ+ victims of sexual abuse
change note: Version 4.2.0
has top concept: LGBTQ+ people
in scheme: v3
narrower: LGBTQ+ incest survivors
preferred label: Víctimas LGBTQ+ de incesto

LGBTQ+ emotions
type: Concept
is replaced by: homoit0000889
issued: 2019-05-14
modified: 2022-10-13
modified: 2025-02-23
replaces: LGBTQEmotions
replaces: LGBTQIntimacy
comment: Feelings of close familiarity or connection between two or more LGBTQ+ people that can be romantic, sexual, or platonic in nature. Can be used to describe the particularities of intimacy as experienced by LGBTQ+ people, as well as the ways intimacy is discussed and expressed within LGBTQ+ communities.
comment: Sentimientos de estrecha familiaridad o una conexión entre dos o más personas LGBTQ+ que pueden ser de naturaleza romántica, sexual o platónica. Puede utilizarse para describir las particularidades de la intimidad experimentada por las personas LGBTQ+, así como las formas en que se discute y expresa la intimidad dentro de las comunidades LGBTQ+.
alternative label: LGBTQ emotions
alternative label: LGBTQ intimacy
alternative label: Intimidad LGBTQ
change note: Version 4.2.0
in scheme: v3
preferred label: LGBTQ+ intimacy
preferred label: Intimidad LGBTQ+

LGBTQ+ literary awards
type: Concept
issued: 2019-05-14
modified: 2025-02-23
replaces: LGBTQLiteraryAwards
comment: Prizes or forms of recognition given in honor of influential LGBTQ+ writers or literary works featuring LGBTQ+ characters and themes.
comment: Premios o formas de reconocimiento otorgados en honor a escritores o obras literarias LGBTQ+ influyentes que presenten personajes y temas LGBTQ+.
alternative label: LGBTQ literary awards
alternative label: Premios literarios LGBTQ
broader: LGBTQ+ awards
change note: Version 4.2.0
has top concept: LGBTQ+ awards
in scheme: v3
preferred label: Premios literarios LGBTQ+
related: LGBTQ+ literature

LGBTQ+ lobbying
type: Concept
issued: 2019-05-14
modified: 2025-02-23
replaces: LGBTQLobbying
comment: Actions taken by individuals or groups to influence legislative action (or non-action), policies, or decisions of government officials in favor of LGBTQ+ people, communities, or issues.
comment: Acciones tomadas por personas o grupos para influir en la acción (o inacción) legislativa, las políticas o las decisiones de funcionarios gubernamentales, a favor de personas, comunidades o asuntos LGBTQ+.
alternative label: LGBTQ lobbying
alternative label: Cabildeo LGBTQ
alternative label: Lobbying LGBTQ+
alternative label: Lobbying LGBTQ
broader: LGBTQ+ direct action
change note: Version 4.2.0
has top concept: LGBTQ+ activism
in scheme: v3
preferred label: Cabildeo LGBTQ+
related: Law

LGBTQ+ museums
type: Concept
is replaced by: homoit0001030
issued: 2019-05-14
modified: 2023-06-30
replaces: LGBTQMuseums
alternative label: LGBTQ museums
broader: LGBTQ+ cultural heritage institutions
change note: Version 4.2.0
has top concept: LGBTQ+ cultural heritage institutions
in scheme: v3
narrower: Asexual museums
narrower: Intersex museums

LGBTQ+ people with visual disabilities
type: Concept
is replaced by: homoit0001854
issued: 2019-05-14
modified: 2022-08-22
replaces: LGBTQPeopleWithVisualDisabilities
alternative label: LGBTQ people with visual impairments
alternative label: People with visual disabilities (LGBTQ)
alternative label: Visually disabled LGBTQ people
alternative label: LGBTQ people with visual disabilities
change note: Version 4.2.0
in scheme: v3

LGBTQ+ platonic love
type: Concept
issued: 2019-05-14
modified: 2025-02-23
replaces: LGBTQPlatonicLove
comment: Deep feelings of affection between two or more LGBTQ+ people that is neither sexual nor romantic.
comment: Sentimientos profundos de afecto entre dos o más personas LGBTQ+ que no son ni sexuales ni románticos.
alternative label: LGBTQ platonic love
alternative label: Queerplatonic
alternative label: Amor platónico LGBTQ
broader: Being in love
change note: Version 4.2.0
has top concept: Being in love
in scheme: v3
preferred label: Amor platónico LGBTQ+
related: Queerplatonic relationships

LGBTQ+ retirement homes
type: Concept
issued: 2019-05-14
modified: 2025-02-23
replaces: LGBTQRetirementHomes
comment: Multi-residence facilities that provide assisted living services to elderly people; use in reference to retirement homes that primarily cater to LGBTQ+ people.
comment: Instalaciones multiresidencia que brindan servicios de vida asistida a personas mayores; utilícese en referencia a casas de retiro que atienden principalmente a personas LGBTQ+.
alternative label: LGBTQ retirement homes
alternative label: Casas de retiro (LGBTQ)
alternative label: Hogares de retiro LGBTQ+
alternative label: Casas de reposo LGBTQ+
alternative label: Hogares de retiro (LGBTQ)
alternative label: Casas de reposo (LGBTQ)
alternative label: Residencias de gente mayor LGBTQ+
alternative label: Residencias de gente mayor (LGBTQ)
change note: Version 4.2.0
in scheme: v3
preferred label: Casas de retiro LGBTQ+
related: LGBTQ+ older people

Schools for LGBTQ+ youth
type: Concept
issued: 2019-05-14
modified: 2025-02-23
replaces: schoolsForLGBTQYouth
comment: Educational institutions providing instruction and resources specifically for LGBTQ+ youth.
comment: Instituciones educativas que brindan instrucción y recursos específicamente para jóvenes LGBTQ+.
alternative label: LGBTQ schools
alternative label: Schools for LGBTQ youth
alternative label: Escuelas LGBTQ+
alternative label: Escuelas LGBTQ
change note: Version 4.2.0
in scheme: v3
preferred label: Escuelas para la juventud LGBTQ+
related: LGBTQ+ youth

LGBTQ+ single mothers
type: Concept
issued: 2019-05-14
modified: 2025-02-23
replaces: LGBTQSingleMothers
comment: LGBTQ+ people who are mothers but are not married or part of a long-term partnership.
comment: Personas LGBTQ+ que son madres pero no están casadas ni en una relación a largo plazo.
alternative label: LGBTQ single mothers
alternative label: Madres solteras LGBTQ
alternative label: Mamás solteras LGBTQ+
broader: LGBTQ+ single parents
broader: Mothers
change note: Version 4.2.0
has top concept: LGBTQ+ families
in scheme: v3
preferred label: Madres solteras LGBTQ+

LGBTQ+ single-parent families
type: Concept
issued: 2019-05-14
modified: 2025-03-20
replaces: LGBTQSingleParentFamilies
comment: Families headed by a single parent; use in reference to single parent families headed by or including LGBTQ+ people.
comment: Familias encabezadas por un solo progenitor; utilícese en referencia a familias monoparentales encabezadas por personas LGBTQ+ o que las incluyan.
alternative label: Single-parent families (LGBTQ)
alternative label: Single parent families (LGBTQ)
alternative label: LGBTQ+ single parent families
change note: Version 4.2.0
in scheme: v3
preferred label: Familias monoparentales LGBTQ+

LGBTQ+ student organizations
type: Concept
issued: 2019-05-14
modified: 2025-02-23
replaces: LGBTQStudentsClubs
comment: Organized clubs and groups composed primarily of LGBTQ+ students.
comment: Grupos organizados compuestos principalmente por estudiantes LGBTQ+.
alternative label: Students organizations (LGBTQ)
alternative label: LGBTQ+ student clubs
alternative label: Student clubs (LGBTQ)
alternative label: LGBTQ+ students' clubs
alternative label: LGBTQ+ students' organizations
alternative label: Students' clubs (LGBTQ)
alternative label: Students' organizations (LGBTQ)
alternative label: Clubs de estudiantes LGBTQ
broader: LGBTQ+ clubs and organizations
change note: Version 4.2.0
has top concept: LGBTQ+ clubs and organizations
in scheme: v3
preferred label: Clubs estudiantiles LGBTQ+
related: LGBTQ+ students

LGBTQ+ suicide
type: Concept
issued: 2019-05-14
modified: 2025-02-23
replaces: LGBTQSuicide
comment: Deaths of LGBTQ+ people as a result of intentional, self-inflicted harm or injury.
comment: Muertes de personas LGBTQ+ como resultado de daños o lesiones intencionales y autoinfligidos.
alternative label: LGBTQ suicide
alternative label: Suicidio LGBTQ
broader: LGBTQ+ death and dying
change note: Version 4.2.0
has top concept: LGBTQ+ death and dying
in scheme: v3
preferred label: Suicidio LGBTQ+
related: Mental health care for LGBTQ+ people

LGBTQ+ support groups
type: Concept
issued: 2019-05-14
modified: 2025-02-23
replaces: LGBTQSupportGroups
comment: Groups of LGBTQ+ people meeting to offer encouragement, comfort, and advice to one another, typically relating to common experiences and issues related to being LGBTQ+.
comment: Grupos de personas LGBTQ+ que se reúnen para ofrecerse aliento, consuelo y consejos, generalmente en relación con experiencias y asuntos comunes relacionados con ser LGBTQ+.
alternative label: LGBTQ support groups
alternative label: Grupos de apoyo LGBTQ
broader: Mental health care for LGBTQ+ people
change note: Version 4.2.0
has top concept: Health care for LGBTQ+ people
in scheme: v3
preferred label: Grupos de apoyo LGBTQ+
related: Recovery groups

Lhamana
type: Concept
issued: 2019-05-14
modified: 2025-02-23
replaces: lhamana
comment: Native American Zuni people assigned male at birth who exhibit mixed gender traits.
comment: Personas del pueblo nativo americano Zuni asignadas al sexo masculino al nacer que exhiben rasgos de género mixto.
broader: Non-Euro-American gender and sexual identities
change note: Version 4.2.0
has top concept: Gender
in scheme: v3
related: Two-Spirit people

Lipstick lesbians
type: Concept
issued: 2019-05-14
modified: 2025-02-23
replaces: lipstickLesbians
comment: Lesbians whose appearance or mannerisms are more traditionally feminine.
comment: Lesbianas cuya apariencia o gestos son más tradicionalmente femeninos.
broader: Lesbians
change note: Version 4.2.0
has top concept: LGBTQ+ people
in scheme: v3
preferred label: Lesbiana lipstick
related: Femmes

Locker rooms
type: Concept
issued: 2019-05-14
modified: 2025-02-23
replaces: lockerRooms
comment: Rooms or areas in public or commercial spaces where people change clothes, bathe, and store items or personal belongings. LGBTQ+ people, particularly trans people, are often restricted from using locker rooms under the pretense of public safety.
comment: Habitaciones o áreas en espacios públicos o comerciales donde las personas se cambian de ropa, se bañan y guardan artículos o efectos personales. A las personas LGBTQ+, en particular a las personas trans, a menudo se les restringe el uso de los vestuarios con el pretexto de seguridad pública.
alternative label: Cambiadores
alternative label: Camarinos
alternative label: Vestuarios
alternative label: Vestidores
broader: Public facilities
change note: Version 4.2.0
has top concept: Public facilities
in scheme: v3
preferred label: Camerinos
related: Bathroom bans

Mati
type: Concept
issued: 2019-05-14
modified: 2025-02-23
replaces: mati
comment: Surinamese-Creole women who have sexual relations with other women but also have had or do have relationships with men.
comment: Mujeres surinamesas-criollas que tienen relaciones sexuales con otras mujeres pero que también han tenido o tienen relaciones con hombres.
broader: Bisexual women
broader: Women who have sex with women
change note: Version 4.2.0
has top concept: LGBTQ+ people
in scheme: v3

Misandry
type: Concept
issued: 2019-05-14
modified: 2025-02-23
replaces: misandry
comment: Hate or dislike of men or boys.
comment: Odio o desagrado hacia los hombres o los niños.
change note: Version 4.2.0
in scheme: v3
preferred label: Misandria
related: Intolerance towards LGBTQ+ people

Mud sex
type: Concept
issued: 2019-05-14
modified: 2025-02-23
replaces: mudSex
comment: Sexual activities that take place outside in mud.
comment: Actividades sexuales que se llevan a cabo al aire libre en el barro.
broader: Sex (Act)
broader: Sexual practices
change note: Version 4.2.0
has top concept: Sex (Act)
in scheme: v3
preferred label: Sexo en el barro

Nudism
type: Concept
issued: 2019-05-14
modified: 2025-02-23
replaces: nudism
comment: Practice of engaging in social activities while nude, either in private or public. This term also refers to the cultural movement advocating for nudism as an alternative, healthy lifestyle.
comment: Práctica de participar en actividades sociales al desnudo, ya sea en privado o en público. Este término también se refiere al movimiento cultural que aboga por el nudismo como un estilo de vida alternativo y saludable.
alternative label: Naturism
alternative label: Naturismo
change note: Version 4.2.0
in scheme: v3
preferred label: Nudismo
related: Nude beaches

Tantric sex
type: Concept
issued: 2019-05-14
modified: 2025-02-23
replaces: tantricSex
comment: Traditionally refers to a wide range of practices in Hindu and Buddhist yoga usually involving the ritual exercise of sexuality. Do not use outside of these contexts.
comment: Tradicionalmente se refiere a una amplia gama de prácticas de yoga hindú y budista que generalmente implican el ejercicio ritual de la sexualidad. No se debe utilizar fuera de estos contextos.
alternative label: Neotantra
broader: Sex (Act)
broader: Sexual practices
change note: Version 4.2.0
has top concept: Sex (Act)
in scheme: v3
preferred label: Sexo tántrico

Niizh manidoowag
type: Concept
issued: 2019-05-14
modified: 2025-02-23
replaces: niizhManidoowag
comment: Native American Ojibwa term for Two-Spirit people.
comment: Término nativoamericano ojibwa para referirse a las personas dos espíritus.
broader: Non-Euro-American gender and sexual identities
change note: Version 4.2.0
has top concept: Gender
in scheme: v3
related: Two-Spirit people

Ninauposkitzipxpe
type: Concept
issued: 2019-05-14
modified: 2025-02-23
replaces: ninauposkitzipxpe
comment: Used in Native American Blackfoot tribes for people assigned female at birth who are not constrained to the social roles of women; translates to "manly-hearted woman."
comment: Se utiliza en las tribus nativo americanas blackfoot para personas asignadas al sexo femenino al nacer que no están limitadas a los roles sociales de las mujeres; se traduce a "mujer de corazón varonil".
broader: Non-Euro-American gender and sexual identities
change note: Version 4.2.0
has top concept: Gender
in scheme: v3
related: Two-Spirit people

Nude beaches
type: Concept
issued: 2019-05-14
modified: 2025-02-23
replaces: nudeBeaches
comment: Beaches that permit nudity.
comment: Playas que permiten la desnudez.
broader: LGBTQ+ beaches
change note: Version 4.2.0
has top concept: LGBTQ+ meeting places
in scheme: v3
preferred label: Playas nudistas
related: Nudism

Nude photographs
type: Concept
issued: 2019-05-14
modified: 2025-02-23
replaces: nudePhotographs
comment: Images of naked individuals, including those taken by amateurs or professionals; may be produced for aesthetic or erotic purposes.
comment: Imágenes de personas desnudas, incluidas las tomadas por aficionados o profesionales; pueden producirse con fines estéticos o eróticos.
alternative label: Nudes
alternative label: Fotos desnudas
alternative label: Desnudos
alternative label: Fotografías de desnudos
alternative label: Fotos de desnudos
broader: Nude art
change note: Version 4.2.0
has top concept: Nude art
in scheme: v3
preferred label: Fotos nudistas
related: LGBTQ+ arts

Older bisexual people
type: Concept
issued: 2019-05-14
modified: 2025-02-23
replaces: olderBisexualPeople
comment: Bisexual people who are advanced in age, typically over 60 years of age.
comment: Personas bisexuales de edad avanzada, normalmente mayores de 60 años.
alternative label: Personas ancianas bisexuales
alternative label: Personas en su tercera edad bisexuales
alternative label: Personas de tercera edad bisexuales
broader: Bisexual people
broader: LGBTQ+ older people
change note: Version 4.2.0
has top concept: LGBTQ+ people
in scheme: v3
preferred label: Personas mayores bisexuales

Older gay men
type: Concept
issued: 2019-05-14
modified: 2025-02-23
replaces: olderGayMen
comment: Gay men who are advanced in age, typically over 60 years of age.
comment: Hombres gay de edad avanzada, normalmente mayores de 60 años.
alternative label: Hombres gay ancianos
alternative label: Hombres en su tercera edad gay
alternative label: Hombres de tercera edad gay
broader: LGBTQ+ older people
broader: Gay men
change note: Version 4.2.0
has top concept: LGBTQ+ people
in scheme: v3
preferred label: Hombres gay mayores

Older lesbians
type: Concept
issued: 2019-05-14
modified: 2025-02-23
replaces: olderLesbians
comment: Lesbians who are advanced in age, typically over 60 years of age.
comment: Lesbianas de edad avanzada, normalmente mayores de 60 años.
alternative label: Lesbianas ancianas
alternative label: Lesbianas en su tercera edad
alternative label: Lebianas de tercera edad
broader: LGBTQ+ older people
broader: Lesbians
change note: Version 4.2.0
has top concept: LGBTQ+ people
in scheme: v3
preferred label: Lesbianas mayores

Older transgender people
type: Concept
issued: 2019-05-14
modified: 2025-02-23
replaces: olderTransgenderPeople
comment: Transgender people who are advanced in age, typically over 60 years of age.
comment: Personas transgénero de edad avanzada, normalmente mayores de 60 años.
alternative label: Personas ancianas transgénero
alternative label: Personas en su tercera edad transgénero
alternative label: Personas de tercera edad transgénero
broader: LGBTQ+ older people
broader: Transgender people
change note: Version 4.2.0
has top concept: LGBTQ+ people
in scheme: v3
preferred label: Personas mayores transgénero

Orchiectomy
type: Concept
issued: 2019-05-14
modified: 2025-02-23
replaces: orchiectomy
comment: Medical procedure to remove one or more testes; often part of gender affirming surgery, though it can be performed for other reasons.
comment: Procedimiento médico para extirpar uno o más testículos; a menudo forma parte de la cirugía de afirmación de género, aunque se puede realizar por otras razones.
broader: Castration
broader: Bottom surgery
change note: Version 4.2.0
has top concept: Castration
in scheme: v3
preferred label: Orquiectomía

Organizations for sexual research and sexual reform
type: Concept
issued: 2019-05-14
modified: 2025-02-23
replaces: organisationsForSexualResearchAndSex
comment: Institutions or groups dedicated to research, education, policy work, and advocacy regarding human sexuality and sexual behavior, particularly to challenge taboos and encourage more open discussion of sex and sexuality within society.
comment: Instituciones o grupos dedicados a la investigación, la educación, el trabajo de políticas y la defensa de la sexualidad humana y el comportamiento sexual, en particular para desafiar los tabúes y fomentar un debate más abierto sobre el sexo y la sexualidad dentro de la sociedad.
alternative label: Sexual reform organizations
alternative label: Sexual research organizations
alternative label: Organizaciones por la reforma sexual
alternative label: Organzaciones por la investigación sexual
alternative label: Organizaciones por la investigación y reforma sexual
broader: Sexuality
change note: Version 4.2.0
has top concept: Sexuality
in scheme: v3
preferred label: Organizaciones para la investigación y reforma sexual
preferred label: Organisations for sexual research and sexual reform
related: LGBTQ+ clubs and organizations

Pangender identity
type: Concept
issued: 2019-05-14
modified: 2025-02-23
replaces: pangenderIdentity
comment: Gender identity that encompasses multiple or all genders.
comment: Identidad de género que abarca múltiples o todos los géneros.
broader: Gender identity
change note: Version 4.2.0
has top concept: Gender
in scheme: v3
preferred label: Identidad pangénero
related: Pangender people

Parents of crossdressers
type: Concept
issued: 2019-05-14
modified: 2025-02-23
replaces: parentsOfCrossdressers
comment: People who act as parents to one or more crossdresser. Only use to describe the parents of someone who self-identifies as a crossdresser.
comment: Personas que actúan como padres de uno o más transformistas. Utilícese únicamente para describir a los padres de alguien que se autoidentifican como transformistas.
alternative label: Madres de transformistas
alternative label: Padres de transformistas
broader: Parents
change note: Version 4.2.0
has top concept: Family members
in scheme: v3
preferred label: Madres y padres de transformistas
related: Crossdressers

Parents of queer people
type: Concept
issued: 2019-05-14
modified: 2025-02-23
replaces: parentsOfQueerPeople
comment: People who act as parents to one or more queer person. For parents who are themselves queer, use the term "Queer parents."
comment: Personas que actúan como padres de una o más personas queer. Para los padres que son queer, utilice el término "madres y padres queer".
alternative label: Queer people's parents
alternative label: Madres de personas queer
alternative label: Padres de personas queer
broader: Parents of LGBTQ+ people
change note: Version 4.2.0
has top concept: Family members
in scheme: v3
preferred label: Madres y padres de personas queer
related: Queer people

Parents of transgender people
type: Concept
issued: 2019-05-14
modified: 2025-02-23
replaces: parentsOfTransgenderPeople
comment: People who act as parents to one or more transgender person. For parents who are themselves transgender, use the term "Transgender parents."
comment: Personas que actúan como padres de una o más personas transgénero. Para los padres que son transgénero, utilice el término "madres y padres transgénero".
alternative label: Transgender people's parents
alternative label: Padres de personas transgénero
alternative label: Madres de personas transgénero
broader: Parents of LGBTQ+ people
change note: Version 4.2.0
has top concept: Family members
in scheme: v3
preferred label: Padres y madres de personas transgénero
related: Transgender people

Partial androgen insensitivity syndrome
type: Concept
issued: 2019-05-14
modified: 2025-02-23
replaces: partialAndrogenInsensitivitySyndrome
comment: People with partial androgen insensitivity (PAIS) have some response to testosterone, but not as much as is typical for people with XY chromosomes without androgen insensitivity. People with PAIS may be born with testes that are undescended or partially descended and with genital differences such as a vaginal opening that is shallower than typical, a phallus that may be perceived as a large clitoris or a small penis, and variations affecting their urethra. They might also be born with genitals that look more like a penis or like a vulva and vagina. In adolescence, people with PAIS may develop some features that are associated with a typical testosterone puberty and others that are associated with a typical estrogen puberty since their body responds to some of the testosterone that their gonads produce while the rest is converted into estrogen.
comment: Las personas con insensibilidad parcial a los andrógenos (PAIS, por sus siglas en inglés) tienen cierta respuesta a la testosterona, pero no tanta como es típica de las personas con cromosomas XY sin insensibilidad a los andrógenos. Las personas con PAIS pueden nacer con testículos no descendidos o parcialmente descendidos y con diferencias genitales, como una apertura vaginal menos profunda de lo normal, un falo que puede percibirse como un clítoris grande o un pene pequeño y variaciones que afectan la uretra. También pueden nacer con genitales que se parecen más a un pene o a una vulva y vagina. En la adolescencia, las personas con PAIS pueden desarrollar algunas características asociadas con una pubertad típica de testosterona y otras asociadas con una pubertad típica de estrógeno, ya que su cuerpo responde a parte de la testosterona que producen sus gónadas mientras el resto se convierte en estrógeno.
alternative label: PAIS
alternative label: SIAP
alternative label: Síndrome de insensibilidad androgénica parcial
alternative label: Síndrome de insensibilidad parcial a los andrógeno
broader: Androgen insensitivity syndrome
broader: Intersex variations
change note: Version 4.2.0
has top concept: Sex (Body)
in scheme: v3
preferred label: Síndrome de insensibilidad andrógena parcial

Partners of crossdressers
type: Concept
issued: 2019-05-14
modified: 2025-02-23
replaces: partnersOfCrossdressers
comment: People whose sexual, romantic, or play partner is a crossdresser. Only use to describe individuals whose partners self-identify as crossdressers.
comment: Personas cuya pareja sexual, romántica o de juego es transformista. Utilícese únicamente para describir personas cuyas parejas se autoidentifiquen como transformistas.
broader: Partners
change note: Version 4.2.0
has top concept: Partners
in scheme: v3
preferred label: Parejas de transformistas
related: Crossdressers

Passive immune therapy
type: Concept
issued: 2019-05-14
modified: 2025-02-23
replaces: passiveImmuneTherapy
comment: A medical treatment in which a person receives laboratory-made antibodies to help fight an infection or disease.
comment: Un tratamiento médico en el que una persona recibe anticuerpos fabricados en laboratorio para ayudar a combatir una infección o enfermedad.
broader: Medication
change note: Version 4.2.0
has top concept: Medical care
in scheme: v3
preferred label: Inmunoterapia pasiva
related: HIV/AIDS

Penectomy
type: Concept
issued: 2019-05-14
modified: 2025-02-23
replaces: penectomy
comment: Surgical removal of the penis.
comment: Extirpación quirúrgica del pene.
broader: Castration
broader: Bottom surgery
change note: Version 4.2.0
has top concept: Castration
in scheme: v3
preferred label: Penectomía

Penile plethysmography
type: Concept
issued: 2019-05-14
modified: 2025-02-23
replaces: penilePlethysmography
comment: Assessments of penile tumescence in response to erotic stimuli in order to test an individual's sexual preference or excitement.
comment: Evaluaciones de la tumescencia del pene en respuesta a estímulos eróticos para probar la preferencia o excitación sexual de una persona.
alternative label: Penile response measurement
alternative label: Phallometry
change note: Version 4.2.0
in scheme: v3
preferred label: Pletismografía peneana
related: Penis

Persecution of gay men
type: Concept
issued: 2019-05-14
modified: 2025-02-23
replaces: persecutionOfGayMen
comment: Systematic mistreatment of gay men on the basis of their sexual identity.
comment: Maltrato sistemático a hombres gay por su identidad sexual.
broader: LGBTQ+ persecutions
change note: Version 4.2.0
has top concept: LGBTQ+ persecutions
in scheme: v3
preferred label: Persecución de hombres gay
related: Gay men

Persecution of lesbians
type: Concept
issued: 2019-05-14
modified: 2025-02-23
replaces: persecutionOfLesbians
comment: Systematic mistreatment of lesbians on the basis of their sexual identity.
comment: Maltrato sistemático a lesbianas por su identidad sexual.
broader: LGBTQ+ persecutions
change note: Version 4.2.0
has top concept: LGBTQ+ persecutions
in scheme: v3
preferred label: Persecución de lesbianas
related: Lesbians

Persecution of queer people
type: Concept
issued: 2019-05-14
modified: 2025-02-23
replaces: persecutionOfQueerPeople
comment: Systematic mistreatment of queer people on the basis of their gender and/or sexual identities.
comment: Maltrato sistemático a personas queer por su género y/o identidad sexual.
broader: LGBTQ+ persecutions
change note: Version 4.2.0
has top concept: LGBTQ+ persecutions
in scheme: v3
preferred label: Persecución de personas queer
related: Queer people

Persecution of transgender people
type: Concept
issued: 2019-05-14
modified: 2025-02-23
replaces: persecutionOfTransgenderPeople
comment: Systematic mistreatment of transgender people on the basis of their gender identity.
comment: Maltrato sistemático a personas transgénero por su identidad de género.
broader: LGBTQ+ persecutions
change note: Version 4.2.0
has top concept: LGBTQ+ persecutions
in scheme: v3
preferred label: Persecución de personas transgénero
related: Transgender people

Phone sex
type: Concept
issued: 2019-05-14
modified: 2025-02-23
replaces: phoneSex
comment: Sexual encounters that take place over the phone, whether in a phone call or on a video call using a smartphone.
comment: Encuentros sexuales que se desarrollan a través del teléfono, ya sea en una llamada telefónica o en una videollamada mediante un smartphone.
alternative label: Telephone sex
alternative label: Sexo telefónico
broader: Sex (Act)
broader: Sexual practices
change note: Version 4.2.0
has top concept: Sex (Act)
in scheme: v3
preferred label: Sexo por teléfono

Phone sex workers
type: Concept
issued: 2019-05-14
modified: 2025-02-23
replaces: phoneSexWorkers
comment: People who perform real-time sex work via phone calls, text messaging, or online voice calls. Use "Cam models" for individuals who perform real-time sex work via streaming video or video calls.
alternative label: Phone sex operators
alternative label: Telephone sex workers
alternative label: Telephone sex operators
alternative label: Operadores de sexo por teléfono
broader: Sex workers
change note: Version 4.2.0
has top concept: Sex workers
in scheme: v3
preferred label: Trabajadores sexuales por telefono
related: Phone sex work

Poppers
type: Concept
issued: 2019-05-14
modified: 2025-08-14
replaces: poppers
comment: A slang term commonly used in LGBTQ+ subcultures to describe alkyl nitrites, a class of drug that produces a high when inhaled. Poppers are often associated with gay nightlife because they can be used to facilitate anal sex by relaxing the anal muscles.
comment: Un término de jerga comúnmente utilizado en subculturas LGBTQ+ para describir los nitritos de alquilo, una clase de droga que produce un efecto estimulador cuando se inhala. Los poppers a menudo se asocian con la vida nocturna gay porque pueden utilizarse para facilitar el sexo anal al relajar los músculos anales.
alternative label: Tape head cleaner
broader: LGBTQ+ slang
change note: Version 4.2.0
has top concept: LGBTQ+ slang
in scheme: v3
related: Cocaine

Public showers
type: Concept
issued: 2019-05-14
modified: 2025-02-23
replaces: publicShowers
comment: Public or commercial facilities equipped with showers or places to bathe.
comment: Instalaciones públicas o comerciales equipadas con duchas o lugares para bañarse.
broader: Public facilities
change note: Version 4.2.0
has top concept: Public facilities
in scheme: v3
preferred label: Duchas públicas
related: Bathroom bans

Quariwarmi
type: Concept
issued: 2019-05-14
modified: 2025-02-23
replaces: quariwarmi
comment: North American Inca term for people assigned male at birth who fulfill a third gender role that is often spiritual in nature.
comment: Término quechua andino para personas asignadas al sexo masculino al nacer que cumplen un rol de tercer género que a menudo es de naturaleza espiritual.
broader: Non-Euro-American gender and sexual identities
change note: Version 4.2.0
has top concept: Gender
in scheme: v3
preferred label: Qariwarmi
related: Two-Spirit people

Queer activism
type: Concept
issued: 2019-05-14
modified: 2025-02-23
replaces: queerActivism
comment: Direct action and organizing to achieve political or social change and acceptance for queer people.
comment: Acción directa y organización para lograr el cambio político o social y la aceptación de las personas queer.
broader: LGBTQ+ activism
change note: Version 4.2.0
has top concept: LGBTQ+ activism
in scheme: v3
preferred label: Activismo queer
related: Queer political activists

Queer archives
type: Concept
issued: 2019-05-14
modified: 2025-02-23
replaces: queerArchives
comment: Collections of records and materials relating to queer people or queer communities; can include a variety of organizations and institutions from community to government archives.
comment: Colecciones de registros y materiales relacionados con personas queer o comunidades queer; puede incluir una variedad de organizaciones e instituciones, desde archivos comunitarios hasta gubernamentales.
broader: LGBTQ+ archives
change note: Version 4.2.0
has top concept: LGBTQ+ cultural heritage institutions
in scheme: v3
preferred label: Archivos queer
related: Queer (Verb)

Asian American queer people
type: Concept
issued: 2019-05-14
modified: 2025-02-23
replaces: queerAsianAmericans
comment: Queer people of Asian heritage or descent born in the United States or born in Asian countries who live in or have a strong connection to the United States. Only use for individuals who self-identify as Asian American.
comment: Personas queer de ascendencia asiática nacidas en Estados Unidos o personas queer nacidas en países asiáticos que viven en o tienen una conexión fuerte con los Estados Unidos. Utilícese para personas que se autoidentifiquen como asiático-americanas.
alternative label: Queer Asian American people
alternative label: Queer Asian Americans
alternative label: Personas asiático-americanas queer
alternative label: Asiático-americanos queer
alternative label: Asiático-americanas queer
broader: Asian American LGBTQ+ people
broader: Asian queer people
change note: Version 4.2.0
has top concept: LGBTQ+ people
in scheme: v3
preferred label: Personas queer asiático-americanas

Asian queer people
type: Concept
issued: 2019-05-14
modified: 2025-02-23
replaces: queerAsians
comment: Queer people of Asian heritage or descent, living in Asia or part of the Asian diaspora. Only use for people who self-identify as Asian.
comment: Personas queer nacidas o descendientes de países asiáticos. Utilícese únicamente para las personas que se autoidentifiquen como asiáticas.
alternative label: Queer Asian people
alternative label: Queer Asians
alternative label: Personas asiáticas queer
alternative label: Asiáticos queer
alternative label: Asiáticas queer
broader: Asian LGBTQ+ people
change note: Version 4.2.0
has top concept: LGBTQ+ people
in scheme: v3
narrower: Asian American queer people
preferred label: Personas queer asiáticas

Queer bars
type: Concept
issued: 2019-05-14
modified: 2025-02-23
replaces: queerBars
comment: Drinking establishments that primarily cater to queer people.
comment: Establecimientos de bebidas que atienden principalmente a personas queer.
broader: LGBTQ+ bars
change note: Version 4.2.0
has top concept: LGBTQ+ meeting places
in scheme: v3
preferred label: Bares queer
related: Queer community

Black queer people
type: Concept
issued: 2019-05-14
modified: 2025-02-23
replaces: queerBlackPeople
comment: Black people who are queer. Use only for individuals who self-identity as Black. Follow the individual’s preference for African American or Black whenever possible.
comment: Personas negras que son queer. Utilícese únicamente para personas que seautoidentificancomo negras. Siga la preferencia del individuo para el uso de afroamericanos o negros siempre que sea posible.
alternative label: Queer Black people
alternative label: Personas negras queer
broader: Black LGBTQ+ people
change note: Version 4.2.0
has top concept: LGBTQ+ people
in scheme: v3
preferred label: Personas queer negras
related: Black queer archives

Queer drama
type: Concept
issued: 2019-05-14
modified: 2025-02-23
replaces: queerDrama
comment: Works of fiction written to be performed; use in reference to dramatic works focusing on queer characters or themes.
comment: Obras de ficción escritas para ser puestas en escena; utilícese en referencia a obras dramáticas que se centran en personajes o temas queer.
broader: LGBTQ+ drama
change note: Version 4.2.0
has top concept: Subcultures
in scheme: v3
preferred label: Drama queer
related: Queer authors

Queer information centers
type: Concept
issued: 2019-05-14
modified: 2025-02-23
replaces: queerInformationCentres
comment: Institutions that provide education, support, and information about queerness and queer communities to queer people.
comment: Instituciones que brindan educación, apoyo e información sobre lo queer y comunidades queer a personas queer.
broader: LGBTQ+ information centers
change note: Version 4.2.0
has top concept: LGBTQ+ centers
in scheme: v3
preferred label: Centros de información queer
preferred label: Queer information centres
related: Queer movement

Queer Pagans
type: Concept
issued: 2019-05-14
modified: 2025-02-23
replaces: queerPagans
comment: Queer people who are members of polytheistic religions or other religions outside of the dominant culture that typically incorporate nature worship and/or the sacred feminine, such as Wicca, Druidry, Heathenry, etc. Use to describe queer people who self-identify as Pagan.
comment: Personas queer que son miembros de religiones politeístas u otras religiones fuera de la cultura dominante que típicamente incorporan el culto a la naturaleza y/o lo sagrado femenino, como la Wicca, el druidismo, el paganismo, etc. Utilícese para describir a las personas queer que se autoidentifiquen como paganas.
broader: LGBTQ+ Pagans
change note: Version 4.2.0
has top concept: LGBTQ+ African religions
in scheme: v3
preferred label: Paganos queer
related: Queer witches

Queer poetry
type: Concept
issued: 2019-05-14
modified: 2025-02-23
replaces: queerPoetry
comment: Literary works, typically written in verse, that focus on queer characters, themes, or identity.
comment: Obras literarias, normalmente escritas en verso, que se centran en personajes, temas o identidades queer.
broader: LGBTQ+ poetry
change note: Version 4.2.0
has top concept: Subcultures
in scheme: v3
preferred label: Poesía queer
related: Queer authors

Queer political activists
type: Concept
issued: 2019-05-14
modified: 2025-02-23
replaces: queerPoliticalActivists
comment: Queer people working to bring about political or social change through public organizing.
comment: Personas queer que trabajan para lograr cambios políticos o sociales a través de la organización pública.
broader: LGBTQ+ political activists
change note: Version 4.2.0
has top concept: LGBTQ+ people
in scheme: v3
preferred label: Activistas políticos queer
related: Queer activism

Queer press
type: Concept
issued: 2019-05-14
modified: 2025-02-23
replaces: queerPress
comment: Newspapers, magazines, or other publishing outlets aimed at queer audiences and/or operated by queer people.
comment: Periódicos, revistas u otros medios editoriales dirigidos a audiencias queer y/o operados por personas queer.
broader: LGBTQ+ press
change note: Version 4.2.0
has top concept: LGBTQ+ press
in scheme: v3
narrower: Queer zines
preferred label: Prensa queer

Queer radio
type: Concept
issued: 2019-05-14
modified: 2026-02-23
replaces: queerRadio
comment: Auditory content broadcast on the radio (analog or digital) about queer people and queer issues.
comment: Contenido auditivos difundido por radio (analógica o digital) sobre personas y asuntos queer.
broader: LGBTQ+ radio
change note: Version 4.2.0
has top concept: LGBTQ+ radio
in scheme: v3
preferred label: Radio queer
related: Queer podcasts

Queer slang
type: Concept
issued: 2019-05-14
modified: 2025-02-23
replaces: queerSlang
comment: Colloquial or informal language related to queer people or used by queer people.
comment: Lenguaje coloquial o informal relacionado con personas queer o utilizado por personas queer.
alternative label: Argot queer
broader: LGBTQ+ slang
change note: Version 4.2.0
has top concept: LGBTQ+ slang
in scheme: v3
preferred label: Jerga queer
related: Reclaimed terms

Queer survivors of hate crimes
type: Concept
issued: 2019-05-14
modified: 2025-02-23
replaces: queerSurvivorsOfHateCrimes
comment: Queer people who have experienced and survived hate crimes; follow the individual's preference for "victims" or "survivors" whenever possible.
comment: Personas queer que han sufrido y sobrevivido crímenes de odio; siga la preferencia de la persona sobre el uso de "víctimas" o "sobrevivientes" siempre que sea posible.
broader: Queer victims of hate crimes
broader: LGBTQ+ survivors of hate crimes
change note: Version 4.2.0
has top concept: LGBTQ+ people
in scheme: v3
preferred label: Sobrevivientes queer de crímenes de odio

Queer survivors of rape
type: Concept
issued: 2019-05-14
modified: 2025-02-23
replaces: queerSurvivorsOfRape
comment: Queer people who have experienced and survived rape; follow the individual's preference for "victims" or "survivors" whenever possible.
comment: Personas queer que han sufrido y sobrevivido una violación; siga la preferencia de la persona sobre el uso de "víctimas" o "sobrevivientes" siempre que sea posible.
broader: Queer victims of rape
broader: LGBTQ+ survivors of rape
change note: Version 4.2.0
has top concept: LGBTQ+ people
in scheme: v3
preferred label: Sobrevivientes queer de violación

Queer survivors of sexual abuse
type: Concept
issued: 2019-05-14
modified: 2025-02-23
replaces: queerSurvivorsOfSexualAbuse
comment: Queer people who have experienced and survived sexual abuse; follow the individual's preference for "victims" or "survivors" whenever possible.
comment: Personas queer que han sufrido y sobrevivido abuso sexual; siga la preferencia de la persona sobre el uso de "víctimas" o "sobrevivientes" siempre que sea posible.
broader: Queer victims of sexual abuse
broader: LGBTQ+ survivors of sexual abuse
change note: Version 4.2.0
has top concept: LGBTQ+ people
in scheme: v3
preferred label: Sobrevivientes queer de abuso sexual

Queer survivors of war
type: Concept
issued: 2019-05-14
modified: 2025-02-23
replaces: queerSurvivorsOfWar
comment: Queer people who have experienced and survived war; follow the individual's preference for "victims" or "survivors" whenever possible.
comment: Personas queer que han sufrido y sobrevivido la guerra; siga la preferencia de la persona sobre el uso de "víctimas" o "sobrevivientes" siempre que sea posible.
broader: Queer victims of war
broader: LGBTQ+ survivors of war
change note: Version 4.2.0
has top concept: LGBTQ+ people
in scheme: v3
preferred label: Sobrevivientes queer de guerra

Queer victims of hate crimes
type: Concept
issued: 2019-05-14
modified: 2025-02-23
replaces: queerVictimsOfHateCrimes
comment: Queer people who have experienced hate crimes and may or may not have survived; follow the individual's preference for "victims" or "survivors" whenever possible.
comment: Personas queer que han sufrido crímenes de odio y pueden o no haber sobrevivido; siga la preferencia de la persona sobre el uso de "víctimas" o "sobrevivientes" siempre que sea posible.
broader: LGBTQ+ victims of hate crimes
change note: Version 4.2.0
has top concept: LGBTQ+ people
in scheme: v3
narrower: Queer survivors of hate crimes
preferred label: Víctimas queer de crímenes odio

Queer victims of rape
type: Concept
issued: 2019-05-14
modified: 2025-02-23
replaces: queerVictimsOfRape
comment: Queer people who have experienced rape and may or may not have survived; follow the individual's preference for "victims" or "survivors" whenever possible.
comment: Personas queer que han sufrido una violación y pueden o no haber sobrevivido; siga la preferencia de la persona sobre el uso de "víctimas" o "sobrevivientes" siempre que sea posible.
broader: LGBTQ+ victims of rape
change note: Version 4.2.0
has top concept: LGBTQ+ people
in scheme: v3
narrower: Queer survivors of rape
preferred label: Víctimas queer de violación

Queer victims of sexual abuse
type: Concept
issued: 2019-05-14
modified: 2025-02-23
replaces: queerVictimsOfSexualAbuse
comment: Queer people who have experienced sexual abuse and may or may not have survived; follow the individual's preference for "victims" or "survivors" whenever possible.
comment: Personas queer que han sufrido abuso sexual y pueden o no haber sobrevivido; siga la preferencia de la persona sobre el uso de "víctimas" o "sobrevivientes" siempre que sea posible.
broader: LGBTQ+ victims of sexual abuse
change note: Version 4.2.0
has top concept: LGBTQ+ people
in scheme: v3
narrower: Queer survivors of sexual abuse
preferred label: Víctimas queer de abuso sexual

Queer victims of war
type: Concept
issued: 2019-05-14
modified: 2025-02-23
replaces: queerVictimsOfWar
comment: Queer people who have experienced war and may or may not have survived; follow the individual's preference for "victims" or "survivors" whenever possible.
comment: Personas queer que han sufrido la guerra y que pueden haber sobrevivido o no; siga la preferencia de la persona sobre el uso de "víctimas" o "sobrevivientes" siempre que sea posible.
broader: LGBTQ+ victims of war
change note: Version 4.2.0
has top concept: LGBTQ+ people
in scheme: v3
narrower: Queer survivors of war
preferred label: Víctimas queer de guerra

Queer women
type: Concept
issued: 2019-05-14
modified: 2025-02-23
replaces: queerWomen
comment: Women who identify as queer.
comment: Mujeres que se identifican como queer.
broader: Queer people
change note: Version 4.2.0
has top concept: LGBTQ+ people
in scheme: v3
preferred label: Mujeres queer
related: Lesbians

Queer youth literature
type: Concept
issued: 2019-05-14
modified: 2025-02-23
replaces: queerYouthLiterature
comment: Written literary works for an audience of readers from 12-18 years of age, also known as young adult literature or YA; use in reference to youth literature focusing on queer characters or themes.
comment: Obras literarias escritas para una audiencia de lectores de 12 a 18 años de edad, también conocidas como literatura para adultos jóvenes o YA (por sus siglas en inglés); utilícese en referencia a la literatura juvenil que se centra en personajes o temas queer.
broader: LGBTQ+ youth literature
change note: Version 4.2.0
has top concept: Subcultures
in scheme: v3
preferred label: Literatura juvenil queer
related: Queer youth

Rubbermen
type: Concept
issued: 2019-05-14
modified: 2025-02-23
replaces: rubbermen
comment: Men who have fetishes for or engage in fetish activities involving rubber and belong to the rubber community; frequently associated with U.S. LGBTQ+ subcultures.
comment: Hombres que tienen fetiches con o participan de actividades fetichistas relacionadas con la goma y pertenecen a la comunidad de la goma; frecuentemente asociados con las subculturas LGBTQ+ de EE. UU.
broader: Rubber and latex community
change note: Version 4.2.0
has top concept: LGBTQ+ communities
in scheme: v3
related: Rubberwomen

Rubberwomen
type: Concept
issued: 2019-05-14
modified: 2025-02-23
replaces: rubberwomen
comment: Women who have fetishes for or engage in fetish activities involving rubber and belong to the rubber community; frequently associated with U.S. LGBTQ+ subcultures.
comment: Mujeres que tienen fetiches con o participan de actividades fetichistas relacionadas con la goma y pertenecen a la comunidad de la goma; frecuentemente asociadas con las subculturas LGBTQ+ de EE. UU.
broader: Rubber and latex community
change note: Version 4.2.0
has top concept: LGBTQ+ communities
in scheme: v3
related: Rubbermen

Safer sex parties
type: Concept
issued: 2019-05-14
modified: 2025-02-23
replaces: saferSexParties
comment: Social gatherings or events originating from Black lesbian communities in the Southern United States in the 1990s. Safer sex parties are typically held at private locations where organizers and participants discuss safer sex practices, sexuality, and sexual experiences.
comment: Encuentros o eventos sociales originados en comunidades de lesbianas negras en el sur de los Estados Unidos en la década de 1990. Las fiestas de sexo más seguro generalmente se llevan a cabo en lugares privados donde quienes organizan y participan discuten prácticas sexuales más seguras, la sexualidad y las experiencias sexuales.
broader: Sex parties
change note: Version 4.2.0
has top concept: Sex locations
in scheme: v3
preferred label: Fiestas de sexo más seguro
related: Safer sex

Sea queens
type: Concept
issued: 2019-05-14
modified: 2025-02-23
replaces: seaQueens
comment: Term used before the 1960s to describe gay men who worked aboard ships, mainly merchant vessels.
comment: Término utilizado antes de la década de 1960 para describir a los hombres gay que trabajaban a bordo de barcos, principalmente buques mercantes.
alternative label: Reinas del mar
broader: LGBTQ+ historical terms
change note: Version 4.2.0
has top concept: LGBTQ+ historical terms
in scheme: v3
related: Gay men

Seduction
type: Concept
issued: 2019-05-14
modified: 2025-02-23
replaces: seduction
comment: Enticing or tempting someone into something, typically sexual attraction or activity, through the use of persuasion, flattery, and/or promises.
comment: Atraer o tentar a alguien a algo, generalmente atracción o actividad sexual, mediante el uso de persuasión, halagos y/o promesas.
alternative label: Temptation
alternative label: Tentación
change note: Version 4.2.0
in scheme: v3
preferred label: Seducción
related: Sexuality

Sex education
type: Concept
issued: 2019-05-14
modified: 2025-02-23
replaces: sexEducation
comment: Instruction about sexual health and sexuality, including topics such as consent, safer sex, transmission of STIs, and reproduction.
comment: Instrucción sobre la salud sexual y la sexualidad, incluyendo temas como consentimiento, sexo más seguro, transmisión de ITS y reproducción.
broader: Information provision
change note: Version 4.2.0
has top concept: Information provision
in scheme: v3
preferred label: Educación sexual
related: AIDS education

Sex scandals
type: Concept
issued: 2019-05-14
modified: 2025-02-23
replaces: sexScandals
comment: Public scandals surrounding sensational cases of sexual indecency or sex crimes.
comment: Escándalos públicos en torno a casos sensacionales de indecencia sexual o delitos sexuales.
alternative label: Sexual scandals
alternative label: Escándalos de sexo
change note: Version 4.2.0
in scheme: v3
preferred label: Escándalos sexuales
related: LGBTQ+ social processes

Sex therapy
type: Concept
issued: 2019-05-14
modified: 2025-02-23
replaces: sexTherapy
comment: A form of counseling intended to address sexual dysfunction and other sex-related issues.
comment: Una forma de consejería destinada a abordar la disfunción sexual y otras cuestiones relacionados con el sexo.
broader: Therapies
change note: Version 4.2.0
has top concept: Medical care
in scheme: v3
preferred label: Terapia sexual
related: Sexual dysfunction

Sexologists
type: Concept
issued: 2019-05-14
modified: 2025-02-23
replaces: sexologists
comment: People who professionally study sexology, or human sexual behavior and sexual relationships.
comment: Personas que estudian profesionalmente la sexología, o el comportamiento sexual humano y las relaciones sexuales.
change note: Version 4.2.0
in scheme: v3
preferred label: Sexólogos
related: Sexology

Sexual revolution
type: Concept
issued: 2019-05-14
modified: 2025-02-23
replaces: sexualRevolution
comment: Social perspective from the 1960s into the 1970s that challenged traditional codes of behavior related to sexuality and interpersonal relationships throughout the Western world.
comment: Perspectiva social desde la década de 1960 hasta la de 1970 que desafió los códigos tradicionales de comportamiento relacionados con la sexualidad y las relaciones interpersonales en todo el mundo occidental.
change note: Version 4.2.0
in scheme: v3
preferred label: Revolución sexual
related: LGBTQ+ social processes

Solo sex
type: Concept
issued: 2019-05-14
modified: 2025-02-23
replaces: soloSex
comment: Sexual acts involving only one person, such as masturbation, as opposed to sex with a partner.
comment: Actos sexuales que involucran a una sola persona, como la masturbación, a diferencia del sexo con una pareja.
change note: Version 4.2.0
in scheme: v3
preferred label: Sexo en solitario
related: Masturbation

Sons of bisexual people
type: Concept
issued: 2019-05-14
modified: 2025-02-23
replaces: sonsOfBisexualPeople
comment: Sons who have one or more bisexual parent. For sons who are themselves bisexual, use the term "Bisexual sons."
comment: Hijos que tienen uno o más padres bisexuales. Para los hijos que son bisexuales, utilice el término "hijos bisexuales".
broader: Children of bisexual people
broader: Sons of LGBTQ+ people
change note: Version 4.2.0
has top concept: Family members
in scheme: v3
preferred label: Hijos de personas bisexuales

Sons of gay men
type: Concept
issued: 2019-05-14
modified: 2025-02-23
replaces: sonsOfGayMen
comment: Sons who have one or more gay parent. For sons who are themselves gay, use the term "Gay sons."
comment: Hijos que tienen uno o más padres gay. Para los hijos que son gay, utilice el término "hijos gay".
broader: Children of gay men
broader: Sons of LGBTQ+ people
change note: Version 4.2.0
has top concept: Family members
in scheme: v3
preferred label: Hijos de hombres gay

Sons of lesbians
type: Concept
issued: 2019-05-14
modified: 2025-02-23
replaces: sonsOfLesbians
comment: Sons who have one or more lesbian parent.
comment: Hijos que tienen uno o más madres lesbianas.
broader: Children of lesbians
broader: Sons of LGBTQ+ people
change note: Version 4.2.0
has top concept: Family members
in scheme: v3
preferred label: Hijos de lesbianas

Sons of transgender people
type: Concept
issued: 2019-05-14
modified: 2025-02-23
replaces: sonsOfTransgenderPeople
comment: Sons who have one or more transgender parent. For sons who are themselves transgender, use the term "Transgender sons."
comment: Hijos que tienen uno o más padres transgénero. Para los hijos que son transgénero, utilice el término "hijos transgénero".
broader: Children of transgender people
broader: Sons of LGBTQ+ people
change note: Version 4.2.0
has top concept: Family members
in scheme: v3
preferred label: Hijos de personas transgénero

Sons of queer people
type: Concept
issued: 2019-05-14
modified: 2025-02-23
replaces: sonsOfQueerPeople
comment: Sons who have one or more queer parent. For sons who are themselves queer, use the term "Queer sons."
comment: Hijos que tienen uno o más padres queer. Para los hijos que son queer, utilice el término "hijos queer".
broader: Children of queer people
broader: Sons of LGBTQ+ people
change note: Version 4.2.0
has top concept: Family members
in scheme: v3
preferred label: Hijos de personas queer

Stonewall riots
type: Concept
issued: 2019-05-14
modified: 2025-02-23
replaces: stonewallRiots
comment: The series of spontaneous demonstrations and protests against the police raid that took place on June 28, 1969 at the Stonewall Inn in the Greenwich Village neighborhood of New York City.
comment: La serie de manifestaciones y protestas espontáneas contra la redada policial que tuvo lugar el 28 de junio de 1969 en el Stonewall Inn en el barrio de Greenwich Village de la ciudad de Nueva York.
alternative label: Stonewall uprising
alternative label: Disturbios de Stonewall
broader: LGBTQ+ riots
change note: Version 4.2.0
has top concept: LGBTQ+ riots
in scheme: v3
preferred label: Revueltas de Stonewall
related: Gay liberation

Strippers
type: Concept
issued: 2019-05-14
modified: 2025-02-23
replaces: strippers
comment: Sex workers who undress to music while using a pole to perform dance moves, whether in a venue like a strip club or by hire at private parties. For stripping performed by amateurs in private settings, use "Stripping."
comment: Personas trabajadoras sexuales que se desnudan al ritmo de la música mientras utilizan una barra para realizar movimientos de baile, ya sea en un local como un club de striptease o por encargo en fiestas privadas. Para el striptease realizado por gente aficionada en entornos privados, utilice «Stripping».
alternative label: Stripteasers
alternative label: Peelers
alternative label: Pole-dancers
alternative label: Pole dancers
alternative label: Exotic dancers
broader: Sex workers
change note: Version 4.2.0
has top concept: Sex workers
in scheme: v3
related: Stripping

Striptease
type: Concept
issued: 2019-05-14
modified: 2025-02-23
replaces: striptease
comment: A form of erotic dance during which the performer gradually undresses in a seductive and sexually suggestive manner.
comment: Una forma de danza erótica durante la cual la persona que lo interpreta se desnuda gradualmente de una manera seductora y sexualmente sugerente.
broader: Sexual practices
broader: LGBTQ+ theater
change note: Version 4.2.0
has top concept: Sexual practices
in scheme: v3
preferred label: Estriptís

Survivors of anti-LGBTQ+ violence
type: Concept
issued: 2019-05-14
modified: 2025-02-23
replaces: survivorsOfAntiLGBTQViolence
comment: People who have experienced and survived anti-LGBTQ+ violence; follow individuals’ preference for “victims” or “survivors” whenever possible.
comment: Personas que han sufrido y sobrevivido la violencia anti-LGBTQ+; siga la preferencia de la persona sobre el uso de "víctimas" o "sobrevivientes" siempre que sea posible
alternative label: Survivors of anti-LGBTQ violence
alternative label: Sobrevivientes de violencia anti-LGBTQ
change note: Version 4.2.0
in scheme: v3
preferred label: Sobrevivientes de violencia anti-LGBTQ+
related: Anti-LGBTQ+ violence

Tattoos
type: Concept
issued: 2019-05-14
modified: 2025-02-23
replaces: tattoos
comment: Body modifications in which permanent ink is inserted into the skin to form a design.
comment: Modificaciones corporales en las que se inserta tinta permanente en la piel para formar un diseño.
broader: Body adornment
broader: Body modification
change note: Version 4.2.0
has top concept: Body adornment
in scheme: v3
preferred label: Tatuajes

Thigh harnesses
type: Concept
issued: 2019-05-14
modified: 2025-02-23
replaces: thighHarnesses
comment: Devices worn to attach a dildo to a person's thigh, typically so they can penetrate a partner's vagina or anus.
comment: Dispositivos que se utilizan para sujetar un consolador al muslo de una persona, generalmente para que pueda penetrar la vagina o el ano de su pareja.
broader: Harnesses
change note: Version 4.2.0
has top concept: Sex accessories
in scheme: v3
preferred label: Arnés para el muslo
related: Dildo harnesses

Third gender
type: Concept
issued: 2019-05-14
modified: 2025-02-23
replaces: thirdGender
comment: Social category present in societies that recognize three or more genders.
comment: Categoría social presente en sociedades que reconocen tres o más géneros.
broader: Non-Euro-American gender and sexual identities
change note: Version 4.2.0
has top concept: Gender
in scheme: v3
preferred label: Tercer género
related: Third gender people

Third gender people
type: Concept
issued: 2019-05-14
modified: 2025-02-23
replaces: thirdGenderPeople
comment: Individuals who are categorized (by their will or by social consensus) as neither man nor woman.
comment: Personas que no están categorizadas (por su voluntad o por consenso social) ni como hombre ni como mujer.
broader: Transgender people
change note: Version 4.2.0
has top concept: LGBTQ+ people
in scheme: v3
preferred label: Personas del tercer género
related: Third gender

Thirunangai
type: Concept
issued: 2019-05-14
modified: 2025-02-23
replaces: thirunangai
comment: Regional term in Tamil Nadu, India for people assigned male at birth who identify as women.
comment: Término regional en Tamil Nadu, la India, para las personas asignadas al sexo masculino al nacer y que se autoidentifican como mujeres.
broader: Non-Euro-American gender and sexual identities
change note: Version 4.2.0
has top concept: Gender
in scheme: v3
related: Aravani

Tida wena
type: Concept
issued: 2019-05-14
modified: 2025-02-23
replaces: tidaWena
comment: In Venezuela's indigenous Warao culture, this term refers to people assigned male at birth who are thought to possess two spirits and often assume a spiritual role; translates to "twisted women."
comment: En la cultura indígena warao de Venezuela, este término se refiere a las personas asignadas al sexo masculino al nacer y que se cree que poseen dos espíritus y que, a menudo, asumen un papel espiritual; se traduce como "mujeres retorcidas".
broader: Non-Euro-American gender and sexual identities
change note: Version 4.2.0
has top concept: Gender
in scheme: v3
related: Two-Spirit people

Transgender demonstrations
type: Concept
issued: 2019-05-14
modified: 2025-04-17
replaces: transMarches
comment: Marches, rallies, and other large, public gatherings organized to protest discrimination against trans people and advocate for trans visibility, rights, and issues.
comment: Marchas y encuentros centrados en cuestiones y derechos trans.
alternative label: Transgender marches
alternative label: Trans marches
alternative label: Transgender rallies
alternative label: Trans rallies
alternative label: Transgender protests
alternative label: Trans protests
alternative label: Trans demonstrations
alternative label: Marchas transgénero
broader: LGBTQ+ demonstrations
change note: Version 4.2.0
has top concept: LGBTQ+ activism
in scheme: v3
preferred label: Marchas trans
related: Transgender movement

Transgender activism
type: Concept
issued: 2019-05-14
modified: 2025-02-23
replaces: transgenderActivism
comment: Direct action and organizing to achieve political or social change and acceptance for transgender people.
comment: Acción directa y organización para lograr cambio político o social y la aceptación de las personas transgénero.
broader: LGBTQ+ activism
change note: Version 4.2.0
has top concept: LGBTQ+ activism
in scheme: v3
preferred label: Activismo transgénero
related: Transgender political activists

African American transgender people
type: Concept
issued: 2019-05-14
modified: 2025-02-23
replaces: transgenderAfricanAmericans
comment: Transgender people of African descent born in the United States or transgender people born in African countries who live in or have a strong connection to the United States. Use for individuals who self-identity as African American. Follow the individual’s preference for African American or Black whenever possible.
comment: Personas transgénero de ascendencia africana nacidas en los Estados Unidos o personas transgénero nacidas en países africanos que viven o tienen una conexión fuerte con los Estados Unidos. Utilícese para personas que se autoidentifiquen como afroamericanas.
alternative label: Transgender African American people
alternative label: Transgender African Americans
alternative label: Afroamericanos transgénero
alternative label: Afroamericanas transgénero
broader: African American LGBTQ+ people
broader: Black transgender people
change note: Version 4.2.0
has top concept: LGBTQ+ people
in scheme: v3
preferred label: Personas transgénero afroamericanas

Afro-Canadian transgender people
type: Concept
issued: 2019-05-14
modified: 2025-02-23
replaces: transgenderAfroCanadians
comment: Transgender people of African descent born in Canada or transgender people born in African countries who live in or have a strong connection to Canada. Use for individuals who self-identify as Afro-Canadian.
comment: Personas transgénero de ascendencia africana nacidas en Canadá o personas transgénero nacidas en países africanos que viven o tienen una conexión fuerte con Canadá. Utilícese para personas que se autoidentifiquen como afrocanadienses.
alternative label: Transgender Afro-Canadian people
alternative label: Transgender Afro-Canadians
alternative label: Personas afrocanadienses transgénero
alternative label: Afrocanadienses transgénero
broader: Afro-Canadian LGBTQ+ people
broader: Black transgender people
change note: Version 4.2.0
has top concept: LGBTQ+ people
in scheme: v3
preferred label: Personas transgénero afrocanadienses

Afro-Caribbean transgender people
type: Concept
issued: 2019-05-14
modified: 2025-02-23
replaces: transgenderAfroCaribbeans
comment: Transgender people of African descent born in the Caribbean or transgender people born in African countries who live in or have a strong connection to the Caribbean. Only use for individuals who self-identify as Afro-Caribbean.
comment: Personas transgénero afrodescendientes nacidas en el Caribe o personas transgénero nacidas en países africanos que viven o tienen una conexión fuerte con el Caribe. Utilícese únicamente para personas que se identifiquen como afrocaribeñas.
alternative label: Transgender Afro-Caribbean people
alternative label: Transgender Afro-Caribbeans
alternative label: Personas afrocaribeñas transgénero
alternative label: Afrocaribeños transgénero
alternative label: Afrocaribeñas transgénero
broader: Afro-Caribbean LGBTQ+ people
broader: Black transgender people
change note: Version 4.2.0
has top concept: LGBTQ+ people
in scheme: v3
preferred label: Personas transgénero afrocaribeñas

Afro-European transgender people
type: Concept
issued: 2019-05-14
modified: 2025-02-23
replaces: transgenderAfroEuropeans
comment: Transgender people of African descent born in European countries or transgender people born in African countries who live in or have a strong connection to Europe. Only use for individuals who self-identify as Afro-European.
comment: Personas transgénero de ascendencia africana nacidas en países europeos o personas transgénero nacidas en países africanos que viven en Europa o tienen una fuerte conexión con Europa. Utilícese únicamente para personas que se identifiquen como afroeuropeas.
alternative label: Transgender Afro-European people
alternative label: Transgender Afro-Europeans
alternative label: Personas afroeuropeas transgénero
alternative label: Afroeuropeos transgénero
alternative label: Afroeuropeas transgénero
broader: Afro-European LGBTQ+ people
broader: Black transgender people
change note: Version 4.2.0
has top concept: LGBTQ+ people
in scheme: v3
preferred label: Personas transgénero afroeuropeas

Afro-Latin American transgender people
type: Concept
issued: 2019-05-14
modified: 2025-02-23
replaces: transgenderAfroLatinAmericans
comment: Transgender people of African descent born in Latin American countries or transgender people born in African countries who live in or have a strong connection to Latin America. Only use for individuals who self-identify as Afro-Latin American.
comment: Personas transgénero afrodescendientes nacidas en países latinoamericanos o personas transgénero nacidas en países africanos que viven o tienen una conexión fuerte con América Latina. Utilícese únicamente para personas que se identifiquen como afrolatinoamericanas.
alternative label: Transgender Afro-Latin American people
alternative label: Transgender Afro-Latin Americans
alternative label: Personas afrolatinoamericanas transgénero
alternative label: Afrolatinoamericanos transgénero
alternative label: Afrolatinoamericanas transgénero
broader: Afro-Latin American LGBTQ+ people
broader: Black transgender people
change note: Version 4.2.0
has top concept: LGBTQ+ people
in scheme: v3
preferred label: Personas transgénero afrolatinoamericanas

Transgender archives
type: Concept
issued: 2019-05-14
modified: 2026-02-23
replaces: transgenderArchives
comment: Collections of records and materials relating to transgender people or transgender communities; can include a variety of organizations and institutions from community to government archives.
comment: Colecciones de registros y materiales relacionados con personas transgénero o comunidades transgénero; puede incluir una variedad de organizaciones e instituciones, desde archivos comunitarios hasta gubernamentales.
broader: LGBTQ+ archives
change note: Version 4.2.0
has top concept: LGBTQ+ cultural heritage institutions
in scheme: v3
preferred label: Archivos transgénero
related: Metadata for trans and gender diverse resources

Asian American transgender people
type: Concept
issued: 2019-05-14
modified: 2025-02-23
replaces: transgenderAsianAmericans
comment: Transgender people of Asian heritage or descent born in the United States or born in Asian countries who live in or have a strong connection to the United States. Only use for individuals who self-identify as Asian American.
comment: Personas transgénero de ascendencia asiática nacidas en Estados Unidos o personas transgénero nacidas en países asiáticos que viven en o tienen una conexión fuerte con los Estados Unidos. Utilícese para personas que se autoidentifiquen como asiático-americanas.
alternative label: Transgender Asian American people
alternative label: Transgender Asian Americans
alternative label: Personas asiático-americanas transgénero
alternative label: Asiático-americanos transgénero
alternative label: Asiático-americanas transgénero
broader: Asian American LGBTQ+ people
broader: Asian transgender people
change note: Version 4.2.0
has top concept: LGBTQ+ people
in scheme: v3
preferred label: Personas transgénero asiático-americanas

Asian transgender people
type: Concept
issued: 2019-05-14
modified: 2025-02-23
replaces: transgenderAsians
comment: Transgender people of Asian heritage or descent, living in Asia or part of the Asian diaspora. Only use for people who self-identify as Asian.
comment: Personas transgénero nacidas en países asiáticos o descendientes de ellos. Utilícese únicamente para personas que se autoidentifiquen como asiáticas.
alternative label: Transgender Asian people
alternative label: Transgender Asians
alternative label: Personas asiáticas transgénero
alternative label: Asiáticos transgénero
alternative label: Asiáticas transgénero
broader: Asian LGBTQ+ people
change note: Version 4.2.0
has top concept: LGBTQ+ people
in scheme: v3
narrower: Asian American transgender people
preferred label: Personas transgénero asiáticas

Transgender community centers
type: Concept
issued: 2019-05-14
modified: 2025-02-23
replaces: transgenderCommunityCentres
comment: Spaces in which people from transgender communities meet for social, education, recreational, or organizing activities.
comment: Espacios en los que personas de comunidades transgénero se reúnen para actividades sociales, educativas, recreativas u organizativas.
broader: LGBTQ+ community centers
change note: Version 4.2.0
has top concept: LGBTQ+ centers
in scheme: v3
preferred label: Centros comunitarios transgénero
preferred label: Transgender community centres
related: Transgender people

Transgender drama
type: Concept
issued: 2019-05-14
modified: 2025-02-23
replaces: transgenderDrama
comment: Works of fiction written to be performed; use in reference to dramatic works focusing on transgender characters or themes.
comment: Obras de ficción escritas para ser puestas en escena; utilícese en referencia a obras dramáticas que se centran en personajes o temas transgénero.
broader: LGBTQ+ drama
change note: Version 4.2.0
has top concept: Subcultures
in scheme: v3
preferred label: Drama transgénero
related: Transgender authors

Transgender libraries
type: Concept
issued: 2019-05-14
modified: 2026-02-23
replaces: transgenderLibraries
comment: Libraries that hold materials primarily pertaining to transgender people or intended for use by transgender people.
comment: Bibliotecas que contienen materiales principalmente relacionados con personas transgénero o destinados a personas transgénero.
broader: LGBTQ+ libraries
change note: Version 4.2.0
has top concept: LGBTQ+ cultural heritage institutions
in scheme: v3
preferred label: Bibliotecas transgénero
related: Metadata for trans and gender diverse resources

Transgender museums
type: Concept
issued: 2019-05-14
modified: 2026-02-23
replaces: transgenderMuseums
comment: Institutions dedicated to the storage, exhibition, conservation, and preservation of materials relating to transgender people and transgender history.
comment: Instituciones dedicadas al almacenamiento, la exhibición, la conservación y la preservación de materiales relacionados con las personas transgénero y la historia transgénero.
broader: LGBTQ+ museums
change note: Version 4.2.0
has top concept: LGBTQ+ cultural heritage institutions
in scheme: v3
preferred label: Museos transgénero
related: Metadata for trans and gender diverse resources

Transgender Pagans
type: Concept
issued: 2019-05-14
modified: 2025-02-23
replaces: transgenderPagans
comment: Transgender people who are members of polytheistic religions or other religions outside of the dominant culture that typically incorporate nature worship and/or the sacred feminine, such as Wicca, Druidry, Heathenry, etc. Use to describe transgender people who self-identify as Pagan.
comment: Personas transgénero que son miembros de religiones politeístas u otras religiones fuera de la cultura dominante que típicamente incorporan el culto a la naturaleza y/o lo sagrado femenino, como la Wicca, el druidismo, el paganismo, etc. Utilícese para describir a las personas transgénero que se autoidentifican como paganas.
broader: LGBTQ+ Pagans
change note: Version 4.2.0
has top concept: LGBTQ+ African religions
in scheme: v3
preferred label: Paganos transgénero
related: Transgender witches

Transgender people in the military
type: Concept
issued: 2019-05-14
modified: 2025-02-23
replaces: transgenderPeopleInTheMilitary
comment: Transgender people serving in state and national armed forces.
comment: Personas transgénero que sirven en las fuerzas armadas estatales y nacionales.
alternative label: Personas transgénero en las fuerzas armadas
broader: LGBTQ+ people in the military
change note: Version 4.2.0
has top concept: Legal status
in scheme: v3
preferred label: Personas transgénero en el ejército
related: Transgender people

Transgender poetry
type: Concept
issued: 2019-05-14
modified: 2025-02-23
replaces: transgenderPoetry
comment: Literary works, typically written in verse, that focus on transgender characters, transgender themes, or transgender identity.
comment: Obras literarias, normalmente escritas en verso, que se centran en personajes transgénero, temas transgénero o la identidad transgénero.
broader: LGBTQ+ poetry
change note: Version 4.2.0
has top concept: Subcultures
in scheme: v3
preferred label: Poesía transgénero
related: Transgender authors

Transgender political activists
type: Concept
issued: 2019-05-14
modified: 2025-02-23
replaces: transgenderPoliticalActivists
comment: Transgender people working to bring about political or social change through public organizing.
comment: Personas transgénero que trabajan para lograr cambios políticos o sociales a través de la organización pública.
broader: LGBTQ+ political activists
change note: Version 4.2.0
has top concept: LGBTQ+ people
in scheme: v3
preferred label: Activistas políticos transgénero
related: Transgender activism

Transgender prostitution
type: Concept
is replaced by: homoit0001437
issued: 2019-05-14
modified: 2025-01-28
replaces: transgenderProstitution
change note: Version 4.2.0
in scheme: v3

Transgender radio
type: Concept
issued: 2019-05-14
modified: 2026-02-23
replaces: transgenderRadio
comment: Auditory content broadcast on the radio (analog or digital) about transgender people and transgender issues.
comment: Contenidos auditivos transmitidos por radio (analógica o digital) sobre personas transgénero y asuntos transgénero.
broader: LGBTQ+ radio
change note: Version 4.2.0
has top concept: LGBTQ+ radio
in scheme: v3
preferred label: Radio transgénero
related: Transgender podcasts

Transgender slang
type: Concept
issued: 2019-05-14
modified: 2025-02-23
replaces: transgenderSlang
comment: Colloquial or informal language related to transgender identity or used by transgender people.
comment: Lenguaje coloquial o informal relacionado con la identidad transgénero o utilizado por personas transgénero.
alternative label: Argot transgénero
broader: LGBTQ+ slang
broader: Transgender culture
change note: Version 4.2.0
has top concept: LGBTQ+ slang
in scheme: v3
preferred label: Jerga transgénero

Transgender survivors of hate crimes
type: Concept
issued: 2019-05-14
modified: 2025-02-23
replaces: transgenderSurvivorsOfHateCrimes
comment: Transgender people who have experienced and survived hate crimes; follow the individual's preference for "victims" or "survivors" whenever possible.
comment: Personas transgénero que han sufrido y sobrevivido crímenes de odio; siga la preferencia de la persona sobre el uso de "víctimas" o "sobrevivientes" siempre que sea posible.
broader: LGBTQ+ survivors of hate crimes
broader: Transgender victims of hate crimes
change note: Version 4.2.0
has top concept: LGBTQ+ people
in scheme: v3
preferred label: Sobrevivientes transgénero de crímenes de odio

Transgender survivors of rape
type: Concept
issued: 2019-05-14
modified: 2025-02-23
replaces: transgenderSurvivorsOfRape
comment: Transgender people who have experienced and survived rape; follow the individual's preference for "victims" or "survivors" whenever possible.
comment: Personas transgénero que han sufrido y sobrevivido una violación; siga la preferencia de la persona sobre el uso de "víctimas" o "sobrevivientes" siempre que sea posible.
broader: LGBTQ+ survivors of rape
broader: Transgender victims of rape
change note: Version 4.2.0
has top concept: LGBTQ+ people
in scheme: v3
preferred label: Sobrevivientes transgénero de violación

Transgender survivors of sexual abuse
type: Concept
issued: 2019-05-14
modified: 2025-02-23
replaces: transgenderSurvivorsOfSexualAbuse
comment: Transgender people who have experienced and survived sexual abuse; follow the individual's preference for "victims" or "survivors" whenever possible.
comment: Personas transgénero que han sufrido y sobrevivido abusos sexuales; siga la preferencia de la persona sobre el uso de "víctimas" o "sobrevivientes" siempre que sea posible.
broader: LGBTQ+ survivors of sexual abuse
broader: Transgender victims of sexual abuse
change note: Version 4.2.0
has top concept: LGBTQ+ people
in scheme: v3
preferred label: Sobrevivientes transgénero de abuso sexual

Transgender survivors of war
type: Concept
issued: 2019-05-14
modified: 2025-02-23
replaces: transgenderSurvivorsOfWar
comment: Transgender people who have experienced and survived war; follow the individual's preference for "victims" or "survivors" whenever possible.
comment: Personas transgénero que han sufrido y sobrevivido la guerra; siga la preferencia de la persona sobre el uso de "víctimas" o "sobrevivientes" siempre que sea posible.
broader: LGBTQ+ survivors of war
broader: Transgender victims of war
change note: Version 4.2.0
has top concept: LGBTQ+ people
in scheme: v3
preferred label: Sobrevivientes transgénero de guerra

Transgender television
type: Concept
issued: 2019-05-14
modified: 2025-02-23
replaces: transgenderTelevision
comment: Television shows featuring transgender characters or themes.
comment: Programas de televisión con personajes o temas transgénero.
broader: LGBTQ+ television
change note: Version 4.2.0
has top concept: LGBTQ+ television
in scheme: v3
preferred label: Televisión transgénero
related: Transgender movement

Transgender victims of hate crimes
type: Concept
issued: 2019-05-14
modified: 2025-02-23
replaces: transgenderVictimsOfHateCrimes
comment: Transgender people who have experienced hate crimes and may or may not have survived; follow the individual's preference for "victims" or "survivors" whenever possible.
comment: Personas transgénero que han sufrido crímenes de odio y pueden o no haber sobrevivido; siga la preferencia de la persona sobre el uso de "víctimas" o "sobrevivientes" siempre que sea posible.
broader: LGBTQ+ victims of hate crimes
change note: Version 4.2.0
has top concept: LGBTQ+ people
in scheme: v3
narrower: Transgender survivors of hate crimes
preferred label: Víctimas transgénero de crímenes de odio

Transgender victims of rape
type: Concept
issued: 2019-05-14
modified: 2025-02-23
replaces: transgenderVictimsOfRape
comment: Transgender people who have experienced rape and may or may not have survived; follow the individual's preference for "victims" or "survivors" whenever possible.
comment: Personas transgénero que han sufrido una violación y pueden o no haber sobrevivido; siga la preferencia de la persona sobre el uso de "víctimas" o "sobrevivientes" siempre que sea posible.
broader: LGBTQ+ victims of rape
change note: Version 4.2.0
has top concept: LGBTQ+ people
in scheme: v3
narrower: Transgender survivors of rape
preferred label: Víctimas transgénero de violación

Transgender victims of sexual abuse
type: Concept
issued: 2019-05-14
modified: 2025-02-23
replaces: transgenderVictimsOfSexualAbuse
comment: Transgender people who have experienced sexual abuse and may or may not have survived; follow the individual's preference for "victims" or "survivors" whenever possible.
comment: Personas transgénero que han sufrido abuso sexual y pueden o no haber sobrevivido; siga la preferencia de la persona sobre el uso de "víctimas" o "sobrevivientes" siempre que sea posible.
broader: LGBTQ+ victims of sexual abuse
change note: Version 4.2.0
has top concept: LGBTQ+ people
in scheme: v3
narrower: Transgender survivors of sexual abuse
preferred label: Víctimas transgénero de abuso sexual

Transgender victims of war
type: Concept
issued: 2019-05-14
modified: 2025-02-23
replaces: transgenderVictimsOfWar
comment: Transgender people who have experienced war and may or may not have survived; follow the individual's preference for "victims" or "survivors" whenever possible.
comment: Personas transgénero que han sufrido la guerra y que pueden haber sobrevivido o no; siga la preferencia de la persona sobre el uso de "víctimas" o "sobrevivientes" siempre que sea posible.
broader: LGBTQ+ victims of war
change note: Version 4.2.0
has top concept: LGBTQ+ people
in scheme: v3
narrower: Transgender survivors of war
preferred label: Víctimas transgénero de guerra

Transgender youth literature
type: Concept
issued: 2019-05-14
modified: 2025-02-23
replaces: transgenderYouthLiterature
comment: Written literary works for an audience of readers from 12-18 years of age, also known as young adult literature or YA; use in reference to youth literature focusing on transgender characters or themes.
comment: Obras literarias escritas para una audiencia de lectores de 12 a 18 años de edad, también conocidas como literatura para adultos jóvenes o YA (por sus siglas en inglés); utilícese en referencia a la literatura juvenil que se centra en personajes o temas transgénero.
broader: LGBTQ+ youth literature
change note: Version 4.2.0
has top concept: Subcultures
in scheme: v3
preferred label: Literatura juvenil transgénero
related: Transgender youth

Trigender identity
type: Concept
issued: 2019-05-14
modified: 2025-02-23
replaces: trigenderIdentity
comment: Gender identity including three genders, typically male, female, and a third (often non-binary) gender.
comment: Identidad de género que incluye tres géneros, típicamente masculino, femenino y un tercer género (a menudo no binario).
broader: Gender identity
change note: Version 4.2.0
has top concept: Gender
in scheme: v3
preferred label: Identidad trigénero
related: Trigender people

Tucking (Phallus)
type: Concept
issued: 2019-05-14
modified: 2025-02-23
replaces: tucking
comment: Slang term describing various methods used to visually conceal the penis to give a flatter appearance in clothing.
comment: Término de la jerga que describe varios métodos utilizados para ocultar visualmente el pene y dar una apariencia más plana a la ropa.
alternative label: Tucking
alternative label: Remetido
alternative label: Ocultar y pegar
broader: Gender expression
change note: Version 4.2.0
has top concept: Gender
in scheme: v3
preferred label: Remetimiento (Falo)
related: Penis

Uncut men
type: Concept
issued: 2019-05-14
modified: 2025-02-23
replaces: uncutMen
comment: Men whose penises are uncircumcised (i.e., the foreskin of the penis has not been surgically removed).
comment: Hombres cuyos penes no están circuncidados (es decir, el prepucio del pene no ha sido extirpado quirúrgicamente).
alternative label: Uncircumcised men
alternative label: Hombres no circuncidados
change note: Version 4.2.0
in scheme: v3
preferred label: Hombres no circuncisos
related: Circumcision

Vaginal dilation
type: Concept
issued: 2019-05-14
modified: 2025-02-23
replaces: vaginalDilation
comment: The process of gently and incrementally stretching the vagina using vaginal dilators.
comment: El proceso de estirar suave y progresivamente la vagina utilizando dilatadores vaginales.
change note: Version 4.2.0
in scheme: v3
preferred label: Dilatación vaginal

Vaginismus
type: Concept
issued: 2019-05-14
modified: 2025-02-23
replaces: vaginismus
comment: A condition characterized by painful, spasmodic contractions of the vagina in response to physical contact, pressure, or insertion.
comment: Una condición caracterizada por contracciones espasmódicas y dolorosas de la vagina en respuesta al contacto físico, la presión o la inserción.
alternative label: Vaginism
broader: Sexual dysfunction
change note: Version 4.2.0
has top concept: Sexual dysfunction
in scheme: v3
preferred label: Vaginismo
related: Vagina

Vibrators
type: Concept
issued: 2019-05-14
modified: 2025-02-23
replaces: vibrators
comment: Electric-powered sex toys that produce different levels of vibrations or pulses to aid in sexual stimulation and pleasure.
comment: Juguetes sexuales eléctricos que producen diferentes niveles de vibraciones o pulsos para ayudar en la estimulación y el placer sexual.
broader: Sex accessories
change note: Version 4.2.0
has top concept: Sex accessories
in scheme: v3
preferred label: Vibradores
related: Dildos

Winkté
type: Concept
issued: 2019-05-14
modified: 2025-02-23
replaces: winkte
comment: North American Lakota word referring to people assigned male at birth who adopt feminine roles; translates to "to be like a woman."
comment: Palabra lakota norteamericana que se refiere a personas asignadas al sexo masculino al nacer y que adoptan roles femeninos; se traduce como "ser como una mujer".
alternative label: Winkte
broader: Non-Euro-American gender and sexual identities
change note: Version 4.2.0
has top concept: Gender
in scheme: v3
related: Two-Spirit people

Women's bookshops
type: Concept
issued: 2019-05-14
modified: 2025-02-23
replaces: womensBookshops
comment: Bookshops that sell materials intended for use by women or addressing topics related to women.
comment: Librerías que venden materiales destinados para el uso de mujeres o que abordan temas relacionados con las mujeres.
alternative label: Librerias de mujeres
broader: LGBTQ+ bookshops
change note: Version 4.2.0
has top concept: LGBTQ+ bookshops
in scheme: v3
preferred label: Librerías para mujeres
related: Lesbian bookshops

Women's libraries
type: Concept
issued: 2019-05-14
modified: 2026-02-24
replaces: womensLibraries
comment: Libraries that hold materials primarily pertaining to women or intended for use by women.
comment: Bibliotecas que contienen materiales principalmente relacionados con mujeres o para el uso de mujeres.
alternative label: Bibliotecas para mujeres
broader: LGBTQ+ libraries
change note: Version 4.2.0
has top concept: LGBTQ+ cultural heritage institutions
in scheme: v3
narrower: Lesbian libraries
preferred label: Bibliotecas de mujeres

Women's marriages
type: Concept
issued: 2019-05-14
modified: 2025-02-23
replaces: womensMarriages
comment: Same-gender marriage tradition between two women in Africa conducted according to African culture and traditions.
comment: Tradición matrimonial entre personas del mismo sexo entre dos mujeres en África realizada de acuerdo con la cultura y las tradiciones africanas.
alternative label: Matrimonios entre mujeres
broader: Marriage
change note: Version 4.2.0
has top concept: Living arrangements
in scheme: v3
preferred label: Casamientos entre mujeres
related: Same-sex marriage

Gay erotic literature
type: Concept
issued: 2020-06-03
modified: 2025-02-23
replaces: gayEroticLiterature
comment: Literary works with erotic or sexual elements; use in reference to erotic literature focusing on gay characters or themes.
comment: Obras literarias con elementos eróticos o sexuales; utilícese en referencia a la literatura erótica que se centra en personajes o temas gay.
broader: LGBTQ+ erotic literature
change note: Version 4.2.0
has top concept: Erotica
in scheme: v3
preferred label: Literatura erótica gay
related: Yaoi

Gay biographies
type: Concept
issued: 2020-06-03
modified: 2025-02-23
replaces: gayBiographies
comment: Written accounts of the lives of gay men. For written accounts of gay men's lives written by the subject, use "Gay autobiographies."
comment: Relatos escritos de la vida de hombres conocidos por ser gay.
broader: LGBTQ+ biographies
change note: Version 4.2.0
has top concept: LGBTQ+ biographies
in scheme: v3
preferred label: Biografías gay
related: Gay autobiographies

Breast augmentation
type: Concept
issued: 2020-12-11
modified: 2025-02-23
replaces: breastAugmentation
comment: A surgical procedure aimed at increasing breast size using a prosthetic implant; often undergone by transgender women as a gender affirming surgery.
comment: Un procedimiento quirúrgico para aumentar el tamaño de los senos mediante un implante protésico; a menudo realizado por mujeres transgénero como cirugía de afirmación de género.
alternative label: Augmentation mammaplasty
alternative label: Augmentation mammoplasty
alternative label: Boob job
alternative label: Mamoplastia de aumento
alternative label: Aumento de mamas
broader: Top surgery
change note: Version 4.2.0
has top concept: Medical care
in scheme: v3
preferred label: Aumento de senos
related: Breast

DADT relationships
type: Concept
issued: 2020-12-11
modified: 2025-02-23
replaces: DADTRelationships
comment: Abbreviation for "don’t ask don’t tell relationships," where partners agree that they have each have multiple romantic and/or sexual relationships as long as they do not discuss it with their primary partner or let it interfere with their partner’s daily life.
comment: Abreviatura de "relaciones de no preguntar, no decir" o "don't ask, don't tell" en inglés, donde las parejas acuerdan que cada una tiene múltiples relaciones románticas y/o sexuales, siempre y cuando no lo hablen con su pareja principal ni dejen que interfiera con la vida diaria de su pareja. .
broader: Consensual non-monogamy
change note: Version 4.2.0
has top concept: Relationship orientation
in scheme: v3
preferred label: Relaciones DADT
related: Hierarchical non-monogamy

Hard swap
type: Concept
issued: 2020-12-11
modified: 2025-02-23
replaces: hardSwap
comment: A term used in the swinging community to describe a type of partner swapping in which sexual activities happen in different spaces or rooms where partners may not necessarily be in sight of each other.
comment: Un término utilizado en la comunidad swinger para describir un tipo de intercambio de pareja en el que las actividades sexuales ocurren en diferentes espacios o habitaciones donde las parejas no necesariamente están a la vista.
alternative label: Intercambio de pareja duro
broader: Sexual practices
change note: Version 4.2.0
has top concept: Sexual practices
in scheme: v3
preferred label: Intercambio duro
related: Soft swap

Large breasts
type: Concept
issued: 2020-12-11
modified: 2025-02-23
replaces: largeBreasts
comment: Breasts considered large within a given cultural context. Note that large breasts have various health issues associated with them and may carry stigmatized medical associations (such as terms like gigantomastia and macromastia). These terms have more specific medical meanings but should not be used outside of those specific contexts.
comment: Senos considerados grandes dentro de un contexto cultural determinado. Tenga en cuenta que los senos grandes implican varios problemas de salud asociados y pueden conllevar asociaciones médicas estigmatizadas (tales como términos como gigantomastia y macromastia). Estos términos tienen significados médicos más específicos, pero no deben utilizarse fuera de esos contextos específicos.
alternative label: Gigantomastia
alternative label: Macromastia
alternative label: Breast hypertrophy
broader: Breast size
change note: Version 4.2.0
has top concept: Breast size
in scheme: v3
preferred label: Senos grandes
related: Breast

Small breasts
type: Concept
issued: 2020-12-11
modified: 2025-02-23
replaces: smallBreasts
comment: Breasts considered small within a given cultural context. In certain situations, medical professionals may refer to such breasts as "underdeveloped" or "hypoplastic." These terms can be considered offensive and should not be used outside of specific medical contexts. The alternate labels included here are intended to aid search tools only and should not be used in other contexts.
comment: Senos considerados pequeños dentro de un contexto cultural determinado. En determinadas situaciones, profesionales médicos pueden referirse a estos senos como "subdesarrollados" o "hipoplásicos". Estos términos pueden considerarse ofensivos y no deben utilizarse fuera de contextos médicos específicos. Las etiquetas alternativas incluidas aquí están destinadas únicamente para ayudar a las herramientas de búsqueda y no deben utilizarase en otros contextos.
alternative label: Breast hypoplasia
alternative label: Underdeveloped breasts
alternative label: Hipoplasia de senos
alternative label: Senos subdesarrollados
broader: Breast size
change note: Version 4.2.0
has top concept: Breast size
in scheme: v3
preferred label: Senos pequeños
related: Breast

Soft swap
type: Concept
issued: 2020-12-11
modified: 2025-02-23
replaces: softSwap
comment: A term used in the swinging community to describe a type of partner swap in which sexual activities happen in the same shared space so that all partners are within sight of one another.
comment: Un término utilizado en la comunidad swinger para describir un tipo de intercambio de pareja en el que las actividades sexuales ocurren en el mismo espacio compartido de modo que todas las parejas estén a la vista la una de la otra.
alternative label: Intercambio de parejas suave
broader: Sexual practices
change note: Version 4.2.0
has top concept: Sexual practices
in scheme: v3
preferred label: Intercambio suave
related: Hard swap

Honeymooning
type: Concept
issued: 2021-06-30
modified: 2025-02-23
replaces: honeymooning
comment: A period of time in a relationship characterized by passionate love as well as intense feelings of attraction and ecstasy, sometimes accompanied by idealization of a partner or the shared relationship.
comment: Un periodo de tiempo en una relación caracterizado por un amor apasionado al igual que por intensos sentimientos de atracción y éxtasis, a veces acompañados por la idealización de la pareja o de la relación compartida.
change note: Version 4.2.0
in scheme: v3
preferred label: Luna de miel
related: NRE (New Relationship Energy)

Jealousy
type: Concept
is replaced by: homoit0001658
issued: 2019-05-14
issued: 2021-06-30
modified: 2022-10-13
modified: 2025-02-23
replaces: jealousy
replaces: cheating
replaces: nonConsensualNonMonogamy
comment: A violation of a couple's assumed or stated contract regarding emotional and/or sexual exclusivity. Should not be used to refer to non-monogamy in general, as cheating is possible in both monogamous and non-monogamous relationships.
comment: Practice of engaging in romantic or sexual relationships with more than one person simultaneously without each partner's consent.
comment: Práctica de entablar relaciones románticas o sexuales con más de una persona simultáneamente sin el consentimiento de cada pareja.
alternative label: Straying
alternative label: Adultery
alternative label: Infidelity
alternative label: Affairs
alternative label: Stepping out
broader: Non-monogamy
change note: Version 4.2.0
has top concept: Relationship orientation
in scheme: v3
preferred label: Cheating
preferred label: Non-consensual non-monogamy
preferred label: No monogamia no consensual
related: LGBTQ+ emotions
related: Relationship satisfaction
related: Compersion

Relationship anarchy
type: Concept
issued: 2021-06-30
modified: 2025-02-23
replaces: relationshipAnarchy
comment: A type of non-monogamy characterized by application of anarchist principles (such as autonomy, anti-normativity, anti-hierarchical practices, refusal of state governance) to relationships. Often contrasted with hierarchical polyamory.
comment: Un tipo de no monogamia caracterizada por la aplicación de principios anarquistas (como la autonomía, la antinormatividad, las prácticas antijerárquicas, el rechazo de la gobernanza estatal) a las relaciones. A menudo, se contrasta con el poliamor jerárquico.
broader: Consensual non-monogamy
change note: Version 4.2.0
has top concept: Relationship orientation
in scheme: v3
preferred label: Anarquía relacional
related: Relationship anarchists

Ae/Aer/Aerself (Pronouns)
type: Concept
issued: 2021-07-01
modified: 2025-02-23
replaces: aePronouns
comment: A set of pronouns. Used in this manner: Ae went to the Homosaurus website. I watched aer browse the Homosaurus. Ae uses the Homosaurus aerself.
alternative label: Ae (Pronouns)
alternative label: Ae/Aer/Aerself
broader: Pronouns
broader: Neopronouns
change note: Version 4.2.0
has top concept: Pronouns
in scheme: v3

Co/Co/Coself (Pronouns)
type: Concept
issued: 2021-07-01
modified: 2025-02-23
replaces: coPronouns
comment: A set of pronouns. Used in this manner: Co went to the Homosaurus website. I watched co browse the Homosaurus. Co uses the Homosaurus coself.
alternative label: Co (Pronouns)
broader: Pronouns
broader: Neopronouns
change note: Version 4.2.0
has top concept: Pronouns
in scheme: v3

Cy/Cyb/Cyberself (Pronouns)
type: Concept
issued: 2021-07-01
modified: 2025-02-23
replaces: cyPronouns
comment: A set of pronouns. Used in this manner: Cy went to the Homosaurus website. I watched cyb browse the Homosaurus. Cy uses the Homosaurus cyberself.
alternative label: Cy (Pronouns)
alternative label: Cy/Cyb/Cyberself
broader: Pronouns
broader: Neopronouns
change note: Version 4.2.0
has top concept: Pronouns
in scheme: v3

E/Em/Emself (Pronouns)
type: Concept
issued: 2021-07-01
modified: 2025-02-23
replaces: ePronouns
comment: A set of pronouns. Used in this manner: E went to the Homosaurus website. I watched em browse the Homosaurus. E uses the Homosaurus emself.
alternative label: E (Pronouns)
alternative label: E/Em/Emself
broader: Pronouns
broader: Neopronouns
change note: Version 4.2.0
has top concept: Pronouns
in scheme: v3

Ey/Em/Eirself (Pronouns)
type: Concept
issued: 2021-07-01
modified: 2025-02-23
replaces: eyPronouns
comment: A set of pronouns. Used in this manner: Ey went to the Homosaurus website. I watched em browse the Homosaurus. Ey uses the Homosaurus eirself.
alternative label: Ey (Pronouns)
alternative label: Ey/Em/Eirself
broader: Pronouns
broader: Neopronouns
change note: Version 4.2.0
has top concept: Pronouns
in scheme: v3

Fe/Fem/Femself (Pronouns)
type: Concept
issued: 2021-07-01
modified: 2025-02-23
replaces: fePronouns
comment: A set of pronouns. Used in this manner: Fe went to the Homosaurus website. I watched fem browse the Homosaurus. Fe uses the Homosaurus femself.
alternative label: Fe (Pronouns)
alternative label: Fe/Fem/Femself
broader: Pronouns
broader: Neopronouns
change note: Version 4.2.0
has top concept: Pronouns
in scheme: v3

Fae/Faer/Faerself (Pronouns)
type: Concept
issued: 2021-07-01
modified: 2025-02-23
replaces: faePronouns
comment: A set of pronouns. Used in this manner: Fae went to the Homosaurus website. I watched faer browse the Homosaurus. Fae uses the Homosaurus faerself.
alternative label: Fae (Pronouns)
alternative label: Fae/Faer/Faerself
broader: Pronouns
broader: Neopronouns
change note: Version 4.2.0
has top concept: Pronouns
in scheme: v3

Fey/Fem/Femself (Pronouns)
type: Concept
issued: 2021-07-01
modified: 2025-02-23
replaces: feyPronouns
comment: A set of pronouns. Used in this manner: Fey went to the Homosaurus website. I watched fem browse the Homosaurus. Fey uses the Homosaurus femself.
alternative label: Fey (Pronouns)
alternative label: Fey/Fem/Femself
broader: Pronouns
broader: Neopronouns
change note: Version 4.2.0
has top concept: Pronouns
in scheme: v3

Hu/Hum/Humself (Pronouns)
type: Concept
issued: 2021-07-01
modified: 2025-02-23
replaces: huPronouns
comment: A set of pronouns. Used in this manner: Hu went to the Homosaurus website. I watched hum browse the Homosaurus. Hu uses the Homosaurus humself.
alternative label: Hu (Pronouns)
alternative label: Hu/Hum/Humself
broader: Pronouns
broader: Neopronouns
change note: Version 4.2.0
has top concept: Pronouns
in scheme: v3

It/It/Itself (Pronouns)
type: Concept
issued: 2021-07-01
modified: 2025-02-23
replaces: itPronouns
comment: A set of pronouns. Used in this manner: It went to the Homosaurus website. I watched it browse the Homosaurus. It uses the Homosaurus itself.
alternative label: It (Pronouns)
broader: Pronouns
broader: Neopronouns
change note: Version 4.2.0
has top concept: Pronouns
in scheme: v3

Jee/Jem/Jemself (Pronouns)
type: Concept
issued: 2021-07-01
modified: 2025-02-23
replaces: jeePronouns
comment: A set of pronouns. Used in this manner: Jee went to the Homosaurus website. I watched jem browse the Homosaurus. Jee uses the Homosaurus jemself.
alternative label: Jee (Pronouns)
broader: Pronouns
broader: Neopronouns
change note: Version 4.2.0
has top concept: Pronouns
in scheme: v3

Kit/Kit/Kitself (Pronouns)
type: Concept
issued: 2021-07-01
modified: 2025-02-23
replaces: kitPronouns
comment: A set of pronouns. Used in this manner: Kit went to the Homosaurus website. I watched kit browse the Homosaurus. Kit uses the Homosaurus kitself.
alternative label: Kit (Pronouns)
broader: Pronouns
broader: Neopronouns
change note: Version 4.2.0
has top concept: Pronouns
in scheme: v3

Ne/Nir/Nemself (Pronouns)
type: Concept
issued: 2021-07-01
modified: 2025-02-23
replaces: neNirPronouns
comment: A set of pronouns. Used in this manner: Ne went to the Homosaurus website. I watched nir browse the Homosaurus. Ne uses the Homosaurus nemself.
alternative label: Ne/Nir (Pronouns)
alternative label: Ne/Nir/Nemself
broader: Pronouns
broader: Neopronouns
change note: Version 4.2.0
has top concept: Pronouns
in scheme: v3

Ne/Nem/Nis (Pronouns)
type: Concept
issued: 2021-07-01
modified: 2025-02-23
replaces: neNemPronouns
comment: A set of pronouns. Used in this manner: Ne went to the Homosaurus website. I watched nem browse the Homosaurus. Ne uses the Homosaurus nis.
alternative label: Ne/Nem (Pronouns)
alternative label: Ne/Nem/Nis
broader: Pronouns
broader: Neopronouns
change note: Version 4.2.0
has top concept: Pronouns
in scheme: v3

Peh/Pehm/Pehself (Pronouns)
type: Concept
issued: 2021-07-01
modified: 2025-02-23
replaces: pehPronouns
comment: A set of pronouns. Used in this manner: Peh went to the Homosaurus website. I watched pehm browse the Homosaurus. Peh uses the Homosaurus pehself.
alternative label: Peh (Pronouns)
alternative label: Peh/Pehm/Pehself
broader: Pronouns
broader: Neopronouns
change note: Version 4.2.0
has top concept: Pronouns
in scheme: v3

Per/Per/Perself (Pronouns)
type: Concept
issued: 2021-07-01
modified: 2025-02-23
replaces: perPronouns
comment: A set of pronouns. Used in this manner: Per went to the Homosaurus website. I watched per browse the Homosaurus. Per uses the Homosaurus perself.
alternative label: Per (Pronouns)
alternative label: Per/Pers/Perself
broader: Pronouns
broader: Neopronouns
change note: Version 4.2.0
has top concept: Pronouns
in scheme: v3

Sie/Hir/Hirself (Pronouns)
type: Concept
issued: 2021-07-01
modified: 2025-02-23
replaces: siePronouns
comment: A set of pronouns. Used in this manner: Sie went to the Homosaurus website. I watched hir browse the Homosaurus. Sie uses the Homosaurus hirself.
alternative label: Sie (Pronouns)
broader: Pronouns
broader: Neopronouns
change note: Version 4.2.0
has top concept: Pronouns
in scheme: v3

Se/Ser/Serself (Pronouns)
type: Concept
issued: 2021-07-01
modified: 2025-02-23
replaces: sePronouns
comment: A set of pronouns. Used in this manner: Se went to the Homosaurus website. I watched ser browse the Homosaurus. Se uses the Homosaurus serself.
alternative label: Se (Pronouns)
alternative label: Se/Ser/Serself
broader: Pronouns
broader: Neopronouns
change note: Version 4.2.0
has top concept: Pronouns
in scheme: v3

Shi/Hir/Hirself (Pronouns)
type: Concept
issued: 2021-07-01
modified: 2025-02-23
replaces: shiPronouns
comment: A set of pronouns. Used in this manner: Shi went to the Homosaurus website. I watched hir browse the Homosaurus. Shi uses the Homosaurus hirself.
alternative label: Shi (Pronouns)
alternative label: Shi/Hir/Hirself
broader: Pronouns
broader: Neopronouns
change note: Version 4.2.0
has top concept: Pronouns
in scheme: v3

Si/Hyr/Hyrself (Pronouns)
type: Concept
issued: 2021-07-01
modified: 2025-02-23
replaces: siPronouns
comment: A set of pronouns. Used in this manner: Si went to the Homosaurus website. I watched hyr browse the Homosaurus. Si uses the Homosaurus hyrself.
alternative label: Si (Pronouns)
alternative label: Si/Hyr/Hyrself
broader: Pronouns
broader: Neopronouns
change note: Version 4.2.0
has top concept: Pronouns
in scheme: v3

Thon/Thon/Thonself (Pronouns)
type: Concept
issued: 2021-07-01
modified: 2025-02-23
replaces: thonPronouns
comment: A set of pronouns. Used in this manner: Thon went to the Homosaurus website. I watched thon browse the Homosaurus. Thon uses the Homosaurus thonself.
alternative label: Thon (Pronouns)
alternative label: Thon/Thons/Thonself
broader: Pronouns
broader: Neopronouns
change note: Version 4.2.0
has top concept: Pronouns
in scheme: v3

Ve/Ver/Verself (Pronouns)
type: Concept
issued: 2021-07-01
modified: 2025-02-23
replaces: veVerPronouns
comment: A set of pronouns. Used in this manner: Ve went to the Homosaurus website. I watched ver browse the Homosaurus. Ve uses the Homosaurus verself.
alternative label: Ve/Ver (Pronouns)
alternative label: Ve/Ver/Verself
broader: Pronouns
broader: Neopronouns
change note: Version 4.2.0
has top concept: Pronouns
in scheme: v3

Ve/Vem/Verself (Pronouns)
type: Concept
issued: 2021-07-01
modified: 2025-02-23
replaces: veVemPronouns
comment: A set of pronouns. Used in this manner: Ve went to the Homosaurus website. I watched vem browse the Homosaurus. Ve uses the Homosaurus verself.
alternative label: Ve/Vem (Pronouns)
alternative label: Ve/Vem/Verself
broader: Pronouns
broader: Neopronouns
change note: Version 4.2.0
has top concept: Pronouns
in scheme: v3

Voi/Void/Voidself (Pronouns)
type: Concept
issued: 2021-07-01
modified: 2025-02-23
replaces: voiPronouns
comment: A set of pronouns. Used in this manner: Voi went to the Homosaurus website. I watched void browse the Homosaurus. Voi uses the Homosaurus voidself.
alternative label: Voi (Pronouns)
alternative label: Voi/Void/Voidself
broader: Pronouns
broader: Neopronouns
change note: Version 4.2.0
has top concept: Pronouns
in scheme: v3

Vi/Ver/Virself (Pronouns)
type: Concept
issued: 2021-07-01
modified: 2025-02-23
replaces: viVerPronouns
comment: A set of pronouns. Used in this manner: Vi went to the Homosaurus website. I watched ver browse the Homosaurus. Vi uses the Homosaurus virself.
alternative label: Vi/Ver (Pronouns)
alternative label: Vi/Ver/Virself
broader: Pronouns
broader: Neopronouns
change note: Version 4.2.0
has top concept: Pronouns
in scheme: v3

Vi/Vim/Virself (Pronouns)
type: Concept
issued: 2021-07-01
modified: 2025-02-23
replaces: viVimPronouns
comment: A set of pronouns. Used in this manner: Vi went to the Homosaurus website. I watched vim browse the Homosaurus. Vi uses the Homosaurus virself.
alternative label: Vi/Vim (Pronouns)
alternative label: Vi/Vim/Virself
broader: Pronouns
broader: Neopronouns
change note: Version 4.2.0
has top concept: Pronouns
in scheme: v3

Xie/Xer/Xerself (Pronouns)
type: Concept
issued: 2021-07-01
modified: 2025-02-23
replaces: xiePronouns
comment: A set of pronouns. Used in this manner: Xie went to the Homosaurus website. I watched xer browse the Homosaurus. Xie uses the Homosaurus xerself.
alternative label: Xie (Pronouns)
alternative label: Xie/Xer/Xerself
broader: Pronouns
broader: Neopronouns
change note: Version 4.2.0
has top concept: Pronouns
in scheme: v3

Xe/Xyr/Xemself (Pronouns)
type: Concept
issued: 2021-07-01
modified: 2025-02-23
replaces: xePronouns
comment: A set of pronouns. Used in this manner: Xe went to the Homosaurus website. I watched xyr browse the Homosaurus. Xe uses the Homosaurus xemself.
alternative label: Xe (Pronouns)
alternative label: Xe/Xyr/Xemself
broader: Pronouns
broader: Neopronouns
change note: Version 4.2.0
has top concept: Pronouns
in scheme: v3

Xey/Xem/Xyr (Pronouns)
type: Concept
issued: 2021-07-01
modified: 2025-02-23
replaces: xeyXemXyrPronouns
comment: A set of pronouns. Used in this manner: Xey went to the Homosaurus website. I watched xem browse the Homosaurus. Xey uses the Homosaurus xyr.
alternative label: Xey/Xem/Xyr
broader: Pronouns
broader: Neopronouns
change note: Version 4.2.0
has top concept: Pronouns
in scheme: v3

Xey/Xem/Xeir (Pronouns)
type: Concept
issued: 2021-07-01
modified: 2025-02-23
replaces: xeyXemXeirPronouns
comment: A set of pronouns. Used in this manner: Xey went to the Homosaurus website. I watched xem browse the Homosaurus. Xey uses the Homosaurus xeir.
alternative label: Xey/Xem/Xeir
broader: Pronouns
broader: Neopronouns
change note: Version 4.2.0
has top concept: Pronouns
in scheme: v3

Yo/Yo/Yosself (Pronouns)
type: Concept
issued: 2021-07-01
modified: 2025-02-23
replaces: yoPronouns
comment: A set of pronouns. Used in this manner: Yo went to the Homosaurus website. I watched yo browse the Homosaurus. Yo uses the Homosaurus yosself.
alternative label: Yo (Pronouns)
alternative label: Yo/Yos/Yosself
broader: Pronouns
broader: Neopronouns
change note: Version 4.2.0
has top concept: Pronouns
in scheme: v3

Ze/Zir/Zirself (Pronouns)
type: Concept
issued: 2021-07-01
modified: 2025-02-23
replaces: zePronouns
comment: A set of pronouns. Used in this manner: Ze went to the Homosaurus website. I watched zir browse the Homosaurus. Ze uses the Homosaurus zirself.
alternative label: Ze (Pronouns)
alternative label: Ze/Zir/Zirself
broader: Pronouns
broader: Neopronouns
change note: Version 4.2.0
has top concept: Pronouns
in scheme: v3

Ze/Hir/Hirself (Pronouns)
type: Concept
issued: 2021-07-01
modified: 2025-02-23
replaces: zeHirPronouns
comment: A set of pronouns. Used in this manner: Ze went to the Homosaurus website. I watched hir browse the Homosaurus. Ze uses the Homosaurus hirself.
alternative label: Ze/Hir (Pronouns)
alternative label: Ze/Hir/Hirself
broader: Pronouns
broader: Neopronouns
change note: Version 4.2.0
has top concept: Pronouns
in scheme: v3

Ze/Zem/Zirself (Pronouns)
type: Concept
issued: 2021-07-01
modified: 2025-02-23
replaces: zeZemPronouns
comment: A set of pronouns. Used in this manner: Ze went to the Homosaurus website. I watched zem browse the Homosaurus. Ze uses the Homosaurus zirself.
alternative label: Ze/Zem (Pronouns)
alternative label: Ze/Zem/Zirself
broader: Pronouns
broader: Neopronouns
change note: Version 4.2.0
has top concept: Pronouns
in scheme: v3

Ze/Mer/Zemself (Pronouns)
type: Concept
issued: 2021-07-01
modified: 2025-02-23
replaces: zeMerPronouns
comment: A set of pronouns. Used in this manner: Ze went to the Homosaurus website. I watched mer browse the Homosaurus. Ze uses the Homosaurus zemself.
alternative label: Ze/Mer (Pronouns)
alternative label: Ze/Mer/Zemself
broader: Pronouns
broader: Neopronouns
change note: Version 4.2.0
has top concept: Pronouns
in scheme: v3

Zee/Zed/Zedself (Pronouns)
type: Concept
issued: 2021-07-01
modified: 2025-02-23
replaces: zeeZedPronouns
comment: A set of pronouns. Used in this manner: Zee went to the Homosaurus website. I watched zed browse the Homosaurus. Zee uses the Homosaurus zedself.
alternative label: Zee/Zed (Pronouns)
alternative label: Zee/Zed/Zedself
broader: Pronouns
broader: Neopronouns
change note: Version 4.2.0
has top concept: Pronouns
in scheme: v3

Zie/Zir/Zirself (Pronouns)
type: Concept
issued: 2021-07-01
modified: 2025-02-23
replaces: zeeZirPronouns
comment: A set of pronouns. Used in this manner: Zie went to the Homosaurus website. I watched zir browse the Homosaurus. Zie uses the Homosaurus zirself.
alternative label: Zee/Zir (Pronouns)
alternative label: Zie/Zir/Zirself
broader: Pronouns
broader: Neopronouns
change note: Version 4.2.0
has top concept: Pronouns
in scheme: v3

Zie/Zem/Zirself (Pronouns)
type: Concept
issued: 2021-07-01
modified: 2025-02-23
replaces: zieZemPronouns
comment: A set of pronouns. Used in this manner: Zie went to the Homosaurus website. I watched zem browse the Homosaurus. Zie uses the Homosaurus zirself.
alternative label: Zie/Zem (Pronouns)
alternative label: Zie/Zem/Zirself
broader: Pronouns
broader: Neopronouns
change note: Version 4.2.0
has top concept: Pronouns
in scheme: v3

Zie/Hir/Hirself (Pronouns)
type: Concept
issued: 2021-07-01
modified: 2025-02-23
replaces: zieHirPronouns
comment: A set of pronouns. Used in this manner: Zie went to the Homosaurus website. I watched hir browse the Homosaurus. Zie uses the Homosaurus hirself.
alternative label: Zie/Hir (Pronouns)
alternative label: Zie/Hir/Hirself
broader: Pronouns
broader: Neopronouns
change note: Version 4.2.0
has top concept: Pronouns
in scheme: v3

Zme/Zmyr/Zmyrself (Pronouns)
type: Concept
issued: 2021-07-01
modified: 2025-02-23
replaces: zmePronouns
comment: A set of pronouns. Used in this manner: Zme went to the Homosaurus website. I watched zmyr browse the Homosaurus. Zme uses the Homosaurus zmyrself.
alternative label: Zme (Pronouns)
alternative label: Zme/Zmyr/Zmyrself
broader: Pronouns
broader: Neopronouns
change note: Version 4.2.0
has top concept: Pronouns
in scheme: v3

Anti-Two-Spirit violence
type: Concept
issued: 2021-11-23
modified: 2025-02-23
comment: Behavior involving physical force intended to harm or kill Two-Spirit people on the basis of their identity.
comment: Comportamiento que involucra fuerza física destinada a hacer daño o a matar a personas Dos Espíritus por su identidad.
alternative label: Anti-2S violence
alternative label: Anti-Two Spirit violence
alternative label: Anti-Two Spirited violence
alternative label: Anti-Two-Spirited violence
alternative label: Violencia hacia personas dos espíritus
preferred label: Violencia anti dos espíritus
alternative label: Violencia hacia dos espíritus
broader: Anti-LGBTQ+ violence
change note: Version 4.2.0
has top concept: Anti-LGBTQ+ violence
in scheme: v3
related: Hate crimes

Two-Spirit chefs
type: Concept
issued: 2021-12-07
modified: 2025-02-23
comment: Two-Spirit people who are trained, professional cooks, typically holding a leadership role in the kitchen in which they are employed.
comment: Personas dos espíritus que son cocineras profesionales capacitadas y que normalmente desempeñan un papel de liderazgo en la cocina en la que trabajan.
alternative label: 2S chefs
alternative label: Two Spirit chefs
alternative label: Two Spirited chefs
alternative label: Two-Spirited chefs
broader: Two-Spirit people
change note: Version 4.2.0
has top concept: Gender
in scheme: v3
preferred label: Cocineros dos espíritus
related: LGBTQ+ chefs

Chasers
type: Concept
issued: 2022-01-24
modified: 2025-02-23
comment: Individuals who express fetishistic interest in and pursue sexual encounters with others based solely on their affiliation with a (typically marginalized) group that the chaser does not belong to. Often coupled with other terms to identify the type of chaser.
comment: Personas que expresan interés fetichista y buscan encuentros sexuales con otros basándose únicamente en su afiliación con un grupo (normalmente marginado) al que el perseguidor no pertenece. A menudo se combina con otros términos para identificar el tipo de perseguidor.
alternative label: Cazadores
broader: BDSM
broader: Sexual preference
change note: Version 4.2.0
has top concept: Eroticism
in scheme: v3
preferred label: Perseguidores

Trans inclusivity
type: Concept
issued: 2022-02-14
modified: 2025-02-23
comment: The practice or policy of providing equal access and support to trans people.
comment: La práctica o política de brindar igualdad de acceso y apoyo a las personas trans.
alternative label: Trans affirming
alternative label: Trans inclusion
alternative label: Trans inclusive
alternative label: Trans supportive
alternative label: Trans-inclusive
broader: Inclusivity
change note: Version 4.2.0
has top concept: Inclusivity
in scheme: v3
preferred label: Inclusión trans
related: Transgender people

Lesbian blind people
type: Concept
issued: 2022-02-17
modified: 2025-02-23
comment: Lesbians with significant or total loss of vision.
comment: Lesbianas con pérdida significativa o total de visión.
alternative label: Blind lesbians
alternative label: Ciegas lesbianas
broader: LGBTQ+ blind people
broader: Lesbian disabled people
change note: Version 4.2.0
has top concept: LGBTQ+ people
in scheme: v3
preferred label: Personas lesbianas ciegas

Gay blind men
type: Concept
issued: 2022-02-17
modified: 2025-02-23
comment: Gay men with significant or total loss of vision.
comment: Hombres gay con pérdida significativa o total de la visión.
alternative label: Blind gay men
alternative label: Gay blind people
alternative label: Blind gay people
broader: LGBTQ+ blind people
broader: Gay disabled men
change note: Version 4.2.0
has top concept: LGBTQ+ people
in scheme: v3
preferred label: Hombres gay ciegos

Bisexual blind people
type: Concept
issued: 2022-02-17
modified: 2025-02-23
comment: Bisexual people with significant or total loss of vision.
comment: Personas bisexuales con pérdida significativa o total de la visión.
alternative label: Blind bisexual people
alternative label: Personas ciegas bisexuales
alternative label: Ciegos bisexuales
alternative label: Ciegas bisexuales
broader: LGBTQ+ blind people
broader: Bisexual disabled people
change note: Version 4.2.0
has top concept: LGBTQ+ people
in scheme: v3
preferred label: Personas bisexuales ciegas

Transgender blind people
type: Concept
issued: 2022-02-17
modified: 2025-02-23
comment: Transgender people with significant or total loss of vision.
comment: Personas transgénero con pérdida significativa o total de la visión.
alternative label: Blind transgender people
alternative label: Personas ciegas transgénero
broader: LGBTQ+ blind people
broader: Transgender disabled people
change note: Version 4.2.0
has top concept: LGBTQ+ people
in scheme: v3
preferred label: Personas transgénero ciegas

Queer blind people
type: Concept
issued: 2022-02-17
modified: 2025-02-23
comment: Queer people with significant or total loss of vision.
comment: Personas queer con pérdida significativa o total de la visión.
alternative label: Blind queer people
alternative label: Personas ciegas queer
broader: LGBTQ+ blind people
broader: Queer disabled people
change note: Version 4.2.0
has top concept: LGBTQ+ people
in scheme: v3
preferred label: Personas queer ciegas

Lesbian wheelchair users
type: Concept
issued: 2022-02-24
modified: 2025-02-23
comment: Lesbians who use wheelchairs.
comment: Lesbianas que utilizan sillas de ruedas.
alternative label: Usuarias lésbicas de sillas de ruedas
broader: LGBTQ+ wheelchair users
change note: Version 4.2.0
has top concept: LGBTQ+ people
in scheme: v3
preferred label: Usuarias lesbianas de sillas de ruedas
related: Lesbians with chronic illnesses

Gay wheelchair users
type: Concept
issued: 2022-02-24
modified: 2025-02-23
comment: Gay men who use wheelchairs.
comment: Hombres gay que utilizan sillas de ruedas.
broader: LGBTQ+ wheelchair users
change note: Version 4.2.0
has top concept: LGBTQ+ people
in scheme: v3
preferred label: Usuarios gay de sillas de ruedas
related: Gay men with chronic illnesses

Bisexual wheelchair users
type: Concept
issued: 2022-02-24
modified: 2025-02-23
comment: Bisexual people who use wheelchairs.
comment: Personas bisexuales que utilizan sillas de ruedas.
broader: LGBTQ+ wheelchair users
change note: Version 4.2.0
has top concept: LGBTQ+ people
in scheme: v3
preferred label: Usuarios bisexuales de sillas de ruedas
related: Bisexual people with chronic illnesses

Transgender wheelchair users
type: Concept
issued: 2022-02-24
modified: 2025-02-23
comment: Transgender people who use wheelchairs.
comment: Personas transgénero que utilizan sillas de ruedas.
broader: LGBTQ+ wheelchair users
change note: Version 4.2.0
has top concept: LGBTQ+ people
in scheme: v3
preferred label: Usarios transgénero de sillas de ruedas
related: Transgender people with chronic illnesses

Queer wheelchair users
type: Concept
issued: 2022-02-24
modified: 2025-02-23
comment: Queer people who use wheelchairs.
comment: Personas queer que utilizan sillas de ruedas.
broader: LGBTQ+ wheelchair users
change note: Version 4.2.0
has top concept: LGBTQ+ people
in scheme: v3
preferred label: Usarios queer de sillas de ruedas
related: Queer people with chronic illnesses

Intersex witches
type: Concept
issued: 2022-03-29
modified: 2025-02-23
comment: Intersex practitioners of Wicca or other Pagan religions who self-identify as witches.
comment: Practicantes intersex de Wicca u otras religiones paganas que se autoidentifican como brujas.
alternative label: Intersex Wiccans
broader: LGBTQ+ witches
change note: Version 4.2.0
has top concept: LGBTQ+ African religions
in scheme: v3
preferred label: Brujas intersex
related: Goddess movement

Non-binary identity
type: Concept
issued: 2022-03-31
modified: 2025-02-23
comment: Gender identity that exists outside of the gender binary; may be used as a specific gender identity or as an umbrella term in the Euro-American gender system for gender identities outside of the gender binary.
comment: Identidad de género que existe fuera del binario de género; puede utilizarse como una identidad de género específica o como un término general en el sistema de género euroamericano para identidades de género fuera del binario de género.
alternative label: Nonbinary identity
alternative label: Identidad no-binaria
broader: Gender identity
change note: Version 4.2.0
has top concept: Gender
in scheme: v3
preferred label: Identidad no binaria
related: Non-binary people

Agender identity
type: Concept
issued: 2022-03-31
modified: 2025-02-23
comment: Identity term used to describe people who do not have genders or who identify with genderlessness.
comment: Término de identidad utilizado para describir a personas que no tienen género o que se autoidentifiquen con la falta de género.
broader: Gender identity
change note: Version 4.2.0
has top concept: Gender
in scheme: v3
preferred label: Identidad agénero
related: Agender people

Bisexual athletes
type: Concept
issued: 2022-05-03
modified: 2026-02-24
comment: Professional or amateur/recreational sports players who are bisexual.
comment: Deportistas profesionales o aficionados/recreativos que sean bisexuales.
alternative label: Bisexual sports players
alternative label: Bisexual sportspeople
alternative label: Bisexual sportspersons
alternative label: Jugadores deportivos bisexuales
alternative label: Jugadoras deportivas bisexuales
alternative label: Deportistas bisexuales
broader: LGBTQ+ athletes
change note: Version 4.2.0
has top concept: LGBTQ+ people
in scheme: v3
narrower: Bisexual basketball players
preferred label: Atletas bisexuales

Queer athletes
type: Concept
issued: 2022-05-03
modified: 2026-02-24
comment: Professional or recreational sports players who self-identify as queer.
comment: Deportistas profesionales o recreativos que se identifican como queer.
alternative label: Queer sports players
alternative label: Queer sportspeople
alternative label: Queer sportspersons
alternative label: Jugadores deportivos queer
alternative label: Deportistas queer ||
broader: LGBTQ+ athletes
change note: Version 4.2.0
has top concept: LGBTQ+ people
in scheme: v3
narrower: Queer basketball players
preferred label: Atletas queer

Intersex athletes
type: Concept
issued: 2022-05-03
modified: 2026-02-24
comment: Professional or amateur sports players who are intersex.
comment: Deportistas profesionales o aficionados que sean intersex.
alternative label: Intersex sports players
alternative label: Intersex sportspeople
alternative label: Intersex sportspersons
alternative label: Jugadores deportivos intersex
alternative label: Deportistas intersex||
broader: LGBTQ+ athletes
change note: Version 4.2.0
has top concept: LGBTQ+ people
in scheme: v3
narrower: Intersex basketball players
preferred label: Atletas intersex

Kānaka Maoli transgender people
type: Concept
issued: 2022-05-11
modified: 2025-02-23
comment: Transgender people who are part of the Indigenous people of Mokupuni o Hawai‘i, or the Hawaiian Islands; only use to refer to people who identify as Kanaka Maoli and transgender.
comment: Personas transgénero que pertenecen al pueblo indígena mokupuni o hawai‘i, o a las islas hawaianas. Utilícese únicamente para describir a las personas que se identifiquen como kānaka maoli.
alternative label: Indigenous Hawaiian transgender people
alternative label: Native Hawaiian transgender people
alternative label: Transgender Indigenous Hawaiians
alternative label: Transgender Kānaka Maoli
alternative label: Transgender Kānaka ʻŌiwi
alternative label: Transgender Native Hawaiians
broader: Kānaka Maoli LGBTQ+ people
change note: Version 4.2.0
has top concept: LGBTQ+ people
in scheme: v3
preferred label: Personas transgénero kānaka maoli
related: Māhū

HAART (Highly Active Antiretroviral Therapy)
type: Concept
issued: 2022-05-11
modified: 2025-02-23
comment: Treatment that involves the use of three or more drugs in combination to treat HIV infection by preventing the virus from making copies of itself in the body; can lessen the damage to the immune system caused by HIV, slow down the development of AIDS, and prevent the transmission of HIV to others.
comment: Tratamiento que implica el uso de tres o más medicamentos en combinación para tratar la infección por VIH evitando que el virus se replique en el cuerpo; puede disminuir el daño al sistema inmunológico causado por el VIH, retardar el desarrollo del SIDA y prevenir la transmisión del VIH a otras personas.
alternative label: Combination Anti-Retroviral Therapy
alternative label: Combination Antiretroviral Therapy
alternative label: HAART
alternative label: Highly Active Anti-Retroviral Therapy
alternative label: Highly Active Antiretroviral Therapy
alternative label: cART
broader: Medication
change note: Version 4.2.0
has top concept: Medical care
in scheme: v3
preferred label: TARGA (Terapia Antirretroviral de Gran Actividad)
related: HIV/AIDS

LGBTQ+ home movies
type: Concept
issued: 2022-05-11
modified: 2025-02-23
comment: Short amateur films or videos created primarily to preserve memories; use in reference to home movies created by or featuring LGBTQ+ people.
comment: Cortometrajes o vídeos de aficionados creados principalmente para preservar recuerdos; utilícese en referencia a películas caseras creadas por o protagonizadas por personas LGBTQ+.
alternative label: Home movies (LGBTQ)
alternative label: LGBTQ+ personal films
alternative label: Personal films (LGBTQ)
alternative label: Películas caseras LGBTQ
alternative label: Películas de casa LGBTQ+
alternative label: Películas de casa (LGBTQ)
alternative label: Películas personales LGBTQ+
broader: LGBTQ+ films
change note: Version 4.2.0
has top concept: Subcultures
in scheme: v3
narrower: LGBTQ+ vlogs
preferred label: Películas caseras LGBTQ+

Asexual victims of bullying
type: Concept
issued: 2022-05-11
modified: 2025-02-23
comment: Asexual people who have experienced bullying due to their sexual identity and may or may not have survived; follow the individual's preference for "victims" or "survivors" whenever possible.
comment: Personas asexuales que han sufrido acoso por su identidad sexual y pueden o no haber sobrevivido; siga la preferencia de la persona sobre el uso de "víctimas" o "supervivientes" siempre que sea posible.
broader: LGBTQ+ victims of bullying
broader: LGBTQ+ youth victims of bullying
change note: Version 4.2.0
has top concept: LGBTQ+ people
in scheme: v3
preferred label: Víctimas asexuales de acoso

Chicano/a/x gay men
type: Concept
issued: 2022-05-11
modified: 2025-02-23
comment: Gay men of Mexican descent born in the United States; only use to describe people who self-identify as Chicano, Chicana, or Chicanx. Do not conflate with Latino/a/x or Hispanic people.
comment: Hombres gay de ascendencia mexicana nacidos en Estados Unidos; utilícese únicamente para describir a personas que se autoidentifiquen como chicanas. No se debe confundir con latinos/a/x o hispanos.
alternative label: Chicano gay men
alternative label: Chicanx gay men
alternative label: Gay Chicanos
alternative label: Gay Chicanx men
alternative label: Gay Chicanxs
alternative label: Chicanos gay
alternative label: Gays chicanos
broader: Chicano/a/x LGBTQ+ people
change note: Version 4.2.0
has top concept: LGBTQ+ people
in scheme: v3
preferred label: Hombres gay chicanos
related: Banjees

Two-Spirit people in the workplace
type: Concept
issued: 2022-06-15
modified: 2025-02-23
comment: The presence of Two-Spirit people in the workplace, including acceptance of and issues faced by Two-Spirit workers.
comment: La presencia de personas dos espíritus en el lugar de trabajo, incluida la aceptación de los trabajadores dos espíritus y los problemas a los que se enfrentan.
broader: Two-Spirit people
change note: Version 4.2.0
has top concept: Gender
in scheme: v3
preferred label: Personas dos espíritus en el lugar de trabajo
related: LGBTQ+ people in the workplace

Female gaze
type: Concept
issued: 2022-06-15
modified: 2025-02-23
comment: A term used to describe the depiction of women in media and the arts as subjects with agency and whose perspective a text may be presented from. Often used in contrast to the male gaze.
comment: Término utilizado para describir la representación de las mujeres en los medios y las artes como sujetos con agencia y desde cuya perspectiva se puede presentar un texto. A menudo, se utiliza en contraste a la mirada masculina.
broader: Feminist theory
change note: Version 4.2.0
has top concept: Theories
in scheme: v3
preferred label: Mirada femenina
related: Queer gaze

Male gaze
type: Concept
issued: 2022-06-15
modified: 2025-02-23
comment: A term used to describe the sexualized and objectified depiction of women in media and the arts from the perspective of and for the pleasure of the heterosexual man/male viewer. Originally used solely to describe the heterosexual, cisgender gaze but has since been expanded.
comment: Término utilizado para describir la representación sexualizada y cosificada de las mujeres en los medios y las artes desde la perspectiva y para el placer hombre heterosexual/espectador masculino. Originalmente se utilizaba únicamente para describir la mirada heterosexual y cisgénero, pero desde entonces se ha ampliado.
broader: Feminist theory
change note: Version 4.2.0
has top concept: Theories
in scheme: v3
preferred label: Mirada masculina
related: Queer gaze

Bury your gays
type: Concept
issued: 2022-07-04
modified: 2025-02-23
comment: The trope in fiction that requires that LGBTQ+ characters die or meet some other type of unhappy ending. The trope is also known as "dead lesbian syndrome" due to the tendency for lesbian characters and bisexual female characters to be the targets. Transgender characters have also often been subjected to this trope.
comment: El tropo de ficción que requiere que los personajes LGBTQ+ mueran o tengan otro tipo de final infeliz. El tropo también se conoce como el "síndrome de lesbiana muerta" debido a la tendencia de que personajes lésbicos y personajes femeninos bisexuales sean el foco del tropo. Las personajes transgénero a menudo también han sido sometidas a este tropo.
alternative label: Dead lesbian syndrome
broader: Fanfiction tropes and genres
change note: Version 4.2.0
has top concept: Subcultures
in scheme: v3
related: LGBTQ+ fiction

Fursonas
type: Concept
issued: 2022-07-04
modified: 2025-02-23
comment: Anthropomorphized animal versions of people. Fursonas, which are created by members of the furry fandom, are not necessarily animals with fur; they can also be reptiles, birds, or fictional animals, for example.
comment: Versiones animales antropomorfizadas de personas. Las fursonas, que son creadas por miembros del fandom de furros, no son necesariamente animales con pelaje; también pueden ser reptiles, pájaros o animales ficticios, por ejemplo.
broader: Furries
change note: Version 4.2.0
has top concept: Subcultures
in scheme: v3
related: Role behavior

Hentai fandom
type: Concept
issued: 2022-07-04
modified: 2025-02-23
comment: The fan community that focuses on, incorporates, or details the relationships of characters in hentai, or sexually explicit anime and manga.
comment: La comunidad de fans que se centra en, incorpora o detalla las relaciones de personajes de hentai o anime y manga sexualmente explícitos.
broader: Anime and manga fandom
change note: Version 4.2.0
has top concept: Subcultures
in scheme: v3
narrower: Hentai
preferred label: Fandom de hentai

People of color in fandom
type: Concept
issued: 2022-07-04
modified: 2025-02-23
comment: The participation and inclusion of people of color in fan communities.
comment: La participación e inclusión de personas de color en las comunidades de fans.
alternative label: BIPOC in fandom
broader: Fandom
change note: Version 4.2.0
has top concept: Subcultures
in scheme: v3
preferred label: Personas de color en fandom
related: LGBTQ+ people of color

Ship names in fandom
type: Concept
issued: 2022-07-04
modified: 2025-02-23
comment: Names used to describe common pairings in fandom. Ship names are often portmanteaus of the names of two (or more) characters in the ship (e.g., Spirk for Spock and Kirk).
comment: Nombres utilizados para describir emparejamientos comunes en el fandom. Los nombres de los "ships" suelen ser combinaciones de los nombres de dos (o más) personajes del "ship" (por ejemplo, "Spirk" para Spock y Kirk).
alternative label: Pairing names in fandom
alternative label: Ship names en el fandom
broader: Shipping in fandom
change note: Version 4.2.0
has top concept: Subcultures
in scheme: v3
narrower: Kirk/Spock
preferred label: Nombres de ship en el fandom

Slash (Genre)
type: Concept
issued: 2022-07-04
modified: 2025-02-23
comment: A genre of fanworks in which two or more characters of the same sex or gender are placed in sexual or romantic situations with one another. Slash fanworks are commonly erotic or pornographic. While the term "slash" has historically been used for male/male couples only, it has been recently been broadened to include LGBTQ+ relationships other than those between two men.
comment: Un género de obras de fans en el que dos o más personajes del mismo sexo o género son colocados en situaciones sexuales o románticas entre sí. Las obras de fans Slash son comúnmente eróticas o pornográficas. Si bien el término "slash" se ha utilizado históricamente solo para relaciones entre hombres, recientemente se ha ampliado para incluir relaciones LGBTQ+ distintas de aquellas entre dos hombres.
alternative label: Slash
broader: Slash fandom
change note: Version 4.2.0
has top concept: Subcultures
in scheme: v3
narrower: Femslash
preferred label: Slash (género)

Slash vidding
type: Concept
issued: 2022-07-04
modified: 2025-02-23
comment: Creating videos about sexual or romantic relationships between same-sex or -gender couples using scenes from television, movies, or video games. Historically used for male-male couples only, but is now used more broadly; includes femslash vidding.
broader: Slash fanworks
change note: Version 4.2.0
has top concept: Subcultures
in scheme: v3
related: LGBTQ+ video games

Uke (Yaoi)
type: Concept
issued: 2022-07-04
modified: 2025-02-23
comment: Term used in yaoi and yaoi fan communities to describe the receiving or submissive partner in a fictional male-male relationship.
comment: Término utilizado en las comunidades de fans del yaoi y del yaoi para describir a la pareja receptora o sumisa en una relación ficticia entre hombres.
broader: Yaoi
change note: Version 4.2.0
has top concept: Subcultures
in scheme: v3
related: Bishounen
related: Boys' Love (Genre)

Women in fandom
type: Concept
issued: 2022-07-04
modified: 2025-02-23
comment: The participation and inclusion of women in fan communities.
comment: La participación e inclusión de las mujeres en las comunidades de fans.
broader: Gender in fandom
change note: Version 4.2.0
has top concept: Subcultures
in scheme: v3
preferred label: Mujeres en fandom
related: Females

Yiff
type: Concept
issued: 2022-07-04
modified: 2025-02-23
comment: Slang term used by members of the furry fandom to describe the act of sex.
comment: Término en inglés de la jerga utilizado por miembros del fandom o comunidad furro para describir el acto sexual.
broader: Furries
change note: Version 4.2.0
has top concept: Subcultures
in scheme: v3
related: Sex (Act)

Third-wave feminism
type: Concept
issued: 2022-11-08
modified: 2025-02-23
comment: Period of feminist political activity beginning in the early 1990s that embraced diversity and individualism in women and sought to redefine what it meant to be a feminist. The third wave is characterized by the emergence of new feminist movements and theories such as intersectionality, sex positivity, ecofeminism, transfeminism, and postmodern feminism.
comment: Periodo de actividad política feminista que comenzó a principios de la década de 1990 y que abrazó la diversidad y el individualismo de las mujeres y buscó redefinir lo que significaba ser feminista. La tercera ola se caracteriza por el surgimiento de nuevos movimientos y teorías feministas como la interseccionalidad, la positividad sexual, el ecofeminismo, el transfeminismo y el feminismo posmoderno.
alternative label: Third wave feminism
broader: Feminism
change note: Version 4.2.0
has top concept: Feminism
in scheme: v3
preferred label: Feminismo de la tercera ola
related: Third-wave feminists

Sapphic identity
type: Concept
issued: 2022-11-08
modified: 2025-02-23
comment: Sexual identity or sexuality term used to describe women and, in some definitions, non-binary people who are sapphic, or attracted to women. Only use to describe individuals who describe their identity as sapphic.
comment: Término de identidad sexual o de sexualidad utilizado para describir a mujeres y, en algunas definiciones, a personas no binarias que son sáficas o que se ven atraídas por mujeres. Utilícese únicamente para describir a personas que describen su identidad como sáfica.
alternative label: Sapphist identity
alternative label: Identidad safista
broader: Sexual identity
change note: Version 4.2.0
has top concept: Sexual identity
in scheme: v3
preferred label: Identidad sáfica
related: Sapphics

Mustaches
type: Concept
issued: 2022-11-10
modified: 2025-02-23
comment: Facial hair on the upper lip. Includes false or drag mustaches as well as naturally grown hair.
comment: Vello facial en el labio superior. Incluye bigotes postizos o de drag, así como vello crecido de forma natural.
broader: Hair
change note: Version 4.2.0
has top concept: Sex (Body)
in scheme: v3
narrower: Cookie dusters
preferred label: Bigotes
preferred label: Moustaches

Cookie dusters
type: Concept
issued: 2022-11-10
modified: 2025-02-23
comment: Slang term for mustaches or facial hair on the upper lip, particularly that of lesbians.
alternative label: Muff ticklers
alternative label: Pussy dusters
alternative label: Womb brooms
broader: Mustaches
change note: Version 4.2.0
has top concept: Sex (Body)
in scheme: v3
related: Lesbian slang

Lesbian cinema
type: Concept
issued: 2022-11-15
modified: 2025-02-23
comment: Term that encompasses lesbian filmmaking, the lesbian film industry, and film as an art form within lesbian culture. For specific movies created by or representing lesbians, use the term "Lesbian films."
comment: Término que abarca el cine lésbico, la industria cinematográfica lésbica y el cine como forma de arte dentro de la cultura lésbica. Para películas específicas creadas por lesbianas o que las representen, utilícese el término "películas de lesbianas".
alternative label: Lesbian film
broader: LGBTQ+ cinema
change note: Version 4.2.0
has top concept: Subcultures
in scheme: v3
narrower: Lesbian films
preferred label: Cine lésbico

Gay cinema
type: Concept
issued: 2022-11-15
modified: 2025-02-23
comment: Term that encompasses gay filmmaking, the gay film industry, and film as an art form within gay culture. For specific movies created by or representing gay men, use the term "Gay films."
comment: Término que abarca el cine gay, la industria cinematográfica gay y el cine como forma de arte dentro de la cultura gay. Para películas específicas creadas por o que representan a hombres gay, utilice el término "películas gay".
alternative label: Gay film
alternative label: Filmes gay
alternative label: Películas gay
broader: LGBTQ+ cinema
change note: Version 4.2.0
has top concept: Subcultures
in scheme: v3
narrower: Gay films
preferred label: Cine gay

LGBTQ+ grandchildren
type: Concept
issued: 2022-12-13
modified: 2025-02-23
comment: LGBTQ+ people who are grandchildren.
comment: Personas LGBTQ+ que son nietos.
alternative label: Grandchildren (LGBTQ)
alternative label: Nietas LGBTQ+
alternative label: Nietos LGBTQ+
broader: Grandchildren
broader: LGBTQ+ people
change note: Version 4.2.0
has top concept: Family members
in scheme: v3
preferred label: Nietas y nietos LGBTQ+

LGBTQ+ family members
type: Concept
issued: 2022-12-13
modified: 2025-02-23
comment: Family members who are LGBTQ+.
comment: Miembros de la familia que son LGBTQ+.
alternative label: Family members (LGBTQ)
broader: Family members
broader: LGBTQ+ people
change note: Version 4.2.0
has top concept: Family members
in scheme: v3
preferred label: Familiares LGBTQ+

Lesbian children
type: Concept
issued: 2022-12-13
modified: 2025-02-23
comment: Lesbians who have not yet reached the age of adolescence.
comment: Niñas menores de 18 años que se autoidentifican como lesbianas.
alternative label: Lesbian kids
alternative label: Niñxs lesbianas
broader: LGBTQ+ children
change note: Version 4.2.0
has top concept: Family members
in scheme: v3
preferred label: Niños lesbianas
related: Lesbian girls

Gay children
type: Concept
issued: 2022-12-13
modified: 2025-02-23
comment: Gay people who have not yet reached the age of adolescence.
comment: Niños menores de 18 años que se autoidentifican como gay.
alternative label: Gay kids
preferred label: Niños gay
broader: LGBTQ+ children
change note: Version 4.2.0
has top concept: Family members
in scheme: v3
related: Gay boys

Police entrapment of LGBTQ+ people
type: Concept
issued: 2023-01-13
modified: 2025-02-23
comment: A practice in which law enforcement agents or agents of the state coerce an LGBTQ+ person to commit a "crime" they would have otherwise been unlikely or unwilling to commit. Legal definitions of entrapment vary widely depending on the jurisdiction, but the term is often used colloquially to refer to police acting dishonestly or in bad faith, as well as policing focused on anticipating and inducing crime, rather than responding to reports of crime.
comment: Práctica mediante la cual la policía induce a personas LGBTQ+ a cometer acciones consideradas delitos que de otro modo no se habrían cometido o que era poco probable que se hubieran cometido.
alternative label: Atrapamiento policial de personas LGBTQ+
broader: Police entrapment
broader: Police interactions with LGBTQ+ people
change note: Version 4.2.0
has top concept: Harassment
in scheme: v3
preferred label: Aprisionamiento policial de personas LGBTQ+

Police raids on LGBTQ+ bathhouses
type: Concept
issued: 2023-01-13
modified: 2025-02-23
comment: Unexpected and unannounced entry into and searches of bathouses, saunas, or spas owned or frequented by LGBTQ+ people by law enforcement officers with the aim of using surprise to seize evidence or arrest suspects. Police raids may be undertaken legally using a search warrant or through exigent circumstances, such as probable cause, though the latter is highly subjective and civilians often have little resources to appeal illegal raids.
comment: Redadas policiales en baños, saunas, spas, etc. afiliados o relacionados con comunidades o identidades LGBTQ+.
alternative label: Redadas policiales en casas de baño LGBTQ+
broader: Police raids on LGBTQ+-related establishments
change note: Version 4.2.0
has top concept: Harassment
in scheme: v3
preferred label: Redadas policiales en saunas LGBTQ+
related: Gay saunas

Police raids on LGBTQ+ bars
type: Concept
issued: 2023-01-13
modified: 2025-02-23
comment: Unexpected and unannounced entry into and searches of drinking establishments owned or frequented by LGBTQ+ people by law enforcement officers with the aim of using surprise to seize evidence or arrest suspects. Police raids may be undertaken legally using a search warrant or through exigent circumstances, such as probable cause, though the latter is highly subjective and civilians often have little resources to appeal illegal raids.
comment: Redadas policiales en bares afiliados o relacionados con comunidades e identidades LGBTQ+.
broader: Police raids on LGBTQ+-related establishments
change note: Version 4.2.0
has top concept: Harassment
in scheme: v3
preferred label: Redadas policiales en bares LGBTQ+
related: LGBTQ+ bars

Police raids on LGBTQ+ nightclubs
type: Concept
issued: 2023-01-13
modified: 2025-02-23
comment: Unexpected and unannounced entry into and searches of nightclubs owned or frequented by LGBTQ+ people by law enforcement officers with the aim of using surprise to seize evidence or arrest suspects. Police raids may be undertaken legally using a search warrant or through exigent circumstances, such as probable cause, though the latter is highly subjective and civilians often have little resources to appeal illegal raids.
comment: Redadas policiales en clubes nocturnos afiliados o relacionados con comunidades o identidades LGBTQ+
broader: Police raids on LGBTQ+-related establishments
change note: Version 4.2.0
has top concept: Harassment
in scheme: v3
preferred label: Redadas policiales en clubs LGBTQ+|| Redadas policiales en clubes nocturnos LGBTQ+
related: LGBTQ+ night life

Non-binary parents
type: Concept
issued: 2023-01-13
modified: 2025-02-23
comment: Parents who are non-binary.
comment: Padres y/o madres que son no-binarios.
alternative label: Padres no binarios
alternative label: Madres no binarias
broader: Non-binary people
broader: LGBTQ+ parents
change note: Version 4.2.0
has top concept: LGBTQ+ people
in scheme: v3
preferred label: Madres y padres no binarios

Attitudes of LGBTQ+ people toward police
type: Concept
issued: 2023-01-13
modified: 2026-02-27
comment: Attitudes and assessments of feelings, relationships, and interactions between LGBTQ+ people and police.
comment: Actitudes y evaluaciones de los sentimientos, relaciones e interacciones entre las personas LGBTQ+ y la policía.
alternative label: LGBTQ+ viewpoints on police
alternative label: LGBTQ+ views of police
alternative label: Perceptions of police by LGBTQ+ communities
alternative label: Perceptions of police by LGBTQ+ people
alternative label: Opiniones de las personas LGBTQ+ hacia la policía
broader: Police interactions with LGBTQ+ people
change note: Version 4.2.0
has top concept: Police interactions with LGBTQ+ people
in scheme: v3
preferred label: Posturas de las personas LGBTQ+ sobre la policía
related: Police

Asexual fantasy fiction
type: Concept
issued: 2023-01-17
modified: 2025-02-23
comment: Genre that uses magic and other supernatural phenomena as a primary element of plot, theme, and/or setting; use for fantasy fiction focusing on asexual characters or themes.
comment: Género que utiliza la magia y otros fenómenos sobrenaturales como elemento principal de la trama, el tema y/o el escenario; utilícese para la ficción fantástica centrada en personajes o temas asexuales.
broader: LGBTQ+ fantasy fiction
broader: Asexual fiction
change note: Version 4.2.0
has top concept: Subcultures
in scheme: v3
preferred label: Ficción fantástica asexual

Aromantic fantasy fiction
type: Concept
issued: 2023-01-24
modified: 2025-02-23
comment: Genre that uses magic and other supernatural phenomena as a primary element of plot, theme, and/or setting; use for fantasy fiction focusing on aromantic characters or themes.
comment: Género que utiliza la magia y otros fenómenos sobrenaturales como elemento principal de la trama, el tema y/o el escenario; utilícese para la ficción fantástica centrada en personajes o temas arrománticos.
broader: LGBTQ+ fantasy fiction
broader: Aromantic fiction
change note: Version 4.2.0
has top concept: Subcultures
in scheme: v3
preferred label: Ficción fantástica arromántica

Intersex fantasy fiction
type: Concept
issued: 2023-01-24
modified: 2025-02-23
comment: Genre that uses magic and other supernatural phenomena as a primary element of plot, theme, and/or setting; use for fantasy fiction focusing on intersex characters or themes.
comment: Género que utiliza la magia y otros fenómenos sobrenaturales como elemento principal de la trama, el tema y/o el escenario; utilícese para la ficción fantástica que se centre en personajes o temas intersex.
broader: LGBTQ+ fantasy fiction
broader: Intersex fiction
change note: Version 4.2.0
has top concept: Subcultures
in scheme: v3
preferred label: Ficción fantástica intersex

Demisexual fantasy fiction
type: Concept
issued: 2023-01-24
modified: 2025-02-23
comment: Genre that uses magic and other supernatural phenomena as a primary element of plot, theme, and/or setting; use for fantasy fiction focusing on demisexual characters or themes.
comment: Género que utiliza la magia y otros fenómenos sobrenaturales como elemento principal de la trama, tema y/o escenario; utilícese para ficción fantástica que se centra en personajes o temas demisexuales.
broader: LGBTQ+ fantasy fiction
broader: Demisexual fiction
change note: Version 4.2.0
has top concept: Subcultures
in scheme: v3
preferred label: Ficción fantástica demisexual

Demisexual horror fiction
type: Concept
issued: 2023-01-24
modified: 2025-02-23
comment: Written works of fiction intended to frighten, scare, or disgust; use in reference to horror fiction focusing on demisexual characters or themes.
comment: Obras de ficción escritas con la intención de asustar, atemorizar o provocar disgusto; utilícese en referencia a la ficción de horror centrada en personajes o temas demisexuales.
broader: LGBTQ+ horror fiction
broader: Demisexual fiction
change note: Version 4.2.0
has top concept: Subcultures
in scheme: v3
preferred label: Ficción de horror demisexual

Aromantic horror fiction
type: Concept
issued: 2023-01-24
modified: 2025-02-23
comment: Written works of fiction intended to frighten, scare, or disgust; use in reference to horror fiction focusing on aromantic characters or themes.
comment: Obras de ficción escritas con la intención de asustar, atemorizar o provocar disgusto. Utilícese en referencia a la ficción de horror centrada en personajes o temas arrománticos.
broader: LGBTQ+ horror fiction
broader: Aromantic fiction
change note: Version 4.2.0
has top concept: Subcultures
in scheme: v3
preferred label: Ficción de horror aromántica

Intersex horror fiction
type: Concept
issued: 2023-01-24
modified: 2025-02-23
comment: Written works of fiction intended to frighten, scare, or disgust; use in reference to horror fiction focusing on intersex characters or themes.
comment: Obras de ficción escritas con la intención de asustar, atemorizar o provocar disgusto; utilícese en referencia a la ficción de horror centrada en personajes o temas intersex.
broader: LGBTQ+ horror fiction
broader: Intersex fiction
change note: Version 4.2.0
has top concept: Subcultures
in scheme: v3
preferred label: Ficción de horror intersex

Asexual mystery and detective fiction
type: Concept
issued: 2023-01-24
modified: 2025-02-23
comment: Written literary works about the investigation of crime or the work of detectives; use in reference to mystery and detective fiction focusing on asexual characters and themes.
comment: Obras literarias escritas sobre la investigación de crímenes o el trabajo de detectives; utilícese en referencia a la ficción de misterio y de detectives centrada en personajes y temas asexuales.
broader: LGBTQ+ mystery and detective fiction
broader: Asexual fiction
change note: Version 4.2.0
has top concept: Subcultures
in scheme: v3
preferred label: Ficción asexual de misterio y de detectives

Demisexual mystery and detective fiction
type: Concept
issued: 2023-01-24
modified: 2025-02-23
comment: Written literary works about the investigation of crime or the work of detectives; use in reference to mystery and detective fiction focusing on demisexual characters and themes.
comment: Obras literarias escritas sobre la investigación de crímenes o el trabajo de detectives; utilícese en referencia a la ficción de misterio y de detectives centrada en personajes y temas demisexuales.
broader: LGBTQ+ mystery and detective fiction
broader: Demisexual fiction
change note: Version 4.2.0
has top concept: Subcultures
in scheme: v3
preferred label: Ficción demisexual de misterio y de detectives

Aromantic mystery and detective fiction
type: Concept
issued: 2023-01-24
modified: 2025-02-23
comment: Written literary works about the investigation of crime or the work of detectives; use in reference to mystery and detective fiction focusing on aromantic characters and themes.
comment: Obras literarias escritas sobre la investigación de crímenes o el trabajo de detectives; utilícese en referencia a la ficción de misterio y de detectives centrada en personajes y temas arrománticos.
broader: LGBTQ+ mystery and detective fiction
broader: Aromantic fiction
change note: Version 4.2.0
has top concept: Subcultures
in scheme: v3
preferred label: Ficción arromántica de misterio y de detectives

Intersex mystery and detective fiction
type: Concept
issued: 2023-01-24
modified: 2025-02-23
comment: Written literary works about the investigation of crime or the work of detectives; use in reference to mystery and detective fiction focusing on intersex characters and themes.
comment: Obras literarias escritas sobre la investigación de crímenes o el trabajo de detectives; utilícese en referencia a la ficción de misterio y de detectives centrada en personajes y temas intersex.
broader: LGBTQ+ mystery and detective fiction
broader: Intersex fiction
change note: Version 4.2.0
has top concept: Subcultures
in scheme: v3
preferred label: Ficción intersex de misterio y de detectives

Asexual romance fiction
type: Concept
issued: 2023-01-24
modified: 2025-02-23
comment: Works of fiction revolving around romantic and/or sexual relationships between the main characters; use in reference to romance fiction focusing on asexual characters.
comment: Obras de ficción que giran en torno a relaciones románticas y/o sexuales entre los personajes principales; utilícese en referencia a la ficción romántica centrada en personajes asexuales.
broader: LGBTQ+ romance fiction
broader: Asexual fiction
change note: Version 4.2.0
has top concept: Subcultures
in scheme: v3
preferred label: Ficción romántica asexual

Aromantic romance fiction
type: Concept
issued: 2023-01-24
modified: 2025-02-23
comment: Works of fiction revolving around romantic and/or sexual relationships between the main characters; use in reference to romance fiction focusing on aromantic characters.
comment: Obras de ficción que giran en torno a las relaciones románticas y/o sexuales entre los personajes principales; utilícese en referencia a la ficción romántica centrada en personajes arománticos.
broader: LGBTQ+ romance fiction
broader: Aromantic fiction
change note: Version 4.2.0
has top concept: Subcultures
in scheme: v3
preferred label: Ficción romántica arromántica

Intersex romance fiction
type: Concept
issued: 2023-01-24
modified: 2025-02-23
comment: Works of fiction revolving around romantic and/or sexual relationships between the main characters; use in reference to romance fiction focusing on intersex characters.
comment: Obras de ficción que giran en torno a relaciones románticas y/o sexuales entre los personajes principales; utilícese en referencia a la ficción romántica centrada en personajes intersex.
broader: LGBTQ+ romance fiction
broader: Intersex fiction
change note: Version 4.2.0
has top concept: Subcultures
in scheme: v3
preferred label: Ficción romántica intersex

Demisexual romance fiction
type: Concept
issued: 2023-01-24
modified: 2025-02-23
comment: Works of fiction revolving around romantic and/or sexual relationships between the main characters; use in reference to romance fiction focusing on demisexual characters.
comment: Obras de ficción que giran en torno a relaciones románticas y/o sexuales entre los personajes principales; utilícese en referencia a la ficción romántica centrada en personajes demisexuales.
broader: LGBTQ+ romance fiction
broader: Demisexual fiction
change note: Version 4.2.0
has top concept: Subcultures
in scheme: v3
preferred label: Ficción romántica demisexual

Asexual science fiction
type: Concept
issued: 2023-01-24
modified: 2025-02-23
comment: Written literary work about imaginative or futuristic concepts incorporating science, technology, space, time travel, and other speculative elements; use in reference to science fiction focusing on asexual characters or themes.
comment: Obra literaria escrita sobre conceptos imaginativos o futuristas que incorporan la ciencia, la tecnología, el espacio, los viajes en el tiempo y otros elementos especulativos; utilícese en referencia a la ciencia ficción que se centra en personajes o temas asexuales.
broader: LGBTQ+ science fiction
broader: Asexual fiction
change note: Version 4.2.0
has top concept: Subcultures
in scheme: v3
preferred label: Ciencia ficción asexual

Demisexual science fiction
type: Concept
issued: 2023-01-24
modified: 2025-02-23
comment: Written literary work about imaginative or futuristic concepts incorporating science, technology, space, time travel, and other speculative elements; use in reference to science fiction focusing on demisexual characters or themes.
comment: Obras literarias escritas sobre conceptos imaginativos o futuristas que incorporen la ciencia, la tecnología, el espacio, los viajes en el tiempo y otros elementos especulativos; utilícese en referencia a la ciencia ficción centrada en personajes o temas demisexuales.
broader: LGBTQ+ science fiction
broader: Demisexual fiction
change note: Version 4.2.0
has top concept: Subcultures
in scheme: v3
preferred label: Ciencia ficción demisexual

Aromantic science fiction
type: Concept
issued: 2023-01-24
modified: 2025-02-23
comment: Written literary work about imaginative or futuristic concepts incorporating science, technology, space, time travel, and other speculative elements; use in reference to science fiction focusing on aromantic characters or themes.
comment: Obras literarias escritas sobre conceptos imaginativos o futuristas que incorporan la ciencia, la tecnología, el espacio, los viajes en el tiempo y otros elementos especulativos; utilícese en referencia a la ciencia ficción centrada en personajes o temas arrománticos.
broader: LGBTQ+ science fiction
broader: Aromantic fiction
change note: Version 4.2.0
has top concept: Subcultures
in scheme: v3
preferred label: Ciencia ficción arromántica

Intersex science fiction
type: Concept
issued: 2023-01-24
modified: 2025-02-23
comment: Written literary work about imaginative or futuristic concepts incorporating science, technology, space, time travel, and other speculative elements; use in reference to science fiction focusing on intersex characters or themes.
comment: Obras literarias escritas sobre conceptos imaginativos o futuristas que incorporen la ciencia, la tecnología, el espacio, los viajes en el tiempo y otros elementos especulativos; utilícese en referencia a la ciencia ficción centrada en personajes o temas intersex.
broader: LGBTQ+ science fiction
broader: Intersex fiction
change note: Version 4.2.0
has top concept: Subcultures
in scheme: v3
preferred label: Ciencia ficción intersex

Demisexual short stories
type: Concept
issued: 2023-01-24
modified: 2025-02-23
comment: Written literary works that are short in length and detail a self-contained incident or concept; use in reference to short stories focusing on demisexual characters or themes.
comment: Obras literarias escritas que son breves y detallan un incidente o concepto autónomo. Utilícese en referencia a historias cortas que se centren en personajes o temas demisexuales.
alternative label: Relatos demisexuales
broader: LGBTQ+ short stories
broader: Demisexual fiction
change note: Version 4.2.0
has top concept: Subcultures
in scheme: v3
preferred label: Cuentos cortos demisexuales

Aromantic theater
type: Concept
issued: 2023-03-20
modified: 2025-02-23
comment: Works in the performance arts that focus on aromantic characters, communities, or issues.
comment: Obras de artes escénicas centradas en personajes, comunidades o temas arománticos.
broader: LGBTQ+ theater
change note: Version 4.2.0
has top concept: LGBTQ+ theater
in scheme: v3
preferred label: Teatro arromántico
related: Aromantic drama

Aromantic youth literature
type: Concept
issued: 2023-03-23
modified: 2025-02-23
comment: Written literary works for an audience of readers from 12-18 years of age, also known as young adult literature or YA; use in reference to youth literature focusing on aromantic characters or themes.
comment: Obras literarias escritas para un público de lectores de 12 a 18 años de edad, también conocidas como literatura para jóvenes adultos o YA (por sus siglas en inglés); utilícese en referencia a la literatura para jóvenes centrada en personajes o temas arrománticos.
broader: LGBTQ+ youth literature
change note: Version 4.2.0
has top concept: Subcultures
in scheme: v3
preferred label: Literatura juvenil arromántica
related: Aromantic youth

Asexual theater
type: Concept
issued: 2023-03-23
modified: 2025-02-23
comment: Works in the performance arts that focus on asexual characters, communities, or issues.
comment: Obras de artes escénicas que se centran en personajes, comunidades o cuestiones asexuales.
broader: LGBTQ+ theater
change note: Version 4.2.0
has top concept: LGBTQ+ theater
in scheme: v3
preferred label: Teatro asexual
related: Asexual drama

Asexual youth literature
type: Concept
issued: 2023-03-23
modified: 2025-02-23
comment: Written literary works for an audience of readers from 12-18 years of age, also known as young adult literature or YA; use in reference to youth literature focusing on asexual characters or themes.
comment: Obras literarias escritas para una audiencia de lectores de 12 a 18 años de edad, también conocida como literatura para adultos jóvenes o YA; utilícese en referencia a la literatura juvenil que se centra en personajes o temas asexuales
broader: LGBTQ+ youth literature
change note: Version 4.2.0
has top concept: Subcultures
in scheme: v3
preferred label: Literatura juvenil asexual
related: Asexual youth

Demisexual theater
type: Concept
issued: 2023-03-26
modified: 2025-02-23
comment: Works in the performance arts that focus on demisexual characters, communities, or issues.
comment: Trabajos en las artes escénicas que se centran en personajes, comunidades o cuestiones demisexuales.
broader: LGBTQ+ theater
change note: Version 4.2.0
has top concept: LGBTQ+ theater
in scheme: v3
preferred label: Teatro demisexual
related: Demisexual drama

Demisexual youth
type: Concept
issued: 2023-03-28
modified: 2025-02-23
comment: Demisexual people between the ages of childhood and adulthood.
comment: Personas demisexuales entre las edades de infancia y la adultez.
alternative label: Jóvenes demisexuales
broader: LGBTQ+ youth
change note: Version 4.2.0
has top concept: Youth
in scheme: v3
preferred label: Juventud demisexual
related: Demisexual youth literature

Demisexual youth literature
type: Concept
issued: 2023-03-28
modified: 2025-02-23
comment: Written literary works for an audience of readers from 12-18 years of age, also known as young adult literature or YA; use in reference to youth literature focusing on demisexual characters or themes.
comment: Obras literarias escritas para una audiencia de lectores de 12 a 18 años de edad, también conocida como literatura para adultos jóvenes o YA; utilícese en referencia a la literatura juvenil que se centra en personajes o temas demisexuales.
broader: LGBTQ+ youth literature
change note: Version 4.2.0
has top concept: Subcultures
in scheme: v3
preferred label: Literatura juvenil demisexual
related: Demisexual youth

Demisexual literary criticism
type: Concept
issued: 2023-03-28
modified: 2025-02-23
comment: The study, evaluation, and interpretation of literary works focusing on demisexual characters or themes; can also include interpretation of literature through the lens and frameworks of demisexual studies.
comment: El estudio, la evaluación y la interpretación de obras literarias que se centran en personajes o temas demisexuales; también puede incluir la interpretación de la literatura a través de un lente y marcos teóricos de los estudios demisexuales.
broader: LGBTQ+ literary criticism
change note: Version 4.2.0
has top concept: LGBTQ+ literary criticism
in scheme: v3
preferred label: Crítica literaria demisexual
related: Demisexual authors

Megasexual theater
type: Concept
issued: 2023-03-29
modified: 2025-02-23
comment: Works in the performance arts that focus on megasexual characters, communities, or issues.
comment: Trabajos en las artes escénicas que se centran en personajes, comunidades o temas megasexuales.
broader: LGBTQ+ theater
change note: Version 4.2.0
has top concept: LGBTQ+ theater
in scheme: v3
preferred label: Teatro megasexual
related: Megasexual drama

Megasexual youth
type: Concept
issued: 2023-04-11
modified: 2025-02-23
comment: Megasexual people between the ages of childhood and adulthood.
comment: Personas megasexuales entre las edades de la niñez y la edad adulta.
alternative label: Adolescentes megasexuales
preferred label: Juventud megasexual
broader: LGBTQ+ youth
change note: Version 4.2.0
has top concept: Youth
in scheme: v3
related: Megasexual youth literature

Megasexual youth literature
type: Concept
issued: 2023-04-11
modified: 2025-02-23
comment: Written literary works for an audience of readers from 12-18 years of age, also known as young adult literature or YA; use in reference to youth literature focusing on megasexual characters or themes.
comment: Obras literarias escritas para una audiencia de lectores de 12 a 18 años de edad, también conocidas como literatura para adultos jóvenes o YA (por sus siglas en inglés); utilícese en referencia a la literatura juvenil que se centra en personajes o temas megasexuales.
broader: LGBTQ+ youth literature
change note: Version 4.2.0
has top concept: Subcultures
in scheme: v3
preferred label: Literatura juvenil megasexual
related: Megasexual youth

Megasexual literary criticism
type: Concept
issued: 2023-04-11
modified: 2025-02-23
comment: The study, evaluation, and interpretation of literary works focusing on megasexual characters or themes; can also include interpretation of literature through the lens and frameworks of megasexual studies.
comment: El estudio, la evaluación y la interpretación de obras literarias centradas en personajes o temas megasexuales; también puede incluir la interpretación de la literatura a través del lente y los marcos teóricos de los estudios megasexuales.
broader: LGBTQ+ literary criticism
change note: Version 4.2.0
has top concept: LGBTQ+ literary criticism
in scheme: v3
preferred label: Crítica literaria megasexual
related: Megasexual authors

Greyromantic theater
type: Concept
issued: 2023-04-11
modified: 2025-02-23
comment: Works in the performance arts that focus on greyromantic characters, communities, or issues.
comment: Obras de artes escénicas centradas en personajes, comunidades o temas grisrománticos.
broader: LGBTQ+ theater
change note: Version 4.2.0
has top concept: LGBTQ+ theater
in scheme: v3
preferred label: Teatro grisromántico
related: Greyromantic drama

Greyromantic youth
type: Concept
issued: 2023-04-11
modified: 2025-02-23
comment: Greyromantic people between the ages of childhood and adulthood.
comment: Personas grisrománticas entre las edades de la infancia y la edad adulta.
broader: LGBTQ+ youth
change note: Version 4.2.0
has top concept: Youth
in scheme: v3
preferred label: Juventud grisromántica
related: Greyromantic youth literature

Greyromantic youth literature
type: Concept
issued: 2023-04-11
modified: 2025-02-23
comment: Written literary works for an audience of readers from 12-18 years of age, also known as young adult literature or YA; use in reference to youth literature focusing on greyromantic characters or themes.
comment: Obras literarias escritas para un público de lectores de 12 a 18 años de edad, también conocidas como literatura para jóvenes adultos o YA (por sus siglas en inglés); utilícese en referencia a la literatura juvenil centrada en personajes o temas grisrománticos.
broader: LGBTQ+ youth literature
change note: Version 4.2.0
has top concept: Subcultures
in scheme: v3
preferred label: Literatura juvenil grisromántica
related: Greyromantic youth

Two-Spirit porn films
type: Concept
issued: 2023-04-12
modified: 2025-02-23
comment: Erotic or sexually explicit films featuring Two-Spirit people.
comment: Películas eróticas o sexualmente explícitas protagonizadas por personas dos espíritus.
alternative label: 2S porn films
alternative label: Two Spirit porn films
alternative label: Two spirited porn films
alternative label: Películas pornográficas dos espíritus
broader: Two-Spirit erotic films
change note: Version 4.2.0
has top concept: Two-Spirit films
in scheme: v3
preferred label: Películas porno dos espíritus
related: LGBTQ+ porn films

Intersex porn films
type: Concept
issued: 2023-04-12
modified: 2025-02-23
comment: Erotic or sexually explicit films featuring intersex people.
comment: Películas eróticas o sexualmente explícitas protagonizadas por personas intersex.
broader: Intersex erotic art
change note: Version 4.2.0
has top concept: Subcultures
in scheme: v3
preferred label: Películas pornográficas intersex
related: Intersex erotic films

Aromantic porn films
type: Concept
issued: 2023-04-12
modified: 2025-02-23
comment: Erotic or sexually explicit films featuring aromantic people.
comment: Películas eróticas o sexualmente explícitas protagonizadas por personas arrománticas.
broader: Aromantic erotic art
change note: Version 4.2.0
has top concept: Subcultures
in scheme: v3
preferred label: Películas pornográficas arrománticas
related: Aromantic erotic films

Asexual porn films
type: Concept
issued: 2023-04-12
modified: 2025-02-23
comment: Erotic or sexually explicit films featuring asexual people.
comment: Películas eróticas o sexualmente explícitas protagonizadas por personas asexuales.
broader: Asexual erotic art
change note: Version 4.2.0
has top concept: Subcultures
in scheme: v3
preferred label: Películas pornográficas asexuales
related: Asexual erotic films

Non-binary romance fiction
type: Concept
issued: 2023-04-12
modified: 2025-02-23
comment: Written works of fiction revolving around romantic and/or sexual relationships between the main characters; use in reference to romance fiction focusing on non-binary characters.
comment: Obras escritas de ficción que giran en torno a relaciones románticas y/o sexuales entre los personajes principales; utilícese en referencia a la ficción romántica centrada en personajes no binarios.
broader: LGBTQ+ romance fiction
broader: Non-binary fiction
change note: Version 4.2.0
has top concept: Subcultures
in scheme: v3
preferred label: Ficción romántica no binaria

Non-binary mystery and detective fiction
type: Concept
issued: 2023-04-12
modified: 2025-02-23
comment: Written literary works about the investigation of crime or the work of detectives; use in reference to mystery and detective fiction focusing on non-binary characters or themes.
comment: Obras literarias escritas sobre la investigación de crímenes o el trabajo de detectives; utilícese en referencia a la ficción de misterio y de detectives centrada en personajes y temas no binarios.
broader: LGBTQ+ mystery and detective fiction
broader: Non-binary fiction
change note: Version 4.2.0
has top concept: Subcultures
in scheme: v3
preferred label: Ficción no binaria de misterio y de detetectives

Non-binary horror fiction
type: Concept
issued: 2023-04-12
modified: 2025-02-23
comment: Written works of fiction intended to frighten, scare, or disgust; use in reference to horror fiction focusing on non-binary characters or themes.
comment: Obras de ficción escritas con la intención de asustar, atemorizar o provocar disgusto; utilícese en referencia a la ficción de horror centrada en personajes o temas no binarios.
broader: LGBTQ+ horror fiction
broader: Non-binary fiction
change note: Version 4.2.0
has top concept: Subcultures
in scheme: v3
preferred label: Ficción de horror no binaria

Non-binary science fiction
type: Concept
issued: 2023-04-12
modified: 2025-02-23
comment: Written literary work about imaginative or futuristic concepts incorporating science, technology, space, time travel, and other speculative elements; use in reference to science fiction focusing on non-binary characters or themes.
comment: Obras literarias escritas sobre conceptos imaginativos o futuristas que incorporan la ciencia, la tecnología, el espacio, los viajes en el tiempo y otros elementos especulativos; utilícese en referencia a la ciencia ficción que se centra en personajes o temas no binarios.
broader: LGBTQ+ science fiction
broader: Non-binary fiction
change note: Version 4.2.0
has top concept: Subcultures
in scheme: v3
preferred label: Ciencia ficción no binaria

Non-binary fantasy fiction
type: Concept
issued: 2023-04-12
modified: 2025-02-23
comment: Genre that uses magic and other supernatural phenomena as a primary element of plot, theme, and/or setting; use for fantasy fiction focusing on non-binary characters or themes.
comment: Género que utiliza la magia y otros fenómenos sobrenaturales como elemento principal de la trama, el tema y/o el escenario; utilícese para la ficción fantástica que se centre en personajes o temas no binarios.
broader: LGBTQ+ fantasy fiction
broader: Non-binary fiction
change note: Version 4.2.0
has top concept: Subcultures
in scheme: v3
preferred label: Ficción fantástica no binaria

Appropriation of Indigenous identity
type: Concept
issued: 2023-04-14
modified: 2025-02-23
comment: A form of cultural appropriation and race shifting involving false claims of citizenship, belonging, and/or descent from Indigenous people in North America. Not to be confused with disconnected or reconnecting descendants.
comment: Una forma de apropiación cultural y cambio racial que implica afirmaciones falsas de ciudadanía, pertenencia y/o ascendencia de pueblos indígenas de Norteamérica. No se debe confundir con descendientes desconectados o reconectados.
alternative label: Pretendians
broader: Appropriation of marginalized identities
change note: Version 4.2.0
has top concept: Appropriation of marginalized identities
in scheme: v3
narrower: Appropriation of Two-Spirit identity
preferred label: Apropiación de identidades indígenas

Appropriation of Two-Spirit identity
type: Concept
issued: 2023-04-14
modified: 2025-02-23
comment: A form of cultural appropriation involving identification with Two-Spirit identity by people who cannot claim citizenship, belonging, and/or descent from Indigenous people in North America.
comment: Una forma de apropiación cultural que implica la identificación con la identidad Dos Espíritus por parte de personas que no pueden reclamar ciudadanía, pertenencia y/o descendencia de pueblos indígenas de Norteamérica.
broader: Appropriation of Indigenous identity
change note: Version 4.2.0
has top concept: Appropriation of marginalized identities
in scheme: v3
preferred label: Apropiación de identidades dos espíritus
related: Two-Spirit identity

Aromantic art
type: Concept
issued: 2023-04-14
modified: 2025-02-23
comment: Term for different forms of creative activity, including visual, material, and performing arts, by aromantic artists or about aromantic topics and communities.
comment: Término para diferentes formas de actividad creativa, incluidas las artes visuales, materiales y escénicas, realizadas por artistas arrománticos o sobre temas y comunidades arrománticos.
broader: LGBTQ+ arts
change note: Version 4.2.0
has top concept: Subcultures
in scheme: v3
preferred label: Arte arromántico
related: Aromantic erotic art

Asexual art
type: Concept
issued: 2023-04-14
modified: 2025-02-23
comment: Term for different forms of creative activity, including visual, material, and performing arts, by asexual artists or about asexual topics and communities.
comment: Término para diferentes formas de actividad creativa, incluidas las artes visuales, materiales y escénicas, de artistas asexuales o sobre temas y comunidades asexuales.
broader: LGBTQ+ arts
change note: Version 4.2.0
has top concept: Subcultures
in scheme: v3
preferred label: Arte asexual
related: Asexual erotic art

Demisexual art
type: Concept
issued: 2023-04-14
modified: 2025-02-23
comment: Term for different forms of creative activity, including visual, material, and performing arts, by demisexual artists or about demisexual topics and communities.
comment: Término para diferentes formas de actividad creativa, incluidas las artes visuales, materiales y escénicas, por artistas demisexuales o sobre temas y comunidades demisexuales.
broader: LGBTQ+ arts
change note: Version 4.2.0
has top concept: Subcultures
in scheme: v3
preferred label: Arte demisexual
related: Demisexual erotic art

Two-Spirit erotic art
type: Concept
issued: 2023-04-14
modified: 2025-02-23
comment: Erotic art, created by Two-Spirit artists, depicting Two-Spirit people, or that are regarded as important within Two-Spirit culture.
comment: Arte erótico, creado por artistas dos espíritus, que representa a personas dos espíritus o que se considera importante dentro de la cultura dos espíritus.
alternative label: 2S erotic art
alternative label: Two Spirit erotic art
alternative label: Two Spirited erotic art
alternative label: Two-Spirited erotic art
broader: Two-Spirit art
change note: Version 4.2.0
has top concept: Two-Spirit art
in scheme: v3
preferred label: Arte erótico dos espíritus
related: LGBTQ+ erotic art

Anonymous donors (Reproduction)
type: Concept
issued: 2023-04-14
modified: 2025-02-23
comment: People who donated their gametes with the understanding that their identity would remain unknown by any potential offspring.
comment: Personas que donaron sus gametos con el entendimiento de que su identidad permanecería oculta de cualquier posible descendiente.
broader: Donors
change note: Version 4.2.0
has top concept: Donors
in scheme: v3
preferred label: Donantes anónimos (reproducción)
related: Assisted reproduction

Egg donation
type: Concept
issued: 2023-04-14
modified: 2025-02-23
comment: The process by which a person donates their eggs for reproduction.
comment: El proceso mediante el cual una persona dona sus óvulos para la reproducción.
broader: Assisted reproduction
change note: Version 4.2.0
has top concept: Assisted reproductive technology
in scheme: v3
preferred label: Donación de óvulos
related: Gestational surrogacy

Test tube babies
type: Concept
issued: 2023-04-14
modified: 2025-02-23
comment: People who were conceived through IVF, or in vitro fertilization.
comment: Personas que fueron concebidas mediante FIV o fertilización in vitro.
alternative label: Test tube baby
broader: Children
change note: Version 4.2.0
has top concept: Family members
in scheme: v3
preferred label: Bebés probeta
related: In vitro fertilization

Māhū poetry
type: Concept
issued: 2023-06-23
modified: 2025-02-23
comment: Literary work, typically written in verse, that focuses on Māhū characters, themes, or identity.
comment: Obras literarias, normalmente escritas en verso, que se centran en personajes, temas o identidades māhū.
alternative label: Mahu poetry
change note: Version 4.2.0
in scheme: v3
preferred label: Poesía māhū
related: LGBTQ+ poetry

Māhū comics
type: Concept
issued: 2023-06-23
modified: 2025-02-23
comment: Works consisting of sequential images often accompanied by text; use in reference to comics focusing on Māhū characters or themes.
comment: Obras que consisten de imágenes secuenciales, a menudo acompañadas de texto; utilícese en referencia a cómics que se centran en personajes o temas māhū.
alternative label: Mahu comics
change note: Version 4.2.0
in scheme: v3
preferred label: Cómics māhū
related: LGBTQ+ comics

Māhū short stories
type: Concept
issued: 2023-06-23
modified: 2025-02-23
comment: Written literary works that are short in length and detail a self-contained incident or concept; use in reference to short stories focusing on Māhū characters or themes.
comment: Obras literarias escritas de corta extensión que detallan un incidente o concepto autocontenido; utilícese en referencia a relatos cortos centrados en personajes o temas māhū.
alternative label: Mahu short stories
change note: Version 4.2.0
in scheme: v3
preferred label: Cuentos cortos māhū
related: LGBTQ+ short stories

Māhū porn films
type: Concept
issued: 2023-06-23
modified: 2025-02-23
comment: Erotic or sexually explicit films featuring Māhū people.
comment: Películas eróticas o sexualmente explícitas protagonizadas por personas māhū.
alternative label: Mahu porn films
alternative label: Películas pornográficas māhū
change note: Version 4.2.0
in scheme: v3
preferred label: Películas porno māhū
related: LGBTQ+ porn films

Māhū erotic literature
type: Concept
issued: 2023-06-23
modified: 2025-02-23
comment: Literary works that have erotic or sexual elements; use in reference to erotic literature focusing on Māhū characters or themes.
comment: Obras literarias con elementos eróticos o sexuales; utilícese en referencia a la literatura erótica centrada en personajes o temas māhū.
alternative label: Mahu erotic literature
change note: Version 4.2.0
in scheme: v3
preferred label: Literatura erótica māhū
related: LGBTQ+ erotic literature

Māhū fantasy fiction
type: Concept
issued: 2023-06-23
modified: 2025-10-31
comment: Genre that uses magic and other supernatural phenomena as a primary element of plot, theme, and/or setting; use for fantasy fiction focusing on Māhū characters or themes.
comment: Género que utiliza la magia y otros fenómenos sobrenaturales como elemento principal de la trama, el tema y/o el escenario; utilícese para la ficción fantástica centrada en personajes o temas māhū.
alternative label: Mahu fantasy fiction
broader: Māhū fiction
change note: Version 4.2.0
has top concept: Māhū fiction
in scheme: v3
preferred label: Ficción fantástica māhū
related: LGBTQ+ fantasy fiction

Māhū science fiction
type: Concept
issued: 2023-06-23
modified: 2025-10-31
comment: Written literary work about imaginative or futuristic concepts incorporating science, technology, space, time travel, and other speculative elements; use in reference to science fiction focusing on Māhū characters or themes.
comment: Obras literarias escritas sobre conceptos imaginativos o futuristas que incorporan la ciencia, la tecnología, el espacio, los viajes en el tiempo y otros elementos especulativos; utilícese en referencia a la ciencia ficción centrada en personajes o temas māhū.
alternative label: Mahu science fiction
broader: Māhū fiction
change note: Version 4.2.0
has top concept: Māhū fiction
in scheme: v3
preferred label: Ciencia ficción māhū
related: LGBTQ+ science fiction

Māhū graphic novels
type: Concept
issued: 2023-06-23
modified: 2025-02-23
comment: Works consisting of sequential images often accompanied by text that generally contain stand-alone stories; used in reference to graphic novels focusing on Māhū characters or themes.
comment: Obras que consisten de imágenes secuenciales, a menudo acompañadas de texto, que suelen contener historias independientes; utilícese en referencia a las novelas gráficas centradas en personajes o temas māhū.
alternative label: Mahu graphic novels
change note: Version 4.2.0
in scheme: v3
preferred label: Novelas gráficas māhū
related: LGBTQ+ graphic novels

Māhū horror fiction
type: Concept
issued: 2023-06-23
modified: 2025-10-31
comment: Written works of fiction intended to frighten, scare, or disgust; use in reference to horror fiction focusing on Māhū characters or themes.
comment: Obras de ficción escritas con la intención de asustar, atemorizar o provocar disgusto; utilícese en referencia a la ficción de horror centrada en personajes o temas māhū.
alternative label: Mahu horror fiction
broader: Māhū fiction
change note: Version 4.2.0
has top concept: Māhū fiction
in scheme: v3
preferred label: Ficción de horror māhū
related: LGBTQ+ horror fiction

Māhū mystery and detective fiction
type: Concept
issued: 2023-06-23
modified: 2025-10-31
comment: Written literary works about the investigation of crime or the work of detectives; use in reference to mystery and detective fiction focusing on Māhū characters and themes.
comment: Obras literarias escritas sobre la investigación de crímenes o el trabajo de detectives; utilícese en referencia a la ficción de misterio y de detectives centrada en personajes y temas māhū.
alternative label: Mahu mystery and detective fiction
broader: Māhū fiction
change note: Version 4.2.0
has top concept: Māhū fiction
in scheme: v3
preferred label: Ficción māhū de misterio y de detectives
related: LGBTQ+ mystery and detective fiction

Māhū romance fiction
type: Concept
issued: 2023-06-23
modified: 2025-10-31
comment: Works of fiction revolving around romantic and/or sexual relationships between the main characters; use in reference to romance fiction focusing on Māhū characters.
comment: Obras de ficción que giran en torno a las relaciones románticas y/o sexuales entre los personajes principales; utilícese en referencia a la ficción romántica centrada en personajes māhū.
alternative label: Mahu romance fiction
broader: Māhū fiction
change note: Version 4.2.0
has top concept: Māhū fiction
in scheme: v3
preferred label: Ficción romántica māhū
related: LGBTQ+ romance fiction

Two-Spirit poetry
type: Concept
issued: 2023-06-23
modified: 2025-02-23
comment: Literary work, typically written in verse, that focuses on Two-Spirit characters, themes, or identity.
comment: Obras literarias, normalmente escritas en verso, que se centran en personajes, temas o en la identidad dos espíritus.
alternative label: 2S poetry
alternative label: Two Spirit poetry
alternative label: Two Spirited poetry
alternative label: Two-Spirited poetry
change note: Version 4.2.0
in scheme: v3
preferred label: Poesía dos espíritus
related: LGBTQ+ poetry

Two-Spirit comics
type: Concept
issued: 2023-06-23
modified: 2025-02-23
comment: Works consisting of sequential images often accompanied by text; use in reference to comics focusing on Two-Spirit characters or themes.
comment: Obras que consisten de imágenes secuenciales, a menudo acompañadas de texto; utilícese en referencia a los cómics centrados en personajes o temas dos espíritus.
alternative label: 2S comics
alternative label: Two Spirit comics
alternative label: Two Spirited comics
alternative label: Two-Spirited comics
alternative label: Historietas dos espíritus
change note: Version 4.2.0
in scheme: v3
preferred label: Cómics dos espíritus
related: LGBTQ+ comics

Two-Spirit erotic literature
type: Concept
issued: 2023-06-25
modified: 2025-02-23
comment: Literary works that have erotic or sexual elements; use in reference to erotic literature focusing on Two-Spirit characters or themes.
comment: Obras literarias que tienen elementos eróticos o sexuales; utilícese en referencia a la literatura erótica centrada en personajes o temas dos espíritus.
alternative label: 2S erotic literature
alternative label: Two Spirit erotic literature
alternative label: Two Spirited erotic literature
alternative label: Two-Spirited erotic literature
change note: Version 4.2.0
in scheme: v3
preferred label: Literatura erótica dos espíritus
related: LGBTQ+ erotic literature

Two-Spirit fantasy fiction
type: Concept
issued: 2023-06-26
modified: 2025-10-31
comment: Genre that uses magic and other supernatural phenomena as a primary element of plot, theme, and/or setting; use for fantasy fiction focusing on Two-Spirit characters or themes.
comment: Género que utiliza la magia y otros fenómenos sobrenaturales como elemento principal de la trama, el tema y/o el escenario; utilícese para la ficción fantástica centrada en personajes o temas dos espíritus.
alternative label: 2S fantasy fiction
alternative label: Two Spirit fantasy fiction
alternative label: Two Spirited fantasy fiction
alternative label: Two-Spirited fantasy fiction
broader: Two-Spirit fiction
change note: Version 4.2.0
has top concept: Two-Spirit literature
in scheme: v3
preferred label: Ficción fantástica dos espíritus
related: LGBTQ+ fantasy fiction

Two-Spirit science fiction
type: Concept
issued: 2023-06-26
modified: 2025-10-03
comment: Written literary work about imaginative or futuristic concepts incorporating science, technology, space, time travel, and other speculative elements; use in reference to science fiction focusing on Two-Spirit characters or themes.
comment: Obra literaria escrita sobre conceptos imaginativos o futuristas que incorporan la ciencia, la tecnología, el espacio, los viajes en el tiempo y otros elementos especulativos; utilícese en referencia a la ciencia ficción que se centra en personajes o temas dos espíritus.
alternative label: 2S science fiction
alternative label: Two Spirit science fiction
alternative label: Two Spirited science fiction
alternative label: Two-Spirited science fiction
broader: Two-Spirit fiction
change note: Version 4.2.0
has top concept: Two-Spirit literature
in scheme: v3
preferred label: Ciencia ficción dos espíritus
related: LGBTQ+ science fiction

Two-Spirit graphic novels
type: Concept
issued: 2023-06-26
modified: 2025-02-23
comment: Works consisting of sequential images often accompanied by text that generally contain stand-alone stories; used in reference to graphic novels focusing on Two-Spirit characters or themes.
comment: Obras que consisten en imágenes secuenciales, a menudo acompañadas de texto, que generalmente contienen historias independientes; utilícese en referencia a novelas gráficas que se centran en personajes o temas dos espíritus.
alternative label: 2S graphic novels
alternative label: Two Spirit graphic novels
alternative label: Two Spirited graphic novels
alternative label: Two-Spirited graphic novels
change note: Version 4.2.0
in scheme: v3
preferred label: Novelas gráficas dos espíritus
related: LGBTQ+ graphic novels

Two-Spirit horror fiction
type: Concept
issued: 2023-06-26
modified: 2025-10-03
comment: Written works of fiction intended to frighten, scare, or disgust; use in reference to horror fiction focusing on Two-Spirit characters or themes.
comment: Obras de ficción escritas con la intención de asustar, atemorizar o provocar disgusto; utilícese en referencia a la ficción de horror centrada en personajes o temas dos espíritus.
alternative label: 2S horror fiction
alternative label: Two Spirit horror fiction
alternative label: Two Spirited horror fiction
alternative label: Two-Spirited horror fiction
broader: Two-Spirit fiction
change note: Version 4.2.0
has top concept: Two-Spirit literature
in scheme: v3
preferred label: Ficción de horror dos espíritus
related: LGBTQ+ horror fiction

Two-Spirit mystery and detective fiction
type: Concept
issued: 2023-06-26
modified: 2025-10-03
comment: Written literary works about the investigation of crime or the work of detectives; use in reference to mystery and detective fiction focusing on Two-Spirit characters and themes.
comment: Obras literarias escritas sobre la investigación de crímenes o el trabajo de detectives; utilícese en referencia a la ficción de misterio y de detectives centrada en personajes y temas dos espíritus.
alternative label: 2S mystery and detective fiction
alternative label: Two Spirit mystery and detective fiction
alternative label: Two Spirited mystery and detective fiction
alternative label: Two-Spirited mystery and detective fiction
broader: Two-Spirit fiction
change note: Version 4.2.0
has top concept: Two-Spirit literature
in scheme: v3
preferred label: Ficción dos espíritus de misterio y de detectives
related: LGBTQ+ mystery and detective fiction

Two-Spirit romance fiction
type: Concept
issued: 2023-06-26
modified: 2025-10-03
comment: Works of fiction revolving around romantic and/or sexual relationships between the main characters; use in reference to romance fiction focusing on Two-Spirit characters.
comment: Obras de ficción que giran en torno a relaciones románticas y/o sexuales entre los personajes principales; utilícese en referencia a la ficción romántica centrada en personajes dos espíritus.
alternative label: 2S romance fiction
alternative label: Two Spirit romance fiction
alternative label: Two Spirited romance fiction
alternative label: Two-Spirited romance fiction
broader: Two-Spirit fiction
change note: Version 4.2.0
has top concept: Two-Spirit literature
in scheme: v3
preferred label: Ficción de romance dos espíritus
related: LGBTQ+ romance fiction

Gay neurodivergent men
type: Concept
issued: 2023-06-26
modified: 2026-03-03
comment: Gay men with neurodevelopmental differences in areas such as cognition, sensory processing, emotionality, and sociality.
comment: Obras literarias escritas sobre la investigación de crímenes o el trabajo de detectives; utilícese en referencia a la ficción de misterio y de detectives centrada en personajes y temas gay.
alternative label: Gay neurodivergent people
broader: LGBTQ+ neurodivergent people
change note: Version 4.2.0
has top concept: LGBTQ+ people
in scheme: v3
narrower: Gay autistic men
preferred label: Ficción gay de misterio y de detectives

Bisexual neurodivergent people
type: Concept
issued: 2023-06-26
modified: 2026-03-03
comment: Bisexual people with neurodevelopmental differences in areas such as cognition, sensory processing, emotionality, and sociality.
comment: Personas bisexuales que son musulmanas.
alternative label: Bi neurodivergent people
alternative label: Bisexual neuroatypical people
alternative label: Bi neuroatypical people
broader: LGBTQ+ neurodivergent people
change note: Version 4.2.0
has top concept: LGBTQ+ people
in scheme: v3
narrower: Bisexual autistic people
preferred label: Musulmanes bisexuales

Transgender neurodivergent people
type: Concept
issued: 2023-06-26
modified: 2026-03-05
comment: Transgender people with neurodevelopmental differences in areas such as cognition, sensory processing, emotionality, and sociality.
comment: Personas transgénero cuyos cerebros procesan, aprenden y/o se comportan de manera diferente a lo que la sociedad considera típico. Algunas de estas diferencias neurológicas pueden presentarse como problemas de aprendizaje, trastornos médicos y otras condiciones.
alternative label: Neurodivergent transgender people
alternative label: Trans neurodivergent people
alternative label: Neuroatypical transgender people
alternative label: Neuroatypical trans people
alternative label: Trans neuroatypical people
alternative label: Transgender neuroatypical people
alternative label: Personas neurodivergentes transgénero
broader: LGBTQ+ neurodivergent people
change note: Version 4.2.0
has top concept: LGBTQ+ people
in scheme: v3
preferred label: Personas transgénero neurodivergentes
related: Neurotrans

Queer neurodivergent people
type: Concept
issued: 2023-06-26
modified: 2026-03-05
comment: Queer people with neurodevelopmental differences in areas such as cognition, sensory processing, emotionality, and sociality.
comment: Personas queer cuyos cerebros procesan, aprenden y/o se comportan de manera diferente a lo que la sociedad considera típico. Algunas de estas diferencias neurológicas pueden presentarse como problemas de aprendizaje, trastornos médicos y otras condiciones.
alternative label: Neurodivergent queer people
alternative label: Neuroatypical queer people
alternative label: Queer neuroatypical people
alternative label: Personas neurodivergentes queer
broader: LGBTQ+ neurodivergent people
change note: Version 4.2.0
has top concept: LGBTQ+ people
in scheme: v3
preferred label: Personas queer neurodivergentes
related: Neuroqueer

Intersex neurodivergent people
type: Concept
issued: 2023-06-26
modified: 2026-03-03
comment: Intersex people with neurodevelopmental differences in areas such as cognition, sensory processing, emotionality, and sociality.
comment: Personas intersex cuyos cerebros procesan, aprenden y/o se comportan de manera diferente a lo que la sociedad considera típico. Algunas de estas diferencias neurológicas pueden presentarse como problemas de aprendizaje, trastornos médicos y otras condiciones.
alternative label: Intersex neuroatypical people
broader: LGBTQ+ neurodivergent people
change note: Version 4.2.0
has top concept: LGBTQ+ people
in scheme: v3
narrower: Intersex autistic people
preferred label: Personas intersex neurodivergentes

Gay autistic men
type: Concept
issued: 2023-06-26
modified: 2026-03-03
comment: Gay men who are autistic.
comment: Hombres gay que son autistas.
alternative label: Gay men with autism
alternative label: Gay autistic people
alternative label: Gay people with autistic
alternative label: Gay autists
alternative label: Autistic gay men
alternative label: Autistic gay people
alternative label: Hombres autistas gay
alternative label: Hombres gay con autismo
broader: LGBTQ+ autistic people
broader: Gay neurodivergent men
change note: Version 4.2.0
has top concept: LGBTQ+ people
in scheme: v3
preferred label: Hombres gay autistas

Bisexual autistic people
type: Concept
issued: 2023-06-26
modified: 2026-03-03
comment: Bisexual people who are autistic.
comment: Personas bisexuales que son autistas.
alternative label: Bisexual people with autism
alternative label: Personas bisexuales con autismo
alternative label: Personas autistas bisexuales
broader: LGBTQ+ autistic people
broader: Bisexual neurodivergent people
change note: Version 4.2.0
has top concept: LGBTQ+ people
in scheme: v3
preferred label: Personas bisexuales autistas

Transgender autistic people
type: Concept
issued: 2023-06-26
modified: 2026-02-23
comment: Transgender people who are autistic.
comment: Personas transgénero que son autistas.
alternative label: Transgender people with autism
alternative label: Personas autistas transgénero
alternative label: Personas transgénero con autismo
broader: LGBTQ+ autistic people
change note: Version 4.2.0
has top concept: LGBTQ+ people
in scheme: v3
preferred label: Personas transgénero autistas
related: Neurotrans

Queer autistic people
type: Concept
issued: 2023-06-26
modified: 2026-02-23
comment: Queer people who are autistic.
comment: Personas queer que son autistas.
alternative label: Autistic queer people
alternative label: Queer people with autism
alternative label: Personas autistas queer
alternative label: Personas queer con autismo
broader: LGBTQ+ autistic people
change note: Version 4.2.0
has top concept: LGBTQ+ people
in scheme: v3
preferred label: Personas queer autistas
related: Neuroqueer

Non-binary autistic people
type: Concept
issued: 2023-06-26
modified: 2025-02-23
comment: Non-binary people who are autistic.
comment: Personas no binarias que son autistas.
alternative label: Autistic non-binary people
alternative label: Non-binary people with autism
alternative label: Personas autistas no binarias
alternative label: Personas no binarias con autismo
broader: LGBTQ+ autistic people
broader: Non-binary neurodivergent people
change note: Version 4.2.0
has top concept: LGBTQ+ people
in scheme: v3
preferred label: Personas no binarias autistas

Intersex autistic people
type: Concept
issued: 2023-06-26
modified: 2025-02-23
comment: Intersex people who are autistic.
comment: Personas intersex que son autistas.
alternative label: Autistic intersex people
alternative label: Intersex people with autism
alternative label: Personas autistas intersex
alternative label: Personas intersex con autismo
broader: Intersex neurodivergent people
broader: LGBTQ+ autistic people
change note: Version 4.2.0
has top concept: LGBTQ+ people
in scheme: v3
preferred label: Personas intersex autistas

Asexual autistic people
type: Concept
issued: 2023-06-26
modified: 2026-03-03
comment: Asexual people who are autistic.
comment: Personas asexuales que son autistas.
alternative label: Asexual people with autism
alternative label: Autistic asexual people
alternative label: Personas asexuales con autismo
alternative label: Autistas asexuales
broader: LGBTQ+ autistic people
broader: Asexual neurodivergent people
change note: Version 4.2.0
has top concept: LGBTQ+ people
in scheme: v3
preferred label: Personas autistas asexuales

Two-Spirit bookshops
type: Concept
issued: 2023-06-26
modified: 2025-02-23
comment: Bookshops that sell materials intended for use by Two-Spirit people or addressing topics related to Two-Spirit experiences.
comment: Librerías que venden materiales destinados al uso de personas dos espíritus o que abordan temas relacionados con las comunidades dos espíritus.
alternative label: 2S bookshops
alternative label: Two Spirit bookshops
alternative label: Two Spirited bookshops
alternative label: Two-Spirited bookshops
change note: Version 4.2.0
in scheme: v3
preferred label: Librerias dos espíritus
related: LGBTQ+ bookshops

Two-Spirit blind people
type: Concept
issued: 2023-06-26
modified: 2025-02-23
comment: Two-Spirit people with significant or total loss of vision.
comment: Personas dos espíritus con pérdida significativa o total de visión.
alternative label: 2S blind people
alternative label: Blind 2S people
alternative label: Blind Two Spirit people
alternative label: Blind Two Spirited people
alternative label: Blind Two-Spirited people
alternative label: Two Spirit blind people
alternative label: Two Spirited blind people
alternative label: Two-Spirited blind people
alternative label: Personas ciegas dos espíritus
alternative label: Ciegos dos espíritus
broader: Two-Spirit disabled people
change note: Version 4.2.0
has top concept: Gender
in scheme: v3
preferred label: Personas dos espíritus ciegas
related: LGBTQ+ blind people

Two-Spirit Deaf people
type: Concept
issued: 2023-06-26
modified: 2025-02-23
comment: Two-Spirit people with significant or total hearing loss. Some but not all Deaf people prefer to capitalize Deaf in recognition of the cultural and linguistic identity they share with other Deaf people.
comment: Personas dos espíritus con pérdida auditiva significativa o total. Algunas personas sordas, pero no todas, prefieren escribir “Sorda/o” con mayúscula en reconocimiento de la identidad cultural y lingüística que comparten con otras personas sordas.
alternative label: 2S Deaf people
alternative label: Deaf 2S people
alternative label: Deaf Two Spirit people
alternative label: Deaf Two Spirited people
alternative label: Deaf Two-Spirited people
alternative label: Two Spirit Deaf people
alternative label: Two Spirited Deaf people
alternative label: Two-Spirited Deaf people
alternative label: Peronas sordas dos espíritus
broader: Two-Spirit disabled people
change note: Version 4.2.0
has top concept: Gender
in scheme: v3
preferred label: Personas dos espíritus sordas
related: LGBTQ+ Deaf people

Two-Spirit short stories
type: Concept
issued: 2023-06-26
modified: 2025-02-23
comment: Written literary works that are short in length and detail a self-contained incident or concept; use in reference to short stories focusing on Two-Spirit characters or themes.
comment: Obras literarias escritas que son breves y detallan un incidente o concepto autónomo; utilícese en referencia a historias cortas que se centren en personajes o temas dos espíritus.
alternative label: 2S short stories
alternative label: Two Spirit short stories
alternative label: Two spirited short stories
change note: Version 4.2.0
in scheme: v3
preferred label: Cuentos cortos dos espíritus
related: LGBTQ+ short stories

Two-Spirit characters
type: Concept
issued: 2023-06-26
modified: 2025-02-23
comment: Characters in creative works who are Two-Spirit
comment: Personajes de obras creativas que son dos espíritus.
alternative label: 2S characters
alternative label: Two Spirit characters
alternative label: Two Spirited characters
alternative label: Two-Spirited characters
change note: Version 4.2.0
in scheme: v3
preferred label: Personajes dos espíritus
related: LGBTQ+ characters

Two-Spirit couples
type: Concept
issued: 2023-06-26
modified: 2025-02-23
comment: Partnerships in which both people are Two-Spirit
comment: Relaciones de pareja donde las dos personas son dos espíritus.
alternative label: 2S couples
alternative label: Two Spirit couples
alternative label: Two Spirited couples
alternative label: Two-Spirited couples
change note: Version 4.2.0
in scheme: v3
preferred label: Parejas dos espíritus
related: LGBTQ+ couples

Two-Spirit drama
type: Concept
issued: 2023-06-26
modified: 2025-02-23
comment: Works of fiction written to be performed; use in reference to dramatic works focusing on Two-Spirit characters or themes.
comment: Obras de ficción escritas para ser puestas en escena; utilícese en referencia a obras dramáticas que se centran en personajes o temas dos espíritus.
alternative label: 2S drama
alternative label: Two Spirit drama
alternative label: Two Spirited drama
alternative label: Two-Spirited drama
change note: Version 4.2.0
in scheme: v3
preferred label: Drama dos espíritus
related: LGBTQ+ drama

Two-Spirit employment
type: Concept
issued: 2023-06-26
modified: 2025-02-23
comment: Employment of Two-Spirit people
comment: Empleo de personas dos espíritus.
alternative label: 2S employment
alternative label: Two Spirit employment
alternative label: Two Spirited employment
alternative label: Two-Spirited employment
change note: Version 4.2.0
in scheme: v3
preferred label: Empleo dos espíritus
related: LGBTQ+ employment

Two-Spirit hard of hearing people
type: Concept
issued: 2023-06-26
modified: 2025-02-23
comment: Two-Spirit people with significant or total hearing loss who may or may not consider themselves d/Deaf.
comment: Personas dos espíritus con pérdida de audición significativa o total, que pueden o no considerarse S/sordas.
alternative label: 2S hard of hearing people
alternative label: Two Spirit hard of hearing people
alternative label: Two Spirited hard of hearing people
alternative label: Two-Spirited hard of hearing people
alternative label: Personas dos espíritus con dificultades de audición
alternative label: Personas dos espíritus con dificultades auditivas
broader: Two-Spirit disabled people
change note: Version 4.2.0
has top concept: Gender
in scheme: v3
preferred label: Personas dos espíritus con problemas de audición
related: LGBTQ+ hard of hearing people

Two-Spirit wheelchair users
type: Concept
issued: 2023-06-26
modified: 2025-02-23
comment: Two-Spirit people who use wheelchairs.
comment: Personas dos espíritus que utilizan sillas de ruedas.
alternative label: 2S wheelchair users
alternative label: Two Spirit wheelchair users
alternative label: Two Spirited wheelchair users
alternative label: Two-Spirited wheelchair users
broader: Two-Spirit disabled people
change note: Version 4.2.0
has top concept: Gender
in scheme: v3
preferred label: Usarios dos espíritus de sillas de ruedas
related: LGBTQ+ wheelchair users

Two-Spirit information centers
type: Concept
issued: 2023-06-26
modified: 2025-02-23
comment: Institutions providing education, support, and information about Two-Spirit issues and Two-Spirit communities to Two-Spirit people.
comment: Instituciones que brindan educación, apoyo e información sobre temas dos espíritus y comunidades dos espíritus a personas dos espíritus.
alternative label: 2S information centers
alternative label: Two Spirit information centers
alternative label: Two Spirited information centers
alternative label: Two-Spirit information centres
alternative label: Two-Spirited information centers
alternative label: Centros dos espíritus de información
change note: Version 4.2.0
in scheme: v3
preferred label: Centros de información dos espíritus
related: LGBTQ+ information centers

Two-Spirit literary criticism
type: Concept
issued: 2023-06-26
modified: 2025-02-23
comment: The study, evaluation, and interpretation of literary works focusing on Two-Spirit characters or themes; can also include interpretation of literature through the lens and frameworks of Two-Spirit studies.
comment: El estudio, la evaluación y la interpretación de obras literarias centradas en personajes o temas dos espíritus; también puede incluir la interpretación de la literatura a través del lente y los marcos teóricos de los estudios dos espíritus.
alternative label: 2S literary criticism
alternative label: Two Spirit literary criticism
alternative label: Two Spirited literary criticism
alternative label: Two-Spirited literary criticism
change note: Version 4.2.0
in scheme: v3
preferred label: Critica literaria dos espíritus
related: LGBTQ+ literary criticism

Two-Spirit comedians
type: Concept
issued: 2023-06-27
modified: 2025-02-23
comment: Two-Spirit people who seek to entertain an audience by making them laugh, through jokes, slapstick, employing prop comedy, or other amusing means.
comment: Personas dos espíritus que buscan entretener a la audiencia haciéndolas reír, mediante bromas, payasadas, empleando comedia de utilería u otros medios divertidos.
alternative label: 2S comedians
alternative label: 2S comics (Persons)
alternative label: Two Spirited comedians
alternative label: Two Spirited comics (Persons)
alternative label: Two-Spirited comedians
alternative label: Two-Spirited comics (Persons)
alternative label: Cómicos dos espíritus
broader: Two-Spirit people
change note: Version 4.2.0
has top concept: Gender
in scheme: v3
preferred label: Comediantes dos espíritus
related: LGBTQ+ comedians

Two-Spirit newsletters
type: Concept
issued: 2023-06-27
modified: 2025-02-23
comment: Serialized print or digital periodicals created by or for Two-Spirit people, often with the purpose of sharing news and information related to Two-Spirit communities and Two-Spirit issues.
comment: Publicaciones periódicas impresas o digitales serializadas creadas por o para personas dos espíritus, a menudo con el propósito de compartir noticias e información relacionada con comunidades dos espíritus y cuestiones dos espíritus.
alternative label: 2S newsletters
alternative label: Two Spirit newsletters
alternative label: Two Spirited newsletters
alternative label: Two-Spirited newsletters
broader: Two-Spirit press
change note: Version 4.2.0
has top concept: Two-Spirit press
in scheme: v3
preferred label: Boletines dos espíritus
related: LGBTQ+ newsletters

Two-Spirit newspapers
type: Concept
issued: 2023-06-27
modified: 2026-01-08
comment: Serialized print or digital publications about Two-Spirit people or Two-Spirit issues (and typically produced by Two-Spirit people or Two-Spirit organizations) that contain news, articles, columns, correspondence, and advertisements.
comment: Publicaciones impresas o digitales seriadas sobre personas o temas dos espíritus (y normalmente producidas por personas dos espíritus u organizaciones dos espíritus) que contienen noticias, artículos, columnas, correspondencia y anuncios.
alternative label: 2S newspapers
alternative label: Two Spirit newspapers
alternative label: Two Spirited newspapers
alternative label: Two-Spirited newspapers
alternative label: Diarios dos espíritus
broader: Two-Spirit press
change note: Version 4.2.0
has top concept: Two-Spirit press
in scheme: v3
preferred label: Periódicos dos espíritus
related: LGBTQ+ newspapers

Two-Spirit partners
type: Concept
issued: 2023-06-27
modified: 2025-02-23
comment: Two-Spirit people who are the romantic, sexual, or play partners of another person or people.
comment: Personas dos espíritus que son la pareja romántica, sexual o de juegos de otra persona o personas.
alternative label: 2S partners
alternative label: Two Spirit partners
alternative label: Two Spirited partners
alternative label: Two-Spirited partners
broader: Two-Spirit people
broader: Partners
change note: Version 4.2.0
has top concept: Gender
in scheme: v3
preferred label: Parejas dos espíritus

Two-Spirit people in the military
type: Concept
issued: 2023-06-27
modified: 2025-02-23
comment: Two-Spirit people serving in state and national armed forces.
comment: Personas dos espíritus que sirven en las fuerzas armadas estatales y nacionales.
alternative label: 2S people in the military
alternative label: Two Spirit people in the military
alternative label: Two Spirited people in the military
alternative label: Two-Spirited people in the military
alternative label: Personas dos espíritus en las fuerzas armadas
change note: Version 4.2.0
in scheme: v3
preferred label: Personas dos espíritus en el ejército
related: LGBTQ+ people in the military

Two-Spirit publishers
type: Concept
issued: 2023-06-27
modified: 2025-02-23
comment: Companies and organizations that publish materials for Two-Spirit communities or addressing Two-Spirit issues.
comment: Empresas y organizaciones que publican materiales para comunidades dos espíritus o que abordan asuntos dos espíritus.
alternative label: 2S publishers
alternative label: Two Spirit publishers
alternative label: Two Spirited publishers
alternative label: Two-Spirited publishers
change note: Version 4.2.0
in scheme: v3
preferred label: Editoriales dos espíritus
related: LGBTQ+ publishers

Two-Spirit relationships
type: Concept
issued: 2023-06-27
modified: 2025-02-23
comment: Ongoing connections (romantic, sexual, or platonic) between two or more Two-Spirit people.
comment: Conexiones continuas (románticas, sexuales o platónicas) entre dos o más personas dos espíritus.
alternative label: 2S relationships
alternative label: Two Spirit relationships
alternative label: Two Spirited relationships
alternative label: Two-Spirited relationships
change note: Version 4.2.0
in scheme: v3
preferred label: Relaciones dos espíritus
related: Relationship satisfaction

Two-Spirit rights
type: Concept
issued: 2023-06-27
modified: 2025-02-23
comment: Legal, social, or ethical principles of freedom or entitlement held by Two-Spirit people.
comment: Principios legales, sociales o éticos de la libertad o del derecho que tienen las personas dos espíritus.
alternative label: 2S rights
alternative label: Two Spirit rights
alternative label: Two Spirited rights
alternative label: Two-Spirited rights
change note: Version 4.2.0
in scheme: v3
preferred label: Derechos dos espíritus
related: LGBTQ+ civil rights

Two-Spirit slang
type: Concept
issued: 2023-06-27
modified: 2025-02-23
comment: Colloquial or informal language related to Two-Spirit identity or used by Two-Spirit people.
comment: Lenguaje coloquial o informal en relación a la identidad dos espíritus o utilizado por personas dos espíritus.
alternative label: 2S slang
alternative label: Two Spirit slang
alternative label: Two Spirited slang
alternative label: Two-Spirited slang
change note: Version 4.2.0
in scheme: v3
preferred label: Jerga dos espíritus
related: LGBTQ+ slang

Two-Spirit survivors of hate crimes
type: Concept
issued: 2023-06-27
modified: 2025-02-23
comment: Two-Spirit people who have experienced and survived hate crimes; follow the individual's preference for "victims" or "survivors" whenever possible.
comment: Personas dos espíritus que han sufrido y sobrevivido a crímenes de odio; siga la preferencia de la persona sobre el uso de "víctimas" o "sobrevivientes" siempre que sea posible.
alternative label: 2S survivors of hate crimes
alternative label: Two Spirit survivors of hate crimes
alternative label: Two Spirited survivors of hate crimes
alternative label: Two-Spirited survivors of hate crimes
change note: Version 4.2.0
in scheme: v3
preferred label: Sobrevivientes dos espíritus de crímenes de odio
related: LGBTQ+ survivors of hate crimes

Two-Spirit survivors of rape
type: Concept
issued: 2023-06-27
modified: 2025-02-23
comment: Two-Spirit people who have experienced and survived rape; follow the individual's preference for "victims" or "survivors" whenever possible.
comment: Personas dos espíritus que han sufrido y sobrevivido a una violación; siga la preferencia de la persona sobre el uso de "víctimas" o "sobrevivientes" siempre que sea posible.
alternative label: 2S survivors of rape
alternative label: Two Spirit survivors of rape
alternative label: Two Spirited survivors of rape
alternative label: Two-Spirited survivors of rape
change note: Version 4.2.0
in scheme: v3
preferred label: Sobrevivientes dos espíritus de violación
related: LGBTQ+ survivors of rape

Two-Spirit survivors of sexual abuse
type: Concept
issued: 2023-06-27
modified: 2025-02-23
comment: Two-Spirit people who have experienced and survived sexual abuse; follow the individual's preference for "victims" or "survivors" whenever possible.
comment: Personas dos espíritus que han sufrido y sobrevivido a abusos sexuales; siga la preferencia de la persona sobre el uso de "víctimas" o "sobrevivientes" siempre que sea posible.
alternative label: 2S survivors of sexual abuse
alternative label: Two Spirit survivors of sexual abuse
alternative label: Two Spirited survivors of sexual abuse
alternative label: Two-Spirited survivors of sexual abuse
change note: Version 4.2.0
in scheme: v3
preferred label: Sobreviventes dos espíritus de abuso sexual
related: LGBTQ+ survivors of sexual abuse

Two-Spirit survivors of war
type: Concept
issued: 2023-06-27
modified: 2025-02-23
comment: Two-Spirit people who have experienced and survived war; follow the individual's preference for "victims" or "survivors" whenever possible.
comment: Personas dos espíritus que han sufrido y sobrevivido a la guerra; siga la preferencia de la persona sobre el uso de "víctimas" o "sobrevivientes" siempre que sea posible.
alternative label: 2S survivors of war
alternative label: Two Spirit survivors of war
alternative label: Two Spirited survivors of war
alternative label: Two-Spirited survivors of war
change note: Version 4.2.0
in scheme: v3
preferred label: Sobrevivientes dos espíritus de guerra
related: LGBTQ+ survivors of war

Two-Spirit television
type: Concept
issued: 2023-06-27
modified: 2025-02-23
comment: Television shows featuring Two-Spirit characters or themes.
comment: Programas de televisión con personajes o temas dos espíritus.
alternative label: 2S television
alternative label: Two Spirit television
alternative label: Two Spirited television
alternative label: Two-Spirited television
change note: Version 4.2.0
in scheme: v3
preferred label: Televisión dos espíritus
related: LGBTQ+ television

Two-Spirit theater
type: Concept
issued: 2023-06-27
modified: 2025-02-23
comment: Works in the performance arts that focus on Two-Spirit characters or themes.
comment: Obras de artes escénicas que se centran en personajes, comunidades o cuestiones dos espíritus.
alternative label: 2S theater
alternative label: Two Spirit theater
alternative label: Two Spirited theater
alternative label: Two-Spirited theater
change note: Version 4.2.0
in scheme: v3
preferred label: Teatro dos espíritus
preferred label: 2S theatre
preferred label: Two Spirited theatre
preferred label: Two-Spirit theatre
preferred label: Two-Spirited theatre
related: LGBTQ+ theater

Two-Spirit victims of hate crimes
type: Concept
issued: 2023-06-27
modified: 2025-02-23
comment: Two-Spirit people who have experienced hate crimes and may or may not have survived; follow the individual's preference for "victims" or "survivors" whenever possible.
comment: Personas dos espíritus que han sufrido crímenes de odio y pueden haber sobrevivido o no; siga la preferencia de la persona sobre el uso de "víctimas" o "sobrevivientes" siempre que sea posible.
alternative label: 2S victims of hate crimes
alternative label: Two Spirit victims of hate crimes
alternative label: Two Spirited victims of hate crimes
alternative label: Two-Spirited victims of hate crimes
broader: Two-Spirit victims of crime
change note: Version 4.2.0
has top concept: Gender
in scheme: v3
preferred label: Víctimas dos espíritus de crímenes de odio
related: LGBTQ+ victims of hate crimes

Two-Spirit victims of rape
type: Concept
issued: 2023-06-27
modified: 2025-02-23
comment: Two-Spirit people who have experienced rape and may or may not have survived; follow the individual's preference for "victims" or "survivors" whenever possible.
comment: Personas dos espíritus que han sufrido una violación y pueden haber sobrevivido o no; siga la preferencia de la persona sobre el uso de "víctimas" o "sobrevivientes" siempre que sea posible.
alternative label: 2S victims of rape
alternative label: Two Spirit victims of rape
alternative label: Two Spirited victims of rape
alternative label: Two-Spirited victims of rape
broader: Two-Spirit victims of crime
change note: Version 4.2.0
has top concept: Gender
in scheme: v3
preferred label: Víctimas dos espíritus de violación
related: LGBTQ+ victims of rape

Two-Spirit victims of war
type: Concept
issued: 2023-06-27
modified: 2025-02-23
comment: Two-Spirit people who have experienced war and may or may not have survived; follow the individual's preference for "victims" or "survivors" whenever possible.
comment: Personas dos espíritus que han sufrido la guerra y que pueden haber sobrevivido o no; siga la preferencia de la persona sobre el uso de "víctimas" o "sobrevivientes" siempre que sea posible.
alternative label: 2S victims of war
alternative label: Two Spirit victims of war
alternative label: Two Spirited victims of war
alternative label: Two-Spirited victims of war
broader: Two-Spirit victims of crime
change note: Version 4.2.0
has top concept: Gender
in scheme: v3
preferred label: Víctimas dos espíritus de guerra
related: LGBTQ+ victims of war

Two-Spirit victims' rights
type: Concept
issued: 2023-06-27
modified: 2025-02-23
comment: Two-Spirit people’s legal rights to be informed, present, and heard within the criminal justice system after having been harmed or injured as the result of of a crime, accident, or other event.
comment: Los derechos legales de las personas dos espíritus a estar informadas, estar presentes y ser escuchadas dentro del sistema de justicia penal después de haber sido perjudicadas o lesionadas como resultado de un delito, una accidente u otro evento.
alternative label: 2S victims' rights
alternative label: Two Spirit victims' rights
alternative label: Two Spirited victims' rights
alternative label: Two-Spirited victims' rights
change note: Version 4.2.0
in scheme: v3
preferred label: Derechos de las víctimas dos espiritus
related: LGBTQ+ victims' rights

Two-Spirit-focused businesses
type: Concept
issued: 2023-06-27
modified: 2025-02-23
comment: Businesses focusing on Two-Spirit clientele and products related to Two-Spirit communities.
comment: Empresas enfocadas en clientela dos espíritus y productos relacionados con las comunidades dos espíritus.
alternative label: 2S-focused businesses
alternative label: Two Spirit-focused businesses
alternative label: Two Spirited-focused businesses
alternative label: Two-Spirited-focused businesses
alternative label: Empresas orientadas a personas dos espíritus
alternative label: Compañías orientadas a personas dos espíritus
change note: Version 4.2.0
in scheme: v3
preferred label: Negocios orientados a personas dos espíritus
related: LGBTQ+-focused businesses

Two-Spirit-owned businesses
type: Concept
issued: 2023-06-27
modified: 2025-02-23
comment: Businesses owned by Two-Spirit people.
comment: Empresas pertenecientes a personas dos espíritus.
alternative label: 2S-owned businesses
alternative label: Two Spirit-owned businesses
alternative label: Two Spirited-owned businesses
alternative label: Two-Spirited-owned businesses
alternative label: Negocios de dueños dos espíritus
alternative label: Compañías de dueños dos espíritus
change note: Version 4.2.0
in scheme: v3
preferred label: Empresas propiedad de personas dos espíritus
related: LGBTQ+-owned businesses

Intersex fathers
type: Concept
issued: 2023-06-27
modified: 2025-02-23
comment: Intersex people who are fathers. Only use for people who identify as fathers.
comment: Personas intersex que son padres. Utilícese únicamente para personas que se autoidentifiquen como padres.
alternative label: Papás intersex
broader: LGBTQ+ fathers
change note: Version 4.2.0
has top concept: Family members
in scheme: v3
preferred label: Padres intersex
related: Intersex parents

Persecution of intersex people
type: Concept
issued: 2023-06-27
modified: 2025-02-23
comment: Systematic mistreatment of intersex people on the basis of their sex or gender identity.
comment: Maltrato sistemático a personas intersexuales por razón de su sexo o identidad de género.
alternative label: Persecución de personas intersex
broader: LGBTQ+ persecutions
change note: Version 4.2.0
has top concept: LGBTQ+ persecutions
in scheme: v3
preferred label: Persecución de personas intersexuales
related: Intersex people

Sons of intersex people
type: Concept
issued: 2023-06-27
modified: 2025-02-23
comment: Sons who have one or more intersex parent. For sons who are themselves intersex, use the term "Intersex sons."
comment: Hijos que tienen uno o más padres intersexuales. Para los hijos que son intersexuales, utilice el término "hijos intersexuales".
alternative label: Hijos de personas intersex
broader: Sons of LGBTQ+ people
change note: Version 4.2.0
has top concept: Family members
in scheme: v3
preferred label: Hijos de personas intersexuales
related: Children of intersex people

Intersex activism
type: Concept
issued: 2023-06-27
modified: 2025-02-23
comment: Direct action and organizing to achieve political or social change, bodily autonomy, and acceptance for intersex people.
comment: Acción directa y organización para lograr cambios políticos o sociales, autonomía corporal y aceptación de las personas intersex.
broader: LGBTQ+ activism
change note: Version 4.2.0
has top concept: LGBTQ+ activism
in scheme: v3
narrower: Intersex political activists
preferred label: Activismo intersex

Asian American intersex people
type: Concept
issued: 2023-06-27
modified: 2025-02-23
comment: Intersex people of Asian heritage or descent born in the United States or born in Asian countries who live in or have a strong connection to the United States. Only use for individuals who self-identify as Asian American.
comment: Personas intersexuales de herencia o ascendencia asiática nacidas en los Estados Unidos o nacidas en países asiáticos que viven en o tienen una conexión fuerte con los Estados Unidos. Utilícese para personas que se autoidentifiquen como asiático-americanas.
alternative label: Intersex Asian American people
alternative label: Intersex Asian Americans
alternative label: Personas asiático-americanas intersex
alternative label: Asiático-americanos intersex
alternative label: Asiático-americanas intersex Personas intersex asiático-americanas
broader: Asian American LGBTQ+ people
change note: Version 4.2.0
has top concept: LGBTQ+ people
in scheme: v3
preferred label: Personas intersexuales asiático-americanas
related: Asian intersex people

Asian intersex people
type: Concept
issued: 2023-06-27
modified: 2025-02-23
comment: Intersex individuals of Asian heritage or descent, living in Asia or part of the Asian diaspora. Only use for people who self-identify as Asian.
comment: Personas intersexuales de herencia o ascendencia asiática, que viven en Asia o forman parte de la diáspora asiática. Utilícese únicamente para personas que se identifican como asiáticas.
alternative label: Intersex Asian people
alternative label: Intersex Asians
alternative label: Personas asiáticas intersex
alternative label: Asiáticos intersex
alternative label: Asiáticas intersex
alternative label: Personas intersex asiáticas
broader: Asian LGBTQ+ people
change note: Version 4.2.0
has top concept: LGBTQ+ people
in scheme: v3
preferred label: Personas intersexuales asiáticas
related: Asian American intersex people

Asexual activism
type: Concept
issued: 2023-06-27
modified: 2025-02-23
comment: Direct action and organizing to achieve political or social change and acceptance for asexual people.
comment: Acción directa y organización para lograr el cambio político o social y la aceptación de las personas asexuales.
broader: LGBTQ+ activism
change note: Version 4.2.0
has top concept: LGBTQ+ activism
in scheme: v3
narrower: Asexual political activists
preferred label: Activismo asexual

Asexual athletes
type: Concept
issued: 2023-06-27
modified: 2026-02-24
comment: Professional or recreational sports players who self-identify as asexual.
comment: Deportistas profesionales o recreativos que se autoidentifican como asexuales.
alternative label: Asexual sports players
alternative label: Asexual sportspeople
alternative label: Asexual sportspersons
alternative label: Jugadores de deportes asexuales
alternative label: Jugadoras de deportes asexuales
alternative label: Deportistas asexuales
broader: Asexual people
change note: Version 4.2.0
has top concept: Sexual minorities
in scheme: v3
narrower: Asexual basketball players
preferred label: Atletas asexuales

Latino/a/x intersex people
type: Concept
issued: 2023-06-27
modified: 2025-02-23
comment: Latin American people who are intersex; only use to describe individuals who self-identify as Latino, Latina, or Latinx. Do not conflate with Chicano/a/x or Hispanic.
comment: Personas latinoamericanas que son intersexuales; utilícese únicamente para describir a personas que se autoidentifican como latinos, latinas o latinxs. No debe confundirse con chicano/a/x o hispano/a/x.
alternative label: Intersex Latinas
alternative label: Intersex Latine people
alternative label: Intersex Latinos
alternative label: Intersex Latinx people
alternative label: Latina intersex people
alternative label: Latine intersex people
alternative label: Latino intersex people
alternative label: Latinx intersex people
alternative label: Personas intersex Latinx
broader: Latino/a/x LGBTQ+ people
change note: Version 4.2.0
has top concept: LGBTQ+ people
in scheme: v3
narrower: Afro-Latin American intersex people
preferred label: Personas intersexuales Latinx

Asexual children
type: Concept
issued: 2023-06-27
modified: 2025-02-23
comment: Asexual people who have not yet reached the age of adolescence.
comment: Niños menores de 18 años que se autoidentifican como asexuales.
broader: Children
broader: LGBTQ+ children
change note: Version 4.2.0
has top concept: Family members
in scheme: v3
preferred label: Niños asexuales

Intersex autobiographies
type: Concept
issued: 2023-06-27
modified: 2025-02-23
comment: Accounts of intersex peoples' lives written by those people. For written accounts of intersex people's lives that were not written by the subject, use "Intersex biographies."
comment: Relatos de vida de personas escritos por esas mismas personas; utilícese para autobiografías escritas por autores intersex.
alternative label: Intersex memoirs
alternative label: Memorias intersex
broader: LGBTQ+ autobiographies
change note: Version 4.2.0
has top concept: LGBTQ+ autobiographies
in scheme: v3
preferred label: Autobiografías intersex
related: Intersex biographies

Asexual blind people
type: Concept
issued: 2023-06-28
modified: 2025-02-23
comment: Asexual people with significant or total loss of vision.
comment: Personas asexuales con pérdida significativa o total de visión.
alternative label: Blind asexual people
alternative label: Personas ciegas asexuales
alternative label: Ciegos asexuales
alternative label: Ciegas asexuales
broader: LGBTQ+ blind people
broader: Asexual disabled people
change note: Version 4.2.0
has top concept: LGBTQ+ people
in scheme: v3
preferred label: Personas asexuales ciegas

Asexual people with chronic illnesses
type: Concept
issued: 2023-06-28
modified: 2025-02-23
comment: Asexual people who have long-term health conditions that require continued medical attention and/or significantly impact or limit daily life; some but not all people with chronic illnesses consider themselves disabled.
comment: Personas asexuales que padecen de condiciones de salud a largo plazo que requieren atención médica continua y/o que impactan o limitan significativamente sus vidas diarias; algunas, pero no todas, las personas con enfermedades crónicas se consideran discapacitadas.
alternative label: Chronically ill asexual people
alternative label: Personas con enfermedades crónicas asexuales
alternative label: Enfermos crónicos asexuales
alternative label: Enfermas crónicas asexuales
broader: LGBTQ+ people with chronic illnesses
change note: Version 4.2.0
has top concept: LGBTQ+ people
in scheme: v3
preferred label: Personas asexuales con enfermedades crónicas
related: Asexual disabled people

Asexual wheelchair users
type: Concept
issued: 2023-06-28
modified: 2025-02-23
comment: Asexual people who use wheelchairs.
comment: Personas asexuales que utilizan sillas de ruedas.
broader: LGBTQ+ wheelchair users
broader: Asexual disabled people
change note: Version 4.2.0
has top concept: LGBTQ+ people
in scheme: v3
preferred label: Usuarios asexuales de sillas de ruedas

Asexual culture
type: Concept
issued: 2023-06-28
modified: 2025-02-23
comment: Cultural experiences shared by members of asexual communities or products of asexual culture (e.g., art and media created by and for asexual people, activism focused on asexual issues, slang commonly used in asexual communities, etc.).
comment: Experiencias culturales compartidas por miembros de comunidades asexuales o productos de la cultura asexual (por ejemplo, arte y medios de comunicación creados por y para personas asexuales, activismo centrado en temas asexuales, jerga de uso común en comunidades asexuales, etc.).
broader: LGBTQ+ culture
change note: Version 4.2.0
has top concept: Subcultures
in scheme: v3
preferred label: Cultura asexual
related: Asexual slang

Asexual slang
type: Concept
issued: 2023-06-28
modified: 2025-02-23
comment: Colloquial or informal language related to asexual identity or used by asexual people.
comment: Lenguaje coloquial o informal en relación a la identidad asexual o utilizado por personas asexuales.
broader: LGBTQ+ slang
change note: Version 4.2.0
has top concept: LGBTQ+ slang
in scheme: v3
preferred label: Argot asexual
related: Asexual culture

Asexual newsletters
type: Concept
issued: 2023-06-28
modified: 2025-02-23
comment: Serialized print or digital periodicals created by or for asexual people, often with the purpose of sharing news and information related to asexual communities and asexual issues.
comment: Publicaciones periódicas impresas o digitales serializadas creadas por o para personas asexuales, a menudo con el propósito de compartir noticias e información relacionada con comunidades asexuales y cuestiones asexuales.
broader: LGBTQ+ newsletters
change note: Version 4.2.0
has top concept: LGBTQ+ press
in scheme: v3
preferred label: Boletines asexuales
related: Asexual press

Asexual newspapers
type: Concept
issued: 2023-06-28
modified: 2025-02-23
comment: Serialized print or digital publications about asexual people or asexual issues (and typically produced by asexual people or asexual organizations) that contain news, articles, columns, correspondence, and advertisements.
comment: Publicaciones impresas o digitales seriadas sobre personas o temas asexuales (y normalmente producidas por personas asexuales u organizaciones asexuales) que contienen noticias, artículos, columnas, correspondencia y anuncios.
alternative label: Diarios asexuales
broader: LGBTQ+ newspapers
change note: Version 4.2.0
has top concept: LGBTQ+ press
in scheme: v3
preferred label: Periódicos asexuales
related: Asexual press

Asexual political activists
type: Concept
issued: 2023-06-28
modified: 2025-02-23
comment: Asexual people working to bring about political or social change through public organizing.
comment: Personas asexuales que trabajan para lograr cambios políticos o sociales mediante la organización pública.
broader: LGBTQ+ political activists
broader: Asexual activism
change note: Version 4.2.0
has top concept: LGBTQ+ people
in scheme: v3
preferred label: Activistas políticos asexuales

Asexual radio
type: Concept
issued: 2023-06-28
modified: 2026-02-23
comment: Auditory content broadcast on the radio (analog or digital) about asexual people and asexual issues.
comment: Contenido auditivo emitido por radio (análoga o digital) sobre personas asexuales y asuntos asexuales.
broader: LGBTQ+ radio
change note: Version 4.2.0
has top concept: LGBTQ+ radio
in scheme: v3
preferred label: Radio asexual
related: Asexual podcasts

Two-Spirit politicians
type: Concept
issued: 2023-06-28
modified: 2025-02-23
comment: Two-Spirit people who are candidates for public office, are currently holding public office, or have held political positions. Politicians can be elected by public election or otherwise appointed.
comment: Personas dos espíritus que son candidatas a cargos públicos, ocupan actualmente cargos públicos o han ocupado cargos políticos. Los políticos pueden ser elegidos por sufragio público o designados de otro modo.
alternative label: 2S politicians
alternative label: 2S public officials
alternative label: Two Spirited politicians
alternative label: Two Spirited public officials
alternative label: Two-Spirit public officials
alternative label: Two-Spirited public officials
alternative label: Two-Spiritied politicians
alternative label: Oficiales públicos dos espíritus
broader: Two-Spirit people
change note: Version 4.2.0
has top concept: Gender
in scheme: v3
preferred label: Políticos dos espíritus
related: LGBTQ+ politicians

Androgens
type: Concept
issued: 2023-06-28
modified: 2025-02-23
comment: A term that encompasses testosterone, dihydrotestosterone, and other hormones primarily produced in the testes but also in the ovaries and adrenal glands.
comment: Un término que abarca a la testosterona, la dihidrotestosterona y otras hormonas producidas principalmente en los testículos, pero también en los ovarios y las glándulas suprarrenales.
broader: Hormones
change note: Version 4.2.0
has top concept: Sex (Body)
in scheme: v3
preferred label: Andrógenos
related: Hormone therapy (Gender)

Classical congenital adrenal hyperplasia
type: Concept
issued: 2023-06-28
modified: 2025-02-23
comment: People who have classical congenital adrenal hyperplasia (CAH), a subtype of CAH, have more pronounced issues with cortisol and/or aldosterone production. This variation is likely to be noticed at birth or shortly after.
comment: Las personas que tienen hiperplasia suprarrenal congénita clásica (HSC), un subtipo de HSC, tienen problemas más pronunciados con la producción de cortisol y/o aldosterona. Es probable que esta variación se note al nacer o poco después.
broader: Congenital adrenal hyperplasia
change note: Version 4.2.0
has top concept: Sex (Body)
in scheme: v3
narrower: Salt-wasting congenital adrenal hyperplasia
preferred label: Hiperplasia suprarrenal congénita clásica

Early genital surgery model
type: Concept
issued: 2023-06-28
modified: 2025-02-23
comment: Patient care model developed by John Money, a New Zealand psychologist who theorized that gender was completely dependent on "nurture." This model advocates for performing genital surgery on intersex infants and raising them as girls. Money's theories have resulted in many surgically misgendered children who have had to deal with life-long gender dysphoria, depression, sexual dysfunction, bowel and urinary incontinence, and nerve pain. A patient-centered model, in which the intersex child is allowed to grow up and make their own choices regarding their gender and surgical option, is now preferred.
alternative label: John Money model
broader: Intersex
change note: Version 4.2.0
has top concept: Sex (Body)
in scheme: v3
related: Medicalization

Hopkins model
type: Concept
issued: 2023-06-28
modified: 2025-02-23
comment: A patient care model that gained popular usage in the 1950s. In this model, parents are used to quickly decide on a gender assignment for their intersex baby, under the assumption that the child would identify with whichever gender their parents raised them as. If a child later deviated from the assigned gender, parents were encouraged to verbally and physically "correct" the child and enforce gender norms. In practice, this resulted in life-altering, unnecessary genital surgeries, irreversible hormone treatments, and dishonesty on the parent's part. A patient-centered model, in which the intersex child is allowed to grow up and make their own choices regarding their gender and surgical option, is now preferred.
alternative label: Concealment centered model
broader: Intersex
change note: Version 4.2.0
has top concept: Sex (Body)
in scheme: v3
related: Medicalization

Informed consent
type: Concept
issued: 2023-06-28
modified: 2025-02-23
comment: The practice of weighing all options and considering evidence, alternatives, and potential risks in order to make a truly informed medical decision. Such decisions are best made over a period of time rather than under pressure.
comment: La práctica de sopesar todas las opciones y considerar evidencia, alternativas y riesgos potenciales para tomar una decisión médica verdaderamente informada. Se dan mejor esas tomas de decisiones durante un período de tiempo en lugar de bajo presión.
broader: Consent
change note: Version 4.2.0
has top concept: Consent
in scheme: v3
preferred label: Consentimiento informado
related: Medical care

Intersex surgery
type: Concept
issued: 2023-06-28
modified: 2025-02-23
comment: Non-lifesaving cosmetic procedures intended to change and "normalize" natural variations in genital appearance and/or reproductive anatomy. Intersex surgery was first developed in the early 20th century, with doctors making unresearched claims about an "urgent need" for these operations.
comment: Procedimientos cosméticos que no salvan vidas destinados a cambiar y "normalizar" las variaciones naturales en la apariencia genital y/o la anatomía reproductiva. La cirugía intersex se desarrolló por primera vez a principios del siglo XX, cuando los médicos afirmaban sin fundamento investigativo la supuesta "necesidad urgente" para estas operaciones.
broader: Intersex genital mutilation
change note: Version 4.2.0
has top concept: Intersex genital mutilation
in scheme: v3
preferred label: Cirugía intersex
related: Bottom surgery

Asexual studies
type: Concept
issued: 2023-06-28
modified: 2026-02-24
comment: Academic field of research and study about asexual people, asexual identity, and asexual communities.
comment: Campo académico de investigación y estudio sobre las personas asexuales, la identidad asexual y las comunidades asexuales.
broader: LGBTQ+ studies
change note: Version 4.2.0
has top concept: LGBTQ+ studies
in scheme: v3
preferred label: Estudios asexuales
related: Queer studies

Steroidogenic factor 1 protein
type: Concept
issued: 2023-06-28
modified: 2025-02-23
comment: The steroidogenic factor 1 (SF-1) protein is a transcription factor involved in sex determination. The SF-1 protein controls the activity of genes related to the gonads and adrenal glands.
alternative label: SF-1 protein
change note: Version 4.2.0
in scheme: v3
related: Hormones

X gender markers
type: Concept
issued: 2023-06-28
modified: 2025-02-23
comment: Gender markers that indicate a person is NOT cisgender. X gender markers may be assigned to or adopted by intersex people or transgender people.
comment: Marcadores de género que indican que una persona NO es cisgénero. Los marcadores de género X pueden ser asignados a o adoptados por personas intersex o transgénero.
broader: Gender markers
change note: Version 4.2.0
has top concept: Legal status
in scheme: v3
preferred label: Marcadores de género X
related: Assigned X at birth

Transgender operas
type: Concept
issued: 2023-06-28
modified: 2025-02-23
comment: Operas created by transgender directors, depicting transgender individuals, or that are regarded as important within transgender culture.
comment: Óperas creadas por directores transgénero, que representan a personas transgénero o que se consideran importantes dentro de la cultura transgénero.
broader: LGBTQ+ operas
change note: Version 4.2.0
has top concept: Subcultures
in scheme: v3
preferred label: Óperas transgénero
related: Two-Spirit operas

Intersex operas
type: Concept
issued: 2023-06-28
modified: 2025-02-23
comment: Operas created by intersex directors, depicting intersex individuals, or that are regarded as important within intersex culture.
comment: Óperas creadas por directores intersex, que representan a personas intersex o que se consideran importantes dentro de la cultura intersex.
broader: LGBTQ+ operas
change note: Version 4.2.0
has top concept: Subcultures
in scheme: v3
preferred label: Óperas intersex
related: Two-Spirit operas

Afro-Canadian asexual people
type: Concept
issued: 2023-06-29
modified: 2025-02-23
comment: Asexual people of African descent born in Canada or asexual people born in African countries who live in or have a strong connection to Canada. Use for individuals who self-identify as Afro-Canadian.
comment: Personas asexuales de ascendencia africana nacidas en Canadá o personas asexuales nacidas en países africanos que viven en Canadá o tienen una conexión fuerte con Canadá. Utilícese para personas que se autoidentifiquen como afrocanadienses.
alternative label: Asexual Afro-Canadian people
alternative label: Asexual Afro-Canadians
preferred label: Afrocanadienses asexuales
alternative label: Afrocanadienses ace
alternative label: Personas ace afrocanadienses
alternative label: Personas afrocanadienses asexuales
broader: Afro-Canadian LGBTQ+ people
broader: Black asexual people
change note: Version 4.2.0
has top concept: LGBTQ+ people
in scheme: v3

Afro-Caribbean asexual people
type: Concept
issued: 2023-06-29
modified: 2025-02-23
comment: Asexual people of African descent born in the Caribbean or asexual people born in African countries who live in or have a strong connection to the Caribbean. Only use for individuals who self-identify as Afro-Caribbean.
comment: Personas asexuales de ascendencia africana nacidas en el Caribe o personas asexuales nacidas en países africanos que viven o tienen una conexión fuerte con el Caribe. Utilícese únicamente para personas que se identifiquen como afrocaribeñas.
alternative label: Asexual Afro-Caribbean people
alternative label: Asexual Afro-Caribbeans
alternative label: Personas afrocaribeñas asexuales
alternative label: Afrocaribeños asexuales
alternative label: Afrocaribeñas asexuales
broader: Afro-Caribbean LGBTQ+ people
broader: Black asexual people
change note: Version 4.2.0
has top concept: LGBTQ+ people
in scheme: v3
preferred label: Personas asexuales afrocaribeñas

Afro-European asexual people
type: Concept
issued: 2023-06-29
modified: 2025-02-23
comment: Asexual people of African descent born in European countries or asexual people born in African countries who live in or have a strong connection to Europe. Only use for individuals who self-identify as Afro-European.
comment: Personas asexuales de ascendencia africana nacidas en países europeos o personas asexuales nacidas en países africanos que viven o tienen una conexión fuerte con Europa. Utilícese únicamente para personas que se identifiquen como afroeuropeas.
alternative label: Asexual Afro-European people
alternative label: Asexual Afro-Europeans
alternative label: Personas afroeuropeas asexuales
alternative label: Afroeuropeos asexuales
alternative label: Afroeuropeas asexuales
broader: Afro-European LGBTQ+ people
broader: Black asexual people
change note: Version 4.2.0
has top concept: LGBTQ+ people
in scheme: v3
preferred label: Personas asexuales afroeuropeas

Latino/a/x asexual people
type: Concept
issued: 2023-06-29
modified: 2025-02-23
comment: Latin American people who are asexual; only use to describe individuals who self-identify as Latino, Latina, or Latinx. Do not conflate with Chicano/a/x or Hispanic.
comment: Personas latinoamericanas que son asexuales; utilícese únicamente para describir a personas que se autoidentifican como latinos, latinas o latinxs. No debe confundirse con chicano/a/x o hispano/a/x.
alternative label: Asexual Latinas
alternative label: Asexual Latine people
alternative label: Asexual Latinos
alternative label: Asexual Latinx people
alternative label: Latina asexual people
alternative label: Latine asexual people
alternative label: Latino asexual people
alternative label: Latinx asexual people
broader: Latino/a/x LGBTQ+ people
change note: Version 4.2.0
has top concept: LGBTQ+ people
in scheme: v3
narrower: Afro-Latin American asexual people
preferred label: Personas asexuales Latinx

Anti-asexual discrimination
type: Concept
issued: 2023-06-29
modified: 2025-02-23
comment: The unjust or prejudicial treatment of asexual people due to their sexual identity; may include the denial of legal rights, employment, and housing.
comment: El trato injusto o perjudicial hacia personas asexuales por su identidad sexual; puede incluir la negación de derechos legales, empleo y vivienda.
broader: LGBTQ+ discrimination
change note: Version 4.2.0
has top concept: LGBTQ+ discrimination
in scheme: v3
preferred label: Discriminación anti-asexual
related: Intolerance towards LGBTQ+ people

Anti-asexual violence
type: Concept
issued: 2023-06-29
modified: 2025-02-23
comment: Behavior involving physical force intended to harm or kill asexual people on the basis of their identity.
comment: Comportamiento que involucra fuerza física destinada a hacer daño o a matar a personas asexuales por su identidad.
broader: Anti-LGBTQ+ violence
change note: Version 4.2.0
has top concept: Anti-LGBTQ+ violence
in scheme: v3
preferred label: Violencia anti-asexual
related: Hate crimes

Asian asexual people
type: Concept
issued: 2023-06-29
modified: 2025-02-23
comment: Asexual individuals of Asian heritage or descent, living in Asia or part of the Asian diaspora. Only use for people who self-identify as Asian.
comment: Personas asexuales de herencia o ascendencia asiática, que viven en Asia o forman parte de la diáspora asiática. Utilícese únicamente para personas que se autoidentifiquen como asiáticas.
alternative label: Asexual Asian people
alternative label: Asexual Asians
alternative label: Personas asiáticas asexuales
alternative label: Asiáticos asexuales
alternative label: Asiáticas asexuales
broader: Asian LGBTQ+ people
change note: Version 4.2.0
has top concept: LGBTQ+ people
in scheme: v3
preferred label: Personas asexuales asiáticas
related: Asian American asexual people

Asian American asexual people
type: Concept
issued: 2023-06-29
modified: 2025-02-23
comment: Asexual people of Asian heritage or descent born in the United States or born in Asian countries who live in or have a strong connection to the United States. Only use for individuals who self-identify as Asian American.
comment: Personas asexuales de herencia o ascendencia asiática nacidas en los Estados Unidos o nacidas en países asiáticos que viven en o tienen una conexión fuerte con los Estados Unidos. Utilícese únicamente para personas que seautoidentificancomo asiático-americanas
alternative label: Asexual Asian American people
alternative label: Asexual Asian Americans
alternative label: Personas asiático-americanas asexuales
alternative label: Asiático-americanos asexuales
alternative label: Asiático-americanas asexuales
broader: Asian American LGBTQ+ people
change note: Version 4.2.0
has top concept: LGBTQ+ people
in scheme: v3
preferred label: Personas asexuales asiático-americanas
related: Asian asexual people

Persecution of asexual people
type: Concept
issued: 2023-06-29
modified: 2025-02-23
comment: Systematic mistreatment of asexual people on the basis of their sexual identity.
comment: Maltrato sistemático a personas asexuales por su identidad sexual.
broader: LGBTQ+ persecutions
change note: Version 4.2.0
has top concept: LGBTQ+ persecutions
in scheme: v3
preferred label: Persecución de personas asexuales
related: Asexual people

Sons of asexual people
type: Concept
issued: 2023-06-29
modified: 2025-02-23
comment: Sons who have one or more asexual parent. For sons who are themselves asexual, use the term "Asexual sons."
comment: Hijos que tienen uno o más padres asexuales. Para los hijos que son asexuales, utilice el término "hijos asexuales".
broader: Children of asexual people
broader: Sons of LGBTQ+ people
change note: Version 4.2.0
has top concept: Family members
in scheme: v3
preferred label: Hijos de personas asexuales

Inuit asexual people
type: Concept
issued: 2023-06-30
modified: 2025-02-23
comment: Asexual people who are Inuit, or part of several Indigenous peoples inhabiting the Inuit homeland in the Arctic and subarctic regions of Greenland, Canada, and Alaska. Only use for people who identify as Inuit.
comment: Personas asexuales que son inuit o que son parte de varios pueblos indígenas que habitan los territorios ancestrales inuit en las regiones árticas o subárticas de Groenlandia, Canadá y Alaska. Utilícese únicamente para personas que se identifiquen como inuit.
broader: Inuit LGBTQ+ people
broader: Indigenous asexual people
change note: Version 4.2.0
has top concept: LGBTQ+ people
in scheme: v3
preferred label: Personas asexuales inuit

Kānaka Maoli asexual people
type: Concept
issued: 2023-06-30
modified: 2025-02-23
comment: Asexual people who are part of the Indigenous people of Mokupuni o Hawai‘i, or the Hawaiian Islands; only use to refer to people who identify as Kanaka Maoli.
comment: Personas asexuales que pertenecen al pueblo indígena mokupuni o hawai‘i, o a las islas hawaianas. Utilícese únicamente para describir a las personas que se identifiquen como kānaka maoli.
alternative label: Asexual Indigenous Hawaiians
alternative label: Asexual Kānaka Maoli
alternative label: Asexual Kānaka ʻŌiwi
alternative label: Asexual Native Hawaiians
alternative label: Indigenous Hawaiian asexual people
alternative label: Native Hawaiian asexual people
broader: Kānaka Maoli LGBTQ+ people
broader: Indigenous asexual people
change note: Version 4.2.0
has top concept: LGBTQ+ people
in scheme: v3
preferred label: Personas asexuales kānaka maoli

Native American asexual people
type: Concept
issued: 2023-06-30
modified: 2025-02-23
comment: People who are part of the Native peoples of the continental United States and Canada (excluding Inuit people) and self-identity as asexual. Use more specific terms when available.
comment: Personas asexuales que son nativoamericanas o parte de los pueblos indígenas de Norteamérica; utilícese únicamente para personas que se autoidentifiquen como nativoamericanas y asexuales.
alternative label: American Indian asexual people
alternative label: Asexual American Indians
alternative label: Asexual Native Americans
alternative label: Personas nativoamericanas asexuales
broader: Native American LGBTQ+ people
broader: Indigenous asexual people
change note: Version 4.2.0
has top concept: LGBTQ+ people
in scheme: v3
preferred label: Personas asexuales nativoamericanas

Pacific Islander American asexual people
type: Concept
issued: 2023-06-30
modified: 2025-02-23
comment: Asexual people who identify as both Pacific Islanders (or of Pacific Islander ancestry) and American.
comment: Personas asexuales que se identifican como isleñas del Pacífico (o de ascendencia isleña del Pacífico) y estadounidenses.
alternative label: Pacific Islander asexual people
alternative label: Personas del Pacífico estadounidenses asexuales
broader: Pacific Islander American LGBTQ+ people
broader: Indigenous asexual people
change note: Version 4.2.0
has top concept: LGBTQ+ people
in scheme: v3
preferred label: Personas asexuales del Pacífico estadounidenses

Papuan asexual people
type: Concept
issued: 2023-06-30
modified: 2025-02-23
comment: Asexual people who are Papuan, or part of the Indigenous peoples of new Guinea; only use for people who identify as Papuan.
comment: Personas asexuales que son papúes o parte de los pueblos indígenas de Nueva Guinea. Utilícese únicamente para personas que se autoidentifiquen como papúes.
alternative label: Asexual Papuan people
alternative label: Asexual Papuans
alternative label: Personas papúes asexuales
broader: Papuan LGBTQ+ people
broader: Indigenous asexual people
change note: Version 4.2.0
has top concept: LGBTQ+ people
in scheme: v3
preferred label: Personas asexuales papúes

Intersex people with chronic illnesses
type: Concept
issued: 2023-06-30
modified: 2025-02-23
comment: Intersex people who have long-term health conditions that require continued medical attention and/or significantly impact or limit daily life; some but not all people with chronic illnesses consider themselves disabled.
comment: Personas intersex que tienen condiciones de salud a largo plazo que requieren atención médica continua y/o impactan o limitan significativamente la vida diaria; algunas, pero no todas, las personas con enfermedades crónicas se consideran discapacitadas.
alternative label: Chronically ill intersex people
alternative label: Personas con enfermedades crónicas intersex
alternative label: Enfermos crónicos intersex
broader: LGBTQ+ people with chronic illnesses
change note: Version 4.2.0
has top concept: LGBTQ+ people
in scheme: v3
preferred label: Personas intersex con enfermedades crónicas
related: Intersex disabled people

Intersex blind people
type: Concept
issued: 2023-06-30
modified: 2025-02-23
comment: Intersex people with significant or total loss of vision.
comment: Personas intersex con pérdida significativa o total de la visión.
alternative label: Blind intersex people
alternative label: Personas ciegas intersex
alternative label: Personas intersex ciegas
broader: LGBTQ+ blind people
broader: Intersex disabled people
change note: Version 4.2.0
has top concept: LGBTQ+ people
in scheme: v3
preferred label: Personas intersexuales ciegas

Intersex political activists
type: Concept
issued: 2023-06-30
modified: 2025-02-23
comment: Intersex people working to bring about political or social change through public organizing.
comment: Personas intersex que trabajan para lograr cambios políticos o sociales a través de la organización pública.
broader: LGBTQ+ political activists
broader: Intersex activism
change note: Version 4.2.0
has top concept: LGBTQ+ people
in scheme: v3
preferred label: Activistas políticos intersex

Intersex press
type: Concept
issued: 2023-09-29
modified: 2025-02-23
comment: Newspapers, magazines, or other publishing outlets aimed at intersex audiences and/or operated by intersex people.
comment: Periódicos, revistas u otros medios editoriales dirigidos a audiencias intersex y/o operados por personas intersex.
broader: LGBTQ+ press
change note: Version 4.2.0
has top concept: LGBTQ+ press
in scheme: v3
narrower: Intersex zines
preferred label: Prensa intersex

Intersex relationships
type: Concept
issued: 2023-09-29
modified: 2025-02-23
comment: Ongoing connections (romantic, sexual, or platonic) between two or more intersex people.
comment: Conexiones continuas (románticas, sexuales o platónicas) entre dos o más personas intersex.
broader: Relationship satisfaction
change note: Version 4.2.0
has top concept: Relationship satisfaction
in scheme: v3
narrower: Intersex couples
preferred label: Relaciones intersex

Intersex wheelchair users
type: Concept
issued: 2023-09-29
modified: 2025-02-23
comment: Intersex people who use wheelchairs.
comment: Personas intersex que utilizan sillas de ruedas.
broader: LGBTQ+ wheelchair users
broader: Intersex disabled people
change note: Version 4.2.0
has top concept: LGBTQ+ people
in scheme: v3
preferred label: Usuarios intersex de sillas de ruedas

Intersex youth literature
type: Concept
issued: 2023-09-29
modified: 2025-02-23
comment: Written literary works for an audience of readers from 12-18 years of age, also known as young adult literature or YA; use in reference to youth literature focusing on intersex characters or themes.
comment: Obras literarias escritas para una audiencia de lectores de 12 a 18 años de edad, también conocidas como literatura para adultos jóvenes o YA (por sus siglas en inglés); utilícese en referencia a la literatura juvenil que se centra en personajes o temas intersex.
alternative label: Intersex YA
alternative label: Intersex young adult literature
broader: LGBTQ+ youth literature
broader: Intersex literature
change note: Version 4.2.0
has top concept: Subcultures
in scheme: v3
preferred label: Literatura juvenil intersex

Afro-Canadian intersex people
type: Concept
issued: 2023-09-29
modified: 2025-02-23
comment: Intersex people of African descent born in Canada or intersex people born in African countries who live in or have a strong connection to Canada. Use for individuals who self-identify as Afro-Canadian.
comment: Personas intersexuales de ascendencia africana nacidas en Canadá o personas intersex nacidas en países africanos que viven o tienen una conexión fuerte con Canadá. Utilícese para personas que se autoidentifican como afrocanadienses.
alternative label: Intersex Afro-Canadian people
alternative label: Intersex Afro-Canadians
alternative label: Afrocanadienses intersex
alternative label: Intersex afrocanadienses
alternative label: Personas intersex afrocanadienses
broader: Afro-Canadian LGBTQ+ people
broader: Black intersex people
change note: Version 4.2.0
has top concept: LGBTQ+ people
in scheme: v3
preferred label: Personas intersexuales afrocanadienses

Afro-Caribbean intersex people
type: Concept
issued: 2023-09-29
modified: 2025-02-23
comment: Intersex people of African descent born in the Caribbean or intersex people born in African countries who live in or have a strong connection to the Caribbean. Only use for individuals who self-identify as Afro-Caribbean.
comment: Personas intersexuales de ascendencia africana nacidas en el Caribe o personas intersex nacidas en países africanos que viven o tienen una conexión fuerte con el Caribe. Utilícese únicamente para personas que se identifiquen como afrocaribeñas.
alternative label: Personas intersex afrocaribeñas
broader: Afro-Caribbean LGBTQ+ people
broader: Black intersex people
change note: Version 4.2.0
has top concept: LGBTQ+ people
in scheme: v3
preferred label: Personas intersexuales afrocaribeñas

Afro-European intersex people
type: Concept
issued: 2023-09-29
modified: 2025-02-23
comment: Intersex people of African descent born in European countries or intersex people born in African countries who live in or have a strong connection to Europe. Only use for individuals who self-identify as Afro-European.
comment: Personas intersexuales de ascendencia africana nacidas en países europeos o personas intersexuales nacidas en países africanos que viven o tienen una conexiónfuerte con Europa. Utilícese únicamente para personas que se identifiquen como afroeuropeas.
alternative label: Intersex Afro-Europeans
alternative label: Afroeuropeos intersex
alternative label: Afroeuropeas intersex
alternative label: Personas intersex afroeuropeas
broader: Afro-European LGBTQ+ people
broader: Black intersex people
change note: Version 4.2.0
has top concept: LGBTQ+ people
in scheme: v3
preferred label: Personas intersexuales afroeuropeas

Native American intersex people
type: Concept
issued: 2023-09-29
modified: 2025-02-23
comment: People who are part of the Native peoples of the continental United States and Canada (excluding Inuit people) and self-identity as intersex. Use more specific terms when available.
comment: Personas intersexuales que son nativoamericanas o parte de los pueblos indígenas de Norteamérica; utilícese únicamente para personas que se autoidentifiquen como nativoamericanas e intersexuales.
alternative label: American Indian intersex people
alternative label: Intersex American Indians
alternative label: Intersex Native Americans
alternative label: Personas intersex nativoamericanas
alternative label: Personas nativoamericanas intersexuales
broader: Native American LGBTQ+ people
broader: Indigenous intersex people
change note: Version 4.2.0
has top concept: LGBTQ+ people
in scheme: v3
preferred label: Personas intersexuales nativoamericanas

Intersex couples
type: Concept
issued: 2023-09-29
modified: 2025-02-23
comment: Partnerships in which both people are intersex.
comment: Relaciones en las que ambas personas son intersex.
broader: LGBTQ+ couples
broader: Intersex relationships
change note: Version 4.2.0
has top concept: Relationship satisfaction
in scheme: v3
preferred label: Parejas intersex

Demisexual neurodivergent people
type: Concept
issued: 2023-10-27
modified: 2025-02-23
comment: Demisexual people whose brains process, learn, and/or behave differently from what is considered typical by society. Some of these neurological differences can present as learning disabilities, medical disorders, and other conditions.
comment: Personas demisexuales cuyos cerebros procesan, aprenden y/o se comportan de manera diferente a lo que la sociedad considera típico. Algunas de estas diferencias neurológicas pueden presentarse como problemas de aprendizaje, trastornos médicos y otras condiciones.
alternative label: Neurodivergent demisexual people
alternative label: Personas neurodivergentes demisexuales
broader: Demisexual disabled people
change note: Version 4.2.0
has top concept: LGBTQ+ people
in scheme: v3
narrower: Demisexual autistic people
preferred label: Personas demisexuales neurodivergentes

Megasexual neurodivergent people
type: Concept
issued: 2023-10-27
modified: 2025-02-23
comment: Megasexual people whose brains process, learn, and/or behave differently from what is considered typical by society. Some of these neurological differences can present as learning disabilities, medical disorders, and other conditions.
comment: Personas megasexuales cuyos cerebros procesan, aprenden y/o se comportan de manera diferente a lo que la sociedad considera típico. Algunas de estas diferencias neurológicas pueden presentarse como problemas de aprendizaje, trastornos médicos y otras condiciones.
alternative label: Neurodivergent megasexual people
alternative label: Personas neurodivergentes megasexuales
broader: Megasexual disabled people
change note: Version 4.2.0
has top concept: LGBTQ+ people
in scheme: v3
narrower: Megasexual autistic people
preferred label: Personas megasexuales neurodivergentes

Aromantic neurodivergent people
type: Concept
issued: 2023-10-27
modified: 2025-02-23
comment: Aromantic people whose brains process, learn, and/or behave differently from what is considered typical by society. Some of these neurological differences can present as learning disabilities, medical disorders, and other conditions.
comment: Personas arrománticas cuyos cerebros procesan, aprenden y/o se comportan de manera diferente a lo que la sociedad considera típico. Algunas de estas diferencias neurológicas pueden presentarse como problemas de aprendizaje, trastornos médicos y otras condiciones.
alternative label: Neurodivergent aromantic people
alternative label: Personas neurodivergentes arrománticas
broader: Aromantic disabled people
change note: Version 4.2.0
has top concept: LGBTQ+ people
in scheme: v3
narrower: Aromantic autistic people
preferred label: Personas arrománticas neurodivergentes

Greyromantic neurodivergent people
type: Concept
issued: 2023-10-27
modified: 2025-02-23
comment: Greyromantic people whose brains process, learn, and/or behave differently from what is considered typical by society. Some of these neurological differences can present as learning disabilities, medical disorders, and other conditions.
comment: Personas grisrománticas cuyos cerebros procesan, aprenden y/o se comportan de manera diferente a lo que la sociedad considera típico. Algunas de estas diferencias neurológicas pueden presentarse como problemas de aprendizaje, trastornos médicos y otras condiciones.
alternative label: Neurodivergent greyromantic people
alternative label: Personas neurodivergentes grisrománticas
broader: Greyromantic disabled people
change note: Version 4.2.0
has top concept: LGBTQ+ people
in scheme: v3
narrower: Greyromantic autistic people
preferred label: Personas grisrománticas neurodivergentes

Non-binary neurodivergent people
type: Concept
issued: 2023-10-27
modified: 2026-03-05
comment: Non-binary people with neurodevelopmental differences in areas such as cognition, sensory processing, emotionality, and sociality.
comment: Personas no binarias cuyos cerebros procesan, aprenden y/o se comportan de manera diferente a lo que la sociedad considera típico. Algunas de estas diferencias neurológicas pueden presentarse como problemas de aprendizaje, trastornos médicos y otras condiciones.
alternative label: Neurodivergent non-binary people
alternative label: Neurodivergent nonbinary people
alternative label: Neuroatypical non-binary people
alternative label: Neuroatypical nonbinary people
alternative label: Nonbinary neurodivergent people
alternative label: Non-binary neuroatypical people
alternative label: Nonbinary neuroatypical people
alternative label: Personas neurodivergentes no binarias
broader: Non-binary disabled people
change note: Version 4.2.0
has top concept: LGBTQ+ people
in scheme: v3
narrower: Non-binary autistic people
preferred label: Personas no binarias neurodivergentes

Demisexual hard of hearing people
type: Concept
issued: 2023-10-27
modified: 2025-02-23
comment: Demisexual people with significant or total hearing loss who may or may not consider themselves d/Deaf.
comment: Personas demisexuales con pérdida auditiva significativa o total que pueden considerarse o no S/sordas.
alternative label: Demisexual HoH people
alternative label: Demisexual hearing impaired people
alternative label: Hearing impaired demisexual people
alternative label: HoH Demisexual people
alternative label: Personas demisexuales con dificultades de audición
alternative label: Personas demisexuales con dificultades auditivas
broader: Demisexual disabled people
change note: Version 4.2.0
has top concept: LGBTQ+ people
in scheme: v3
preferred label: Personas demisexuales con problemas de audición
related: Demisexual Deaf people

Megasexual hard of hearing people
type: Concept
issued: 2023-10-27
modified: 2025-02-23
comment: Megasexual people with significant or total hearing loss who may or may not consider themselves d/Deaf.
comment: Personas megasexuales con pérdida auditiva significativa o total, que pueden o no considerarse S/sordas.
alternative label: Hearing impaired megasexual people
alternative label: HoH Megasexual people
alternative label: Megasexual HoH people
alternative label: Megasexual hearing impaired people
alternative label: Personas megasexuales con dificultades de audición
alternative label: Personas megasexuales con dificultades auditivas
broader: Megasexual disabled people
change note: Version 4.2.0
has top concept: LGBTQ+ people
in scheme: v3
preferred label: Personas megasexuales con problemas de audición
related: Megasexual Deaf people

Aromantic hard of hearing people
type: Concept
issued: 2023-10-27
modified: 2025-02-23
comment: Aromantic people who are hard of hearing.
comment: Personas arrománticas con problemas de audición, que pueden o no considerarse S/sordas.
alternative label: Aromantic HoH people
alternative label: Aromantic hearing impaired people
alternative label: Hearing impaired aromantic people
alternative label: HoH Aromantic people
alternative label: Personas arrománticas con dificultades de audición
alternative label: Personas arrománticas con dificultades auditivas
broader: Aromantic disabled people
change note: Version 4.2.0
has top concept: LGBTQ+ people
in scheme: v3
preferred label: Personas arrománticas con problemas de audición
related: Aromantic Deaf people

Greyromantic hard of hearing people
type: Concept
issued: 2023-10-27
modified: 2025-02-23
comment: Greyromantic people with significant or total hearing loss who may or may not consider themselves d/Deaf.
comment: Personas grisrománticas con pérdida auditiva significativa o total que pueden o no considerarse S/sordas.
alternative label: Greyromantic hearing impaired people
alternative label: Greyromantic HoH people
alternative label: Hearing impaired greyromantic people
alternative label: HoH Greyromantic people
alternative label: Personas grisrománticas con dificultades de audición
alternative label: Personas grisrománticas con dificultades auditivas
broader: Greyromantic disabled people
broader: Greyromantic Deaf people
change note: Version 4.2.0
has top concept: LGBTQ+ people
in scheme: v3
preferred label: Personas grisrománticas con problemas de audición

Non-binary hard of hearing people
type: Concept
issued: 2023-10-27
modified: 2025-02-23
comment: Non-binary people with significant or total hearing loss who may or may not consider themselves d/Deaf.
comment: Personas no binarias con pérdida auditiva significativa o total, que pueden o no considerarse S/sordas.
alternative label: Hearing impaired non-binary people
alternative label: HoH Non-binary people
alternative label: Non-binary HoH people
alternative label: Non-binary hearing impaired people
alternative label: Nonbinary hard of hearing people
alternative label: Personas no binarias con dificultades de audición
alternative label: Personas no binarias con dificultades auditivas
broader: Non-binary disabled people
change note: Version 4.2.0
has top concept: LGBTQ+ people
in scheme: v3
preferred label: Personas no binarias con problemas de audición
related: Non-binary Deaf people

Demisexual Deaf people
type: Concept
issued: 2023-10-27
modified: 2025-02-23
comment: Demisexual people with significant or total hearing loss. Some but not all Deaf people prefer to capitalize Deaf in recognition of the cultural and linguistic identity they share with other Deaf people.
comment: Personas demisexuales con pérdida auditiva significativa o total. Algunas personas sordas, pero no todas, prefieren escribir “Sorda/o” con mayúscula en reconocimiento de la identidad cultural y lingüística que comparten con otras personas sordas.
alternative label: Deaf demisexual people
alternative label: Personas sordas demisexuales
broader: Demisexual disabled people
change note: Version 4.2.0
has top concept: LGBTQ+ people
in scheme: v3
preferred label: Personas demisexuales sordas
related: Demisexual hard of hearing people

Megasexual Deaf people
type: Concept
issued: 2023-10-27
modified: 2025-02-23
comment: Megasexual people with significant or total hearing loss who may or may not consider themselves d/Deaf.
comment: Personas megasexuales con pérdida auditiva significativa o total. Algunas personas sordas, pero no todas, prefieren escribir “Sorda/o” con mayúscula en reconocimiento de la identidad cultural y lingüística que comparten con otras personas sordas.
alternative label: Deaf megasexual people
alternative label: Personas sordas megasexuales
broader: Megasexual disabled people
change note: Version 4.2.0
has top concept: LGBTQ+ people
in scheme: v3
preferred label: Personas megasexuales sordas
related: Megasexual hard of hearing people

Aromantic Deaf people
type: Concept
issued: 2023-10-27
modified: 2025-02-23
comment: Aromantic people with significant or total hearing loss. Some but not all Deaf people prefer to capitalize Deaf in recognition of the cultural and linguistic identity they share with other Deaf people.
comment: Personas arrománticas con pérdida auditiva significativa o total. Algunas personas sordas, pero no todas, prefieren escribir “Sorda/o” con mayúscula en reconocimiento de la identidad cultural y lingüística que comparten con otras personas sordas.
alternative label: Deaf aromantic people
alternative label: Personas sordas arrománticas
broader: Aromantic disabled people
change note: Version 4.2.0
has top concept: LGBTQ+ people
in scheme: v3
preferred label: Personas arrománticas sordas
related: Aromantic hard of hearing people

Greyromantic Deaf people
type: Concept
issued: 2023-10-27
modified: 2025-02-23
comment: Greyromantic people with significant or total hearing loss who may or may not consider themselves d/Deaf.
comment: Personas grisrománticas con pérdida auditiva significativa o total. Algunas personas sordas, pero no todas, prefieren escribir “Sorda/o” con mayúscula en reconocimiento de la identidad cultural y lingüística que comparten con otras personas sordas.
alternative label: Deaf greyromantic people
alternative label: Personas sordas grisrománticas
broader: Greyromantic disabled people
change note: Version 4.2.0
has top concept: LGBTQ+ people
in scheme: v3
narrower: Greyromantic hard of hearing people
preferred label: Personas grisrománticas sordas

Non-binary Deaf people
type: Concept
issued: 2023-10-27
modified: 2025-02-23
comment: Non-binary people with significant or total hearing loss. Some but not all Deaf people prefer to capitalize Deaf in recognition of the cultural and linguistic identity they share with other Deaf people.
comment: Personas no binarias con pérdida auditiva significativa o total. Algunas personas sordas, pero no todas, prefieren escribir “Sorda/o” con mayúscula en reconocimiento de la identidad cultural y lingüística que comparten con otras personas sordas.
alternative label: Deaf non-binary people
alternative label: Nonbinary Deaf people
alternative label: Personas sordas no binarias
alternative label: Sordos no binarios
broader: Non-binary disabled people
change note: Version 4.2.0
has top concept: LGBTQ+ people
in scheme: v3
preferred label: Personas no binarias sordas
related: Non-binary hard of hearing people

Demisexual people with chronic illnesses
type: Concept
issued: 2023-10-27
modified: 2025-02-23
comment: Demisexual people who have long-term health conditions that require continued medical attention and/or significantly impact or limit daily life; some but not all people with chronic illnesses consider themselves disabled.
comment: Personas demisexuales que tienen condiciones de salud a largo plazo que requieren atención médica continua y/o que impactan o limitan significativamente la vida diaria; algunas, pero no todas, las personas con enfermedades crónicas se consideran discapacitadas.
alternative label: Chronically ill demisexual people
alternative label: Personas con enfermedades crónicas demisexuales
alternative label: Enfermos crónicos demisexuales
alternative label: Enfermas crónicas demisexuales
change note: Version 4.2.0
in scheme: v3
preferred label: Personas demisexuales con enfermedades crónicas
related: Demisexual disabled people

Megasexual people with chronic illnesses
type: Concept
issued: 2023-10-27
modified: 2025-02-23
comment: Megasexual people who have long-term health conditions that require continued medical attention and/or significantly impact or limit daily life; some but not all people with chronic illnesses consider themselves disabled.
comment: Personas megasexuales que tienen condiciones de salud a largo plazo que requieren atención médica continua y/o impactan o limitan significativamente la vida diaria; algunas, pero no todas, las personas con enfermedades crónicas se consideran discapacitadas.
alternative label: Chronically ill megasexual people
alternative label: Personas con enfermedades crónicas megasexuales
alternative label: Enfermos crónicos megasexuales
change note: Version 4.2.0
in scheme: v3
preferred label: Personas megasexuales con enfermedades crónicas
related: Megasexual disabled people

Aromantic people with chronic illnesses
type: Concept
issued: 2023-10-27
modified: 2025-02-23
comment: Aromantic people who have long-term health conditions that require continued medical attention and/or significantly impact or limit daily life; some but not all people with chronic illnesses consider themselves disabled.
alternative label: Chronically ill aromantic people
change note: Version 4.2.0
in scheme: v3
related: Aromantic disabled people

Greyromantic people with chronic illnesses
type: Concept
issued: 2023-10-27
modified: 2025-02-23
comment: Greyromantic people who have long-term health conditions that require continued medical attention and/or significantly impact or limit daily life; some but not all people with chronic illnesses consider themselves disabled.
comment: Personas grisrománticas que tienen condiciones de salud a largo plazo que requieren atención médica continua y/o impactan o limitan significativamente la vida diaria; algunas, pero no todas, las personas con enfermedades crónicas se consideran discapacitadas.
alternative label: Chronically ill greyromantic people
alternative label: Personas con enfermedades crónicas grisrománticas
alternative label: Enfermos crónicos grisrománticos
change note: Version 4.2.0
in scheme: v3
preferred label: Personas grisrománticas con enfermedades crónicas
related: Greyromantic disabled people

Non-binary people with chronic illnesses
type: Concept
issued: 2023-10-27
modified: 2025-02-23
comment: Non-binary people who have long-term health conditions that require continued medical attention and/or significantly impact or limit daily life; some but not all people with chronic illnesses consider themselves disabled.
comment: Personas no binarias que tienen condiciones de salud a largo plazo que requieren atención médica continua y/o impactan o limitan significativamente la vida diaria; algunas, pero no todas, las personas con enfermedades crónicas se consideran discapacitadas.
alternative label: Chronically ill non-binary people
alternative label: Personas con enfernedades crónicas no binarias
alternative label: Enfermos crónicos no binarios
change note: Version 4.2.0
in scheme: v3
preferred label: Personas no binarias con enfermedades crónicas
related: Non-binary disabled people

Aromantic college students
type: Concept
issued: 2023-12-05
modified: 2025-02-23
comment: Aromantic people who are attending college.
comment: Personas arrománticas que asisten a la universidad.
broader: LGBTQ+ college students
change note: Version 4.2.0
has top concept: LGBTQ+ people
in scheme: v3
preferred label: Estudiantes universitarios arrománticos
related: LGBTQ+ alumni groups

Violet wands
type: Concept
issued: 2023-12-15
modified: 2025-02-23
comment: A device used to apply an electrical charge to the body.
comment: Dispositivo utilizado para aplicar una carga eléctrica al cuerpo.
alternative label: Varita violeta
broader: Sex accessories
change note: Version 4.2.0
has top concept: Sex accessories
in scheme: v3
related: Electrical play

Electrical play
type: Concept
issued: 2023-12-15
modified: 2025-03-20
comment: Any of various forms of sexual play which involve the application of electricity.
comment: Cualquiera de las diversas formas de juego sexual que implican la aplicación de electricidad.
alternative label: Juego con electricidad
broader: BDSM
change note: Version 4.2.0
has top concept: Eroticism
in scheme: v3
preferred label: Juego de electricidad
related: Violet wands

Vacuum pumps
type: Concept
issued: 2023-12-15
modified: 2025-02-23
comment: A sexual aid or accessory that is placed over and around genitalia. The device creates a suction that engorges and enlarges genitalia.
comment: Una ayuda o accesorio sexual que se coloca sobre y alrededor de los genitales. El dispositivo crea una succión que hincha y agranda los genitales.
alternative label: Clitoral pump
alternative label: Nipple pump
alternative label: Penis pump
alternative label: Suckers
alternative label: Bomba de clítoris
alternative label: Succionador de pezon
alternative label: Succionador de clítoris
alternative label: Succionador de pene
broader: Kink accessories
change note: Version 4.2.0
has top concept: Eroticism
in scheme: v3
preferred label: Dispositivo de vacio
related: Erectile dysfunction

Knife play
type: Concept
issued: 2023-12-18
modified: 2025-02-23
comment: The use of knives or blades during kink or erotic play.
comment: El uso de cuchillos o navajas durante las prácticas kink o en juegos eróticos.
alternative label: Cutting
alternative label: Juego con cuchillos
broader: BDSM
change note: Version 4.2.0
has top concept: Eroticism
in scheme: v3
preferred label: Juego de cuchillos
related: Blood play

Lateral lesbophobia
type: Concept
issued: 2023-12-18
modified: 2025-02-23
comment: The phenomenon in which lesbians displace violence or oppression onto other lesbians, often by acting on internalized lesbophobic beliefs (i.e., negative perceptions of and intolerance toward lesbians and lesbianism) adopted as a result of being raised or socialized within a lesbophobic environment or culture.
comment: El fenómeno a través del cual las lesbianas desplazan la violencia o la opresión sobre otras lesbianas, a menudo, actuando sobre la base de creencias lesbofóbicas internalizadas (es decir, percepciones negativas e intolerancia hacia las lesbianas y el lesbianismo), adoptadas como resultado de haber sido criadas o socializadas dentro de un entorno o una cultura lesbofóbica.
broader: Internalized lesbophobia
broader: Lateral oppression
change note: Version 4.2.0
has top concept: LGBTQ+ phobia
in scheme: v3
preferred label: Lesbofobia lateral

Lateral homophobia
type: Concept
issued: 2023-12-18
modified: 2025-02-23
comment: This term is often used to describe lateral homophobia carried out by LGBTQ+ people in general. Lateral homophobia refers to the phenomenon in which gay men displace violence or oppression onto other gay men, often by acting on internalized homophobic beliefs (i.e., negative perceptions of and intolerance toward gay men and homosexuality) adopted as a result of being raised or socialized within a homophobic environment or culture.
comment: Este término se utiliza a menudo para describir la homofobia lateral llevada a cabo por personas LGBTQ+ en general. La homofobia lateral se refiere al fenómeno a través del cual los hombres gay desplazan la violencia u opresión hacia otros hombres gay, a menudo, actuando sobre la base de creencias homofóbicas internalizadas (es decir, percepciones negativas e intolerancia hacia los hombres gay y la homosexualidad), adoptadas como resultado de haber sido criados o socializados dentro de un ambiente o una cultura homofóbica.
broader: Internalized homophobia
broader: Lateral oppression
change note: Version 4.2.0
has top concept: LGBTQ+ phobia
in scheme: v3
preferred label: Homofobia lateral

Lateral biphobia
type: Concept
issued: 2023-12-18
modified: 2025-02-23
comment: The phenomenon in which bisexual people displace violence or oppression onto other bisexual people, often by acting on internalized biphobic beliefs (i.e., negative perceptions of and intolerance toward bisexual people and bisexuality) adopted as a result of being raised or socialized within a biphobic environment or culture.
comment: El fenómeno a través del cual las personas bisexuales desplazan la violencia u opresión hacia otras personas bisexuales, a menudo, actuando sobre la base de creencias bifóbicas internalizadas (es decir, percepciones negativas e intolerancia hacia las personas bisexuales y la bisexualidad), adoptadas como resultado de haber sido criadas o socializadas dentro de un entorno o una cultura bifóbica.
broader: Internalized biphobia
broader: Lateral oppression
change note: Version 4.2.0
has top concept: LGBTQ+ phobia
in scheme: v3
preferred label: Bifobia lateral

Lateral transphobia
type: Concept
issued: 2023-12-18
modified: 2025-02-23
comment: The phenomenon in which transgender people displace violence or oppression onto other transgender people, often by acting on internalized transphobic beliefs (i.e., negative perceptions of and intolerance toward transgender people and trans identities) adopted as a result of being raised or socialized within transphobic environment or culture.
comment: El fenómeno a través del cual las personas transgénero desplazan la violencia u opresión hacia otras personas transgénero, a menudo, actuando sobre la base de creencias transfóbicas internalizadas (es decir, percepciones negativas e intolerancia hacia las personas transgénero y las identidades trans), adoptadas como resultado de haber sido criadas o socializadas en un entorno o una cultura transfóbica.
broader: Internalized transphobia
broader: Lateral oppression
change note: Version 4.2.0
has top concept: LGBTQ+ phobia
in scheme: v3
preferred label: Transfobia lateral

Lateral queerphobia
type: Concept
issued: 2023-12-18
modified: 2025-02-23
comment: The phenomenon in which queer people displace violence or oppression onto other queer people, often by acting on internalized queerphobic beliefs (i.e., negative perceptions of and intolerance toward queer people and queer identity) adopted as a result of being raised or socialized within a queerphobic environment or culture.
comment: El fenómeno a través del cual las personas queer desplazan la violencia u opresión hacia otras personas queer, a menudo, actuando sobre la base de creencias queerfóbicas internalizadas (es decir, percepciones negativas e intolerancia hacia las personas queer y la identidad queer), adoptadas como resultado de haber sido criadas o socializadas dentro de un entorno o una cultura queerfóbica.
broader: Internalized queerphobia
broader: Lateral oppression
change note: Version 4.2.0
has top concept: LGBTQ+ phobia
in scheme: v3
preferred label: Queerfobia lateral

Lateral intersexphobia
type: Concept
issued: 2023-12-18
modified: 2025-02-23
comment: The phenomenon in which intersex people displace violence or oppression onto other intersex people, often by acting on internalized intersexphobic beliefs (i.e., negative perceptions of and intolerance toward intersex people and intersex variations) adopted as a result of being raised or socialized within a intersexphobic environment or culture.
comment: El fenómeno a través del cual las personas intersex desplazan la violencia u opresión hacia otras personas intersex, a menudo, actuando sobre la base de creencias intersexfóbicas internalizadas (es decir, percepciones negativas e intolerancia hacia las personas intersex y variaciones intersex), adoptadas como resultado de haber sido criadas o socializadas dentro de un entorno o una cultura intersexfóbica.
alternative label: Lateral interphobia
broader: Internalized intersexphobia
broader: Lateral oppression
change note: Version 4.2.0
has top concept: LGBTQ+ phobia
in scheme: v3
preferred label: Intersexfobia lateral

Sex-positive feminism
type: Concept
issued: 2023-12-20
modified: 2025-03-20
comment: A broad feminist movement, usually compared against the anti-sex or anti-pornography feminist movement, that supports sexual liberation, sex workers, pornography, and freedom of sexual and gender expression.
comment: Un movimiento feminista amplio, generalmente contrastado con el movimiento feminista antisexo o antipornografía, que apoya la liberación sexual, a quienes realizan trabajo sexual, la pornografía y la libertad de expresión sexual y de género.
alternative label: Sex-positive movement
alternative label: Feminismo pro-sexo
alternative label: Feminismo sexo positivo
alternative label: Feminismo sexo afirmativo
alternative label: Feminismo de positividad sexual
broader: Feminism
change note: Version 4.2.0
has top concept: Feminism
in scheme: v3
preferred label: Feminismo prosexo
related: Leather and kink activism

High heel fetish
type: Concept
issued: 2023-12-20
modified: 2025-02-23
comment: Eroticization of shoes with high heels.
comment: Erotización de los zapatos con tacones altos.
alternative label: Fetiche de zapatos de tacón
alternative label: Fetiche de zapatos de tacón alto
alternative label: Altocalcifilia
broader: Shoe fetish
change note: Version 4.2.0
has top concept: Eroticism
in scheme: v3
preferred label: Fetiche de tacones
related: Boot fetish

Bootblacks
type: Concept
issued: 2023-12-20
modified: 2025-02-23
comment: In the leather and kink communities, an individual who cleans and conditions someone’s leather boots, shoes or garments.
comment: En las comunidades del cuero y kink, un individuo que limpia y acondiciona las botas, los zapatos o las prendas de cuero de alguien.
alternative label: Limpiabotas
broader: Leather people
change note: Version 4.2.0
has top concept: LGBTQ+ communities
in scheme: v3
preferred label: Lustrabotas
related: Bootblacking

Genital torture
type: Concept
issued: 2023-12-20
modified: 2025-03-20
comment: A kink activity involving application of pain, intense sensation, or constriction to the genitals.
comment: Una actividad kink que implica la aplicación de dolor, sensaciones intensas o la constricción de los genitales.
alternative label: CBT
alternative label: Cock and ball torture
alternative label: Pussy torture
broader: Sadomasochism
change note: Version 4.2.0
has top concept: Eroticism
in scheme: v3
preferred label: Tortura genital
related: Genitals

Tickling
type: Concept
issued: 2023-12-20
modified: 2025-02-23
comment: Tickling is the act of touching a part of a body in a way that causes involuntary twitching movements and/or laughter.
comment: Cosquillear es el acto de tocar una parte del cuerpo de una manera que provoca movimientos espasmódicos involuntarios y/o risa.
alternative label: Knismolagnia
alternative label: Knismophilia
alternative label: Tickle torture
alternative label: Cosquillas
broader: BDSM
change note: Version 4.2.0
has top concept: Eroticism
in scheme: v3
preferred label: Cosquilleo
related: Sadomasochism

Flogging
type: Concept
issued: 2023-12-20
modified: 2025-02-23
comment: Consensual impact play using a flogger, i.e. a multi-tailed whip, usually made of leather.
comment: Juego de impacto consensuado utilizando un azotador or flagelo, es decir, un látigo de varias colas, generalmente hecho de cuero.
broader: Impact play
change note: Version 4.2.0
has top concept: Eroticism
in scheme: v3
preferred label: Flagelación
related: Whipping

Edge play
type: Concept
issued: 2023-12-20
modified: 2025-02-23
comment: BDSM activities and kinks that are considered to have an increased level of risk or taboo, or which are challenging to the participants for subjective reasons, for example due to a personal fear or boundary.
comment: Actividades y kinks del BDSM que se consideran que tienen mayor nivel de riesgo o tabú, o que suponen un desafío para los participantes por razones subjetivas, por ejemplo, debido a un miedo o límite personal.
alternative label: Edgeplay
alternative label: Taboo play
alternative label: Juegos de límite
broader: BDSM
change note: Version 4.2.0
has top concept: Eroticism
in scheme: v3
preferred label: Control del orgasmo
related: Roleplay

Cigar play
type: Concept
issued: 2023-12-20
modified: 2025-03-20
comment: A form of temperature play that involves using cigars, usually applied to the skin.
comment: Una forma de juego de temperatura que implica el uso de cigarros generalmente aplicados sobre la piel.
broader: Temperature play
change note: Version 4.2.0
has top concept: Eroticism
in scheme: v3
preferred label: Juego de cigarros
related: Fire play

Anti-sadomasochism
type: Concept
issued: 2023-12-20
modified: 2025-02-23
comment: Opposition to various practices or fantasies involving sadomasochism or power exchange.
alternative label: Antisadomasochism
broader: Anti-kink discrimination
change note: Version 4.2.0
has top concept: Anti-kink discrimination
in scheme: v3
related: Sadomasochism

Chastity devices
type: Concept
issued: 2023-12-20
modified: 2025-02-23
comment: Accessories or devices used to restrict or confine the genitalia.
comment: Accesorios o dispositivos utilizados para restringir o confinar los genitales.
alternative label: Chastity belt
alternative label: Cock cage
alternative label: Cinturón de castidad
alternative label: Dispositivos de castidad
alternative label: Jaula de pene
alternative label: Jaula de castidad
broader: Kink accessories
change note: Version 4.2.0
has top concept: Eroticism
in scheme: v3
preferred label: Aparatos de castidad
related: Chastity play

Clothespins (Erotic)
type: Concept
issued: 2023-12-20
modified: 2025-02-23
comment: A fastener usually used to hang up clothes for drying, here used as a sex toy.
comment: Un sujetador generalmente utilizado para colgar ropa y secarla, utilizado aquí como juguete sexual.
alternative label: Clothes pegs
alternative label: Ganchos
alternative label: Pinzas
broader: Sex accessories
broader: Clamps (Erotic)
change note: Version 4.2.0
has top concept: Sex accessories
in scheme: v3
preferred label: Pinzas para ropa (erótico)

Intersex zines
type: Concept
issued: 2024-01-02
modified: 2025-02-23
comment: Independent, small-circulation publications usually reproduced via photocopier; use for zines created by intersex people and/or focusing on intersex identity, issues, or culture.
comment: Publicaciones independientes de pequeña tirada generalmente reproducidas mediante fotocopiadora; utilícese para zines creadas por personas intersex y/o centradas en la identidad intersex.
broader: LGBTQ+ zines
broader: Intersex press
change note: Version 4.2.0
has top concept: LGBTQ+ press
in scheme: v3
preferred label: Zines intersex

Transgender zines
type: Concept
issued: 2024-01-02
modified: 2025-02-23
comment: Independent, small-circulation publications usually reproduced via photocopier; use for zines created by trans people and/or focusing on trans identities, issues, or culture.
comment: Publicaciones independientes de pequeña tirada generalmente reproducidas mediante fotocopiadora; utilícese para revistas creadas por personas trans y/o centradas en identidades, asuntos o cultura trans.
alternative label: Trans zines
alternative label: Zines trans
broader: LGBTQ+ zines
broader: Transgender press
change note: Version 4.2.0
has top concept: LGBTQ+ press
in scheme: v3
preferred label: Zines transgénero

Asexual zines
type: Concept
issued: 2024-01-02
modified: 2025-02-23
comment: Independent, small-circulation publications usually reproduced via photocopier; use for zines created by asexual people and/or focusing on asexual identity, issues, or culture.
comment: Publicaciones independientes de tiradas pequeñas generalmente reproducidas mediante fotocopiadora; utilícese para revistas creadas por personas asexuales y/o centradas en la identidad asexual.
broader: LGBTQ+ zines
broader: Asexual press
change note: Version 4.2.0
has top concept: LGBTQ+ press
in scheme: v3
preferred label: Zines asexuales

Two-Spirit zines
type: Concept
issued: 2024-01-02
modified: 2025-02-23
comment: Independent, small-circulation publications usually reproduced via photocopier; use for zines created by Two-Spirit people and/or focusing on Two-Spirit identities, issues, or culture.
comment: Publicaciones independientes de tiradas pequeñas generalmente reproducidas mediante fotocopiadora; utilícese para revistas creadas por personas dos espíritus y/o centradas en la identidad dos espíritus.
alternative label: 2S zines
alternative label: Two Spirit zines
alternative label: Two Spirited zines
alternative label: Two-Spirited zines
broader: Two-Spirit press
change note: Version 4.2.0
has top concept: Two-Spirit press
in scheme: v3
preferred label: Zines dos espíritus
related: LGBTQ+ zines

Queer zines
type: Concept
issued: 2024-01-02
modified: 2025-02-23
comment: Independent, small-circulation publications usually reproduced via photocopier; use for zines created by queer people and/or focusing on queer identity, issues, or cultures.
comment: Publicaciones independientes de pequeña tirada generalmente reproducidas mediante fotocopiadora; utilícese para revistas creadas por personas queer y/o que se centren en identidades, cuestiones y culturas queer.
broader: LGBTQ+ zines
broader: Queer press
change note: Version 4.2.0
has top concept: LGBTQ+ press
in scheme: v3
preferred label: Zines queer

Lesbian zines
type: Concept
issued: 2024-01-02
modified: 2025-02-23
comment: Independent, small-circulation publications usually reproduced via photocopier; use for zines created by lesbians and/or focusing on lesbian identity, issues, or culture.
comment: Publicaciones independientes de pequeña tirada generalmente reproducidas mediante fotocopiadora; utilícese para revistas creadas por lesbianas y/o que se centran en la identidad, los problemas o la cultura lésbica.
broader: Lesbian press
broader: LGBTQ+ zines
change note: Version 4.2.0
has top concept: LGBTQ+ press
in scheme: v3
preferred label: Zines lésbicos

Gay zines
type: Concept
issued: 2024-01-02
modified: 2025-02-23
comment: Independent, small-circulation publications usually reproduced via photocopier; use for zines created by gay people and/or focusing on gay identity, issues, or culture.
comment: Publicaciones independientes de pequeña tirada generalmente reproducidas mediante fotocopiadora; utilícese para revistas creadas por hombres gay y/o centradas en la identidad gay.
broader: Gay press
broader: LGBTQ+ zines
change note: Version 4.2.0
has top concept: LGBTQ+ press
in scheme: v3
preferred label: Zines gay

Lesbian operas
type: Concept
issued: 2024-01-09
modified: 2025-02-23
comment: Operas created by lesbian directors, depicting lesbian individuals, or that are regarded as important within lesbian culture.
comment: Óperas creadas por directoras lesbianas, que representan a personas lesbianas, o a personas consideradas importantes dentro de la cultura lésbica.
broader: LGBTQ+ operas
change note: Version 4.2.0
has top concept: Subcultures
in scheme: v3
preferred label: Óperas lésbicos
related: Women's music

Queer operas
type: Concept
issued: 2024-01-09
modified: 2025-02-23
comment: Operas created by queer directors, depicting queer individuals, or that are regarded as important within queer culture.
comment: Óperas creadas por directores queer, que representan a personas queer, o personas consideradas importantes dentro de la cultura queer.
broader: LGBTQ+ operas
change note: Version 4.2.0
has top concept: Subcultures
in scheme: v3
preferred label: Óperas queer
related: Two-Spirit operas

Eco-feminists
type: Concept
issued: 2024-01-11
modified: 2025-02-23
comment: A person who subscribes to the political and philosophical movement that views feminism and concerns for the environment as inherently related. Use when resources are about eco-feminists or when an individual identifies as such.
comment: Una persona que se posiciona bajo el movimiento político y filosófico que entiende el feminismo y las preocupaciones por el medio ambiente como intrínsecamente relacionados. Utilícese cuando los recursos son sobre ecofeministas o cuando una persona se identifique como tal.
alternative label: Ecofeminsts
alternative label: Eco-feministas
broader: Feminists
change note: Version 4.2.0
has top concept: Feminists
in scheme: v3
preferred label: Ecofeministas
related: Ecofeminism

First-wave feminists
type: Concept
issued: 2024-01-11
modified: 2025-02-23
comment: A person who was part of a period of women's rights activism in the 19th and early 20th centuries that was primarily focused on legal rights such as women's right to vote. Use when resources are about first-wave feminists.
comment: Persona que formó parte de un período de activismo por los derechos de las mujeres en el siglo XIX y principios del XX que se centró principalmente en derechos legales como el derecho de las mujeres al voto. Utilícese cuando los recursos sean sobre feministas de la primera ola.
alternative label: First wave feminists
alternative label: Feministas de la primera ola
broader: Feminists
change note: Version 4.2.0
has top concept: Feminists
in scheme: v3
preferred label: Feministas la de primera ola
related: First-wave feminism

Second-wave feminists
type: Concept
issued: 2024-01-11
modified: 2025-02-23
comment: A person who was part of or subscribes to beliefs developed during a period of feminist political activity (also referred to as women’s liberation) beginning in the early 1960s that critiqued male-dominated institutions and cultural practices in society. Use when resources are about second-wave feminists or when an individual identifies as such.
comment: Una persona que formó parte o se suscribe a creencias desarrolladas durante un período de actividad política feminista (también conocido como liberación de la mujer) que comenzó a principios de la década de 1960 y que criticaba las instituciones y prácticas culturales dominadas por los hombres en la sociedad. Utilícese cuando los recursos sean sobre feministas de segunda ola o cuando una persona se identifique como tal.
alternative label: Second wave feminists
broader: Feminists
change note: Version 4.2.0
has top concept: Feminists
in scheme: v3
preferred label: Feministas de segunda ola
related: Second-wave feminism

Third-wave feminists
type: Concept
issued: 2024-01-11
modified: 2025-02-23
comment: A person who was part of or subscribes to beliefs developed during a period of feminist political activity beginning in the early 1990s that embraced diversity and individualism in women and sought to redefine what it meant to be a feminist. The third-wave is characterized by the emergence of new feminist movements and theories such as intersectionality, sex positivity, ecofeminism, transfeminism, and postmodern feminism. Use when resources are about third-wave feminists or when an individual identifies as such.
comment: Una persona que formaba parte de o se suscribía a creencias desarrolladas durante un período de actividad política feminista que comenzó a principios de la década de 1990 y que abrazó la diversidad y el individualismo de las mujeres y buscó redefinir lo que significaba ser feminista. La tercera ola se caracteriza por el surgimiento de nuevos movimientos y teorías feministas como la interseccionalidad, la positividad sexual, el ecofeminismo, el transfeminismo y el feminismo posmoderno. Utilícese cuando los recursos sean sobre feministas de la tercera ola o cuando una persona se identifique como tal.
alternative label: Third wave feminists
broader: Feminists
change note: Version 4.2.0
has top concept: Feminists
in scheme: v3
preferred label: Feministas de la tercera ola
related: Third-wave feminism

Two-Spirit urban fantasy fiction
type: Concept
issued: 2024-01-18
modified: 2025-10-03
comment: A subgenre of fantasy fiction featuring magic and supernatural creatures in contemporary urban settings; use for urban fantasy focusing on Two-Spirit characters or themes.
comment: Un subgénero de la ficción fantástica que presenta a criaturas mágicas y sobrenaturales en entornos urbanos contemporáneos; utilícese para la fantasía urbana centrada en personajes o temas dos espíritus.
broader: Two-Spirit fiction
change note: Version 4.2.0
has top concept: Two-Spirit literature
in scheme: v3
preferred label: Ficción fantástica urbana dos espiritus
preferred label: 2S urban fantasy fiction
preferred label: Two Spirit urban fantasy fiction
preferred label: Two Spirited urban fantasy fiction
preferred label: Two-Spirited urban fantasy fiction
related: LGBTQ+ urban fantasy fiction

Non-binary urban fantasy fiction
type: Concept
issued: 2024-01-18
modified: 2025-10-31
comment: A subgenre of fantasy fiction featuring magic and supernatural creatures in contemporary urban settings; use for urban fantasy focusing on non-binary characters or themes.
comment: Un subgénero de la ficción fantástica que presenta criaturas mágicas y sobrenaturales en entornos urbanos contemporáneos; utilícese para la ficción fantástica urbana centrada en personajes o temas no binarios.
alternative label: Ficción de fantasía urbana no binaria
alternative label: Ficción no binaria de fantasía urbana
broader: LGBTQ+ urban fantasy fiction
broader: Non-binary fiction
change note: Version 4.2.0
has top concept: Subcultures
in scheme: v3
preferred label: Ficción fantástica urbana no binaria
preferred label: Nonbinary urban fantasy fiction

Dyke solidarity
type: Concept
issued: 2024-04-16
modified: 2025-04-23
comment: A sense of fellowship and overall unity of purpose, political interest, and/or community sympathies based on shared experiences as self-identifying dykes.
broader: LGBTQ+ solidarity
change note: Version 4.2.0
has top concept: LGBTQ+ solidarity
in scheme: v3
related: Dyke demonstrations

Two-Spirit solidarity
type: Concept
issued: 2024-04-16
modified: 2025-02-23
comment: A sense of fellowship and overall unity of purpose, political interest, and/or community sympathies based on shared experiences as Two-Spirit people.
alternative label: 2S solidarity
alternative label: Two Spirit solidarity
alternative label: Two Spirited solidarity
alternative label: Two-Spirited solidarity
change note: Version 4.2.0
in scheme: v3
related: LGBTQ+ solidarity

Two-Spirit websites
type: Concept
issued: 2024-04-25
modified: 2025-02-23
comment: Public web pages that primarily address Two-Spirit communities and issues, as well as web pages intended for use by Two-Spirit people.
alternative label: 2S websites
alternative label: Two Spirit websites
alternative label: Two Spirited websites
alternative label: Two-Spirited websites
change note: Version 4.2.0
in scheme: v3
related: LGBTQ+ websites

Pregnant men
type: Concept
issued: 2024-05-24
modified: 2025-02-23
comment: Pregnant people who are trans or intersex men. For the fandom trope in which cisgender men can become pregnant, use the term "Mpreg."
broader: Males
broader: Pregnant people
change note: Version 4.2.0
has top concept: Gender
in scheme: v3

Pregnant women
type: Concept
issued: 2024-05-24
modified: 2025-02-23
comment: Pregnant people who are women.
broader: Females
broader: Pregnant people
change note: Version 4.2.0
has top concept: Gender
in scheme: v3

Pregnant intersex people
type: Concept
issued: 2024-05-24
modified: 2025-02-23
comment: Pregnant people who are intersex.
broader: Intersex people
broader: Pregnant people
change note: Version 4.2.0
has top concept: LGBTQ+ people
in scheme: v3

Pregnant transgender people
type: Concept
issued: 2024-05-24
modified: 2025-02-23
comment: Pregnant people who are transgender.
alternative label: Pregnant trans people
broader: Transgender people
broader: Pregnant people
change note: Version 4.2.0
has top concept: LGBTQ+ people
in scheme: v3

Pregnant non-binary people
type: Concept
issued: 2024-05-24
modified: 2025-02-23
comment: Pregnant people who are non-binary.
alternative label: Pregnant nonbinary people
broader: Non-binary people
broader: Pregnant people
change note: Version 4.2.0
has top concept: LGBTQ+ people
in scheme: v3

Pregnant Two-Spirit people
type: Concept
issued: 2024-05-24
modified: 2025-02-23
comment: Pregnant people who are Two-Spirit.
alternative label: Pregnant 2S people
alternative label: Pregnant Two Spirit people
alternative label: Pregnant Two Spirited people
alternative label: Pregnant Two-Spirited people
broader: Two-Spirit people
broader: Pregnant people
change note: Version 4.2.0
has top concept: Gender
in scheme: v3

Pregnant māhū
type: Concept
issued: 2024-05-24
modified: 2025-02-23
comment: Pregnant people who are māhū.
alternative label: Pregnant mahu
broader: Māhū
broader: Pregnant people
change note: Version 4.2.0
has top concept: Gender
in scheme: v3

Drag television programs
type: Concept
issued: 2024-05-24
modified: 2025-02-23
comment: Television programs that feature drag queens and/or drag kings and drag performances.
alternative label: Drag TV programmes
alternative label: Drag TV programs
alternative label: Drag TV shows
alternative label: Drag television programmes
alternative label: Drag television shows
alternative label: Drag television
broader: Drag
change note: Version 4.2.0
has top concept: Gender
in scheme: v3
related: LGBTQ+ television

Aromantic teachers
type: Concept
issued: 2024-05-24
modified: 2025-02-23
comment: Teachers who self-identify as aromantic.
broader: LGBTQ+ teachers
change note: Version 4.2.0
has top concept: LGBTQ+ people
in scheme: v3
related: Aromantic academics

Māhū teachers
type: Concept
issued: 2024-05-24
modified: 2025-02-23
comment: Teachers who are Māhū.
alternative label: Mahu teachers
broader: Māhū
change note: Version 4.2.0
has top concept: Gender
in scheme: v3
related: LGBTQ+ teachers

Two-Spirit teachers
type: Concept
issued: 2024-05-24
modified: 2025-02-23
comment: Indigenous teachers who self-identify as Two-Spirit.
alternative label: 2S teachers
alternative label: Two Spirit teachers
alternative label: Two Spirited teachers
alternative label: Two-Sprited teachers
broader: Two-Spirit people
change note: Version 4.2.0
has top concept: Gender
in scheme: v3
related: LGBTQ+ teachers

Aromantic academics
type: Concept
issued: 2024-05-24
modified: 2025-02-23
comment: Aromantic researchers and/or educators working in higher education.
alternative label: Aromantic college teachers
alternative label: Aromantic professors
alternative label: Aromantic researchers
broader: LGBTQ+ academics
change note: Version 4.2.0
has top concept: LGBTQ+ people
in scheme: v3
related: Aromantic teachers

Two-Spirit academics
type: Concept
issued: 2024-05-24
modified: 2025-02-23
comment: Two-spirit researchers and/or educators working in higher education.
alternative label: 2S academics
alternative label: Two spirit academics
alternative label: Two spirited academics
alternative label: Two-Spirit college teachers
alternative label: Two-Spirit professors
alternative label: Two-Spirit researchers
alternative label: Two-sprited academics
broader: Two-Spirit people
change note: Version 4.2.0
has top concept: Gender
in scheme: v3
related: LGBTQ+ academics

LGBTQ+ travel guides
type: Concept
issued: 2024-06-10
modified: 2025-03-20
comment: Books or other resources of information about places designed for the use of LGBTQ+ visitors or tourists, typically to direct travelers to establishments or attractions that are owned by, open to, or frequented by LGBTQ+ people. LGBTQ+ travel guides may also direct travelers to safe houses or businesses in places where LGBTQ+ people are otherwise unsafe or criminalized, as well as locations commonly used for cruising, or picking up casual sex partners.
alternative label: Guide books (LGBTQ)
alternative label: LGBTQ+ guide books
alternative label: LGBTQ+ travel guide books
alternative label: Travel guide books (LGBTQ)
alternative label: Travel guides (LGBTQ)
broader: LGBTQ+ tourism
change note: Version 4.2.0
has top concept: LGBTQ+ tourism
in scheme: v3
related: LGBTQ+ survival guides

Rural Two-Spirit people
type: Concept
issued: 2024-07-11
modified: 2025-02-23
comment: Two-Spirit people who are currently living in or consider themselves to be from agricultural or forested areas with low population densities.
alternative label: 2S rural people
alternative label: Rural 2S people
alternative label: Rural Two Spirit people
alternative label: Rural Two Spirited people
alternative label: Rural Two-Spirited people
alternative label: Two Spirit rural people
alternative label: Two Spirited rural people
alternative label: Two-Spirit rural people
alternative label: Two-Spirited rural people
broader: Two-Spirit people
change note: Version 4.2.0
has top concept: Gender
in scheme: v3
related: Rural LGBTQ+ people

Two-Spirit painters
type: Concept
issued: 2024-07-31
modified: 2025-02-23
comment: Two-Spirit people who paint, either professionally or as a hobby.
alternative label: 2S painters
alternative label: Two Spirit painters
alternative label: Two-Spirited painters
broader: Two-Spirit artists
change note: Version 4.2.0
has top concept: Gender
in scheme: v3
related: LGBTQ+ painters

Non-binary athletes
type: Concept
issued: 2024-07-31
modified: 2026-02-24
comment: Professional or amateur/recreational sports players who are non-binary.
alternative label: Non-binary sports players
alternative label: Non-binary sportspeople
alternative label: Non-binary sportspersons
alternative label: Nonbinary athletes
alternative label: Nonbinary sports players
alternative label: Nonbinary sportspeople
alternative label: Nonbinary sportspersons
broader: LGBTQ+ athletes
change note: Version 4.2.0
has top concept: LGBTQ+ people
in scheme: v3
narrower: Non-binary basketball players

Two-Spirit photographers
type: Concept
issued: 2024-07-31
modified: 2025-02-23
comment: Two-Spirit people who take photographs, either professionally or as a hobby.
alternative label: 2S photographers
alternative label: Two Spirit photographers
alternative label: Two-Spirited photographers
broader: Two-Spirit artists
change note: Version 4.2.0
has top concept: Gender
in scheme: v3
related: LGBTQ+ photographers

Two-Spirit children's literature
type: Concept
issued: 2024-07-31
modified: 2025-02-23
comment: Written literary works for an audience of readers up to 12 years of age, also known as kid lit or juvenile literature. Use in reference to children's literature focusing on Two-Spirit characters or themes.
alternative label: 2S children's literature
alternative label: Two Spirit children's literature
alternative label: Two Spirited children's literature
alternative label: Two-Spirit juvenile literature
alternative label: Two-Spirit kid lit
alternative label: Two-Spirited children's literature
broader: Two-Spirit literature
change note: Version 4.2.0
has top concept: Two-Spirit literature
in scheme: v3
related: LGBTQ+ children's literature

Turkey baster babies
type: Concept
issued: 2024-07-31
modified: 2025-02-23
comment: Babies conceived through at-home artificial insemination, specifically by injecting semen into one's vagina using a turkey baster. There is an extensive history of at-home artificial insemination undertaken by LGBTQ+ people, including gay men contributing semen to aid lesbian couples in conceiving.
broader: Children
change note: Version 4.2.0
has top concept: Family members
in scheme: v3
related: Artificial insemination

Baihe
type: Concept
issued: 2024-07-31
modified: 2025-02-23
comment: A genre focusing on the romantic or sexual relationships between female characters in Chinese novels, comics, movies, animation, and dramas.
alternative label: Bǎihé
broader: Girls’ Love (Genre)
change note: Version 4.2.0
has top concept: Subcultures
in scheme: v3
related: Lesbian fiction

Sports bans
type: Concept
issued: 2024-07-31
modified: 2025-02-23
comment: Laws or policies instituted to prevent trans and non-binary individuals from participating in gendered sports leagues or competitions, typically to force players to compete as their sex assigned at birth rather than as their gender. This ranges from criminalizing schools and programs that allow trans and non-binary youth participation to banning players, particularly trans women, from competing in gendered leagues or competitions.
alternative label: Sport bans
broader: Anti-transgender legislation
change note: Version 4.2.0
has top concept: Law
in scheme: v3
related: Transgender athletes

Lavender linguistics
type: Concept
issued: 2024-07-31
modified: 2025-02-23
comment: The study of language as used by members of LGBTQ+ communities.
alternative label: LGBTQ+ linguistics
alternative label: Linguistics (LGBTQ)
broader: Theories
change note: Version 4.2.0
has top concept: Theories
in scheme: v3
related: LGBTQ+ slang

Queer linguistics
type: Concept
issued: 2024-07-31
modified: 2025-02-23
comment: A field of linguistics that analyzes the effect of heteronormativity on the expression of sexual identity through language.
broader: Theories
change note: Version 4.2.0
has top concept: Theories
in scheme: v3
related: LGBTQ+ slang

Two-Spirit archivists
type: Concept
issued: 2024-10-22
modified: 2025-02-23
comment: Two-Spirit people who assess, curate, manage, process, preserve, steward, and/or provide access to records and archives of enduring historical value.
alternative label: Two Spirit archivists
alternative label: Two Spirited archivists
alternative label: Two-Spirited archivists
alternative label: 2S archivists
broader: Two-Spirit information professionals
change note: Version 4.2.0
has top concept: Gender
in scheme: v3
related: LGBTQ+ archivists

Two-Spirit high school students
type: Concept
issued: 2024-10-22
modified: 2025-02-23
comment: Two-Spirit people who attend high school, generally consisting of grades 9-12 (sometimes referred to as freshman through senior year) with students between the ages of 14 and 18.
alternative label: 2S high school students
alternative label: Two Spirit high school students
alternative label: Two-Spirited high school students
alternative label: Two Spirited high school students
alternative label: 2S secondary school students
alternative label: Two Spirit secondary school students
alternative label: Two-Spirited secondary school students
alternative label: Two Spirited secondary school students
broader: Two-Spirit students
change note: Version 4.2.0
has top concept: Gender
in scheme: v3
related: LGBTQ+ high school students

Two-Spirit middle school students
type: Concept
issued: 2024-10-22
modified: 2025-02-23
comment: Two-Spirit people who attend middle school, generally consisting of grades 6 through 8 with students between the ages of 11 and 14.
alternative label: Two-Spirit junior high school students
alternative label: Two Spirit junior high school students
alternative label: Two Spirited junior high school students
alternative label: Two-Spirited junior high school students
alternative label: 2S junior high school students
alternative label: Two Spirit middle school students
alternative label: Two-Spirited middle school students
alternative label: Two Spirited middle school students
alternative label: 2S middle school students
broader: Two-Spirit students
change note: Version 4.2.0
has top concept: Gender
in scheme: v3
related: LGBTQ+ middle school students

Two-Spirit elementary school students
type: Concept
issued: 2024-10-22
modified: 2025-02-23
comment: Two-Spirit people who attend elementary school, generally consisting of grades k through 5 with students between the ages of 4 and 10.
alternative label: Two Spirit elementary school students
alternative label: Two Spirited elementary school students
alternative label: Two-Spirited elementary school students
alternative label: 2S elementary school students
alternative label: Two-Spirit primary school students
alternative label: Two Spirit primary school students
alternative label: Two Spirited primary school students
alternative label: Two-Spirited primary school students
alternative label: 2S primary school students
broader: Two-Spirit students
change note: Version 4.2.0
has top concept: Gender
in scheme: v3
related: LGBTQ+ elementary school students

Queerplatonic relationships
type: Concept
issued: 2024-10-22
modified: 2025-02-23
comment: A term that originated in aromantic and asexual spaces to describe committed intimate relationships between significant others that are not romantic in nature.
alternative label: QPR
alternative label: Queerplatonic partnerships
alternative label: QPP
broader: Relationship satisfaction
change note: Version 4.2.0
has top concept: Relationship satisfaction
in scheme: v3
related: LGBTQ+ platonic love

Black queer archives
type: Concept
issued: 2024-10-22
modified: 2025-02-23
comment: Collections of records and materials relating to Black queer people and communities, or collections of records and materials relating to Black people and communities that are curated, organized, and presented from a queer perspective. Can include a variety of organizations and institutions from community to government archives.
alternative label: Queer Black archives
broader: LGBTQ+ archives
change note: Version 4.2.0
has top concept: LGBTQ+ cultural heritage institutions
in scheme: v3
related: Black queer people

Two-Spirit librarians
type: Concept
issued: 2024-10-22
modified: 2025-02-23
comment: Two-Spirit people, typically with degrees in library science, who work, manage, or assist in a library setting.
alternative label: 2S librarians
alternative label: Two Spirit librarians
alternative label: Two-Spirited librarians
alternative label: Two Spirited librarians
broader: Two-Spirit information professionals
change note: Version 4.2.0
has top concept: Gender
in scheme: v3
related: LGBTQ+ librarians

Two-Spirit scientists
type: Concept
issued: 2024-10-22
modified: 2025-02-23
comment: Two-Spirit people who either study or have expert knowledge in one of the fields of the physical and/or natural sciences, including but not limited to chemists, biologists, physicists, psychologists, and multidisciplinary researchers.
alternative label: Two-Spirited scientists
alternative label: Two Spirit scientists
alternative label: 2S scientists
broader: Two-Spirit people
change note: Version 4.2.0
has top concept: Gender
in scheme: v3
related: LGBTQ+ scientists

Pride parades
type: Concept
issued: 2024-10-22
modified: 2025-04-17
comment: Processions of LGBTQ+ people and allies, usually organized along a public street, that recognize and celebrate LGBTQ+ people and culture. For political marches and rallies, use the term "LGBTQ+ demonstrations."
alternative label: LGBTQ+ pride parades
broader: Pride events
change note: Version 4.2.0
has top concept: Europride
in scheme: v3
related: LGBTQ+ demonstrations

LGBTQ+ superheroes
type: Concept
issued: 2024-10-22
modified: 2025-02-23
comment: Benevolent fictional characters who possess superhuman powers or abilities beyond those of ordinary people which they use to fight evil and help the public. Use to refer to superheroes who are explicitly identified as LGBTQ+ within their source material.
alternative label: Superheroes (LGBTQ)
alternative label: LGBTQ+ super heroes
alternative label: LGBTQ+ comic book heroes
alternative label: Super heroes (LGBTQ)
broader: LGBTQ+ characters
change note: Version 4.2.0
has top concept: LGBTQ+ characters
in scheme: v3
related: LGBTQ+ comics

LGBTQ+ supervillains
type: Concept
issued: 2024-10-22
modified: 2025-02-23
comment: Villainous fictional characters who possess superhuman powers or abilities beyond those of ordinary people which they use to do evil and harm the public. Use to refer to supervillains who are explicitly identified as LGBTQ+ within their source material.
alternative label: Supervillains (LGBTQ)
alternative label: LGBTQ+ super villains
alternative label: Super villains (LGBTQ)
alternative label: LGBTQ+ comic book villains
broader: LGBTQ+ characters
change note: Version 4.2.0
has top concept: LGBTQ+ characters
in scheme: v3
related: LGBTQ+ comics

LGBTQ+ video games
type: Concept
issued: 2024-10-22
modified: 2025-02-23
comment: Games played by electronically manipulating images produced by a computer program on a display screen. Use in reference to video games intended for LGBTQ+ audiences and/or focusing on LGBTQ+ characters or themes.
alternative label: Video games (LGBTQ)
alternative label: LGBTQ+ computer games
alternative label: Computer games (LGBTQ)
broader: LGBTQ+ arts
change note: Version 4.2.0
has top concept: Subcultures
in scheme: v3
related: Slash vidding

Two-Spirit poets
type: Concept
issued: 2024-10-22
modified: 2025-02-23
comment: Creators of written or spoken verse who identify as Two-Spirit.
alternative label: Two-Spirited poets
alternative label: Two Spirit poets
alternative label: Two Spirited poets
alternative label: 2S poets
broader: Two-Spirit authors
change note: Version 4.2.0
has top concept: Gender
in scheme: v3
related: LGBTQ+ poets

LGBTQ+ philanthropists
type: Concept
issued: 2024-10-23
modified: 2025-02-23
comment: LGBTQ+ people who seek to improve the welfare of others, especially by the donation of money or resources to charitable causes.
alternative label: Philanthropists (LGBTQ)
broader: LGBTQ+ people
change note: Version 4.2.0
has top concept: LGBTQ+ people
in scheme: v3
related: LGBTQ+ philanthropy

LGBTQ+ punks
type: Concept
issued: 2024-10-23
modified: 2025-02-23
comment: LGBTQ+ people involved in the punk community, which originated in the 1970s with punk rock music and is now associated with various music subgenres, fashions, and ideologies.
alternative label: Punks (LGBTQ)
broader: LGBTQ+ people
change note: Version 4.2.0
has top concept: LGBTQ+ people
in scheme: v3
related: LGBTQ+ punk community

Sensation play
type: Concept
issued: 2024-10-23
modified: 2025-02-23
comment: The act of engaging one's or one's partner(s) senses in various ways to heighten erotic pleasure.
alternative label: Sensual play
alternative label: Sensory play
broader: BDSM
broader: Sexual practices
change note: Version 4.2.0
has top concept: Eroticism
in scheme: v3

Two-Spirit film festivals
type: Concept
issued: 2024-10-23
modified: 2025-02-23
comment: Organized presentations of films in a single location, often with prizes awarded in various categories. Use in reference to film festivals focusing on films created by Two-Spirit people or featuring Two-Spirit characters and themes.
alternative label: Two Spirit film festivals
alternative label: Two-Spirited film festivals
alternative label: Two Spirited film festivals
alternative label: 2S film festivals
broader: Two-Spirit events
change note: Version 4.2.0
has top concept: Two-Spirit events
in scheme: v3
related: LGBTQ+ film festivals

Bear bars
type: Concept
issued: 2024-10-23
modified: 2025-02-23
comment: Drinking establishments that primarily cater to gay men who identify as bears, or hairy and large or muscular.
broader: Gay bars
change note: Version 4.2.0
has top concept: LGBTQ+ meeting places
in scheme: v3
related: Bears (Gay culture)

Dyke bars
type: Concept
issued: 2024-10-23
modified: 2025-02-23
comment: Drinking establishments that primarily cater to dykes. For establishments that cater to lesbians more broadly, use "Lesbian bars."
broader: Lesbian bars
change note: Version 4.2.0
has top concept: LGBTQ+ meeting places
in scheme: v3
related: Dykes

Two-Spirit documentaries
type: Concept
issued: 2024-10-23
modified: 2025-02-23
comment: Non-fictional films that center Two-Spirit people or topics, created for the purposes of education, advocacy, or personal expression.
alternative label: Two Spirit documentaries
alternative label: Two-Spirited documentaries
alternative label: Two Spirited documentaries
alternative label: 2S documentaries
alternative label: Two-Spirit documentary films
broader: Two-Spirit films
change note: Version 4.2.0
has top concept: Two-Spirit films
in scheme: v3
related: LGBTQ+ documentaries

Clit twisting
type: Concept
issued: 2024-10-23
modified: 2025-02-23
comment: Twisting or squeezing the clitoris to induce sexual pleasure.
alternative label: Clitoris twisting
broader: Clitoral sex
change note: Version 4.2.0
has top concept: Sex (Act)
in scheme: v3
related: Clitoris

Sex trafficking
type: Concept
issued: 2024-10-30
modified: 2025-02-23
comment: Human trafficking for the purpose of sexual exploitation, including recruiting, holding, moving, defrauding, and/or coercing people into engaging in sexual services and performances they cannot or have not meaningfully consented to.
alternative label: Coerced sex work
alternative label: Forced sex work
alternative label: Non-consensual sex work
alternative label: Coerced prostitution
alternative label: Forced prostitution
alternative label: Non-consensual prostitution
broader: Human trafficking
change note: Version 4.2.0
has top concept: Human trafficking
in scheme: v3
related: Sex work

LGBTQ+ survivors of human trafficking
type: Concept
issued: 2024-10-30
modified: 2025-02-23
comment: LGBTQ+ people who have experienced and survived human trafficking. Follow the individual's preference for "victims" or "survivors" whenever possible.
alternative label: Survivors of human trafficking (LGBTQ)
alternative label: LGBTQ+ trafficking survivors
alternative label: Trafficking survivors (LGBTQ)
broader: LGBTQ+ victims of human trafficking
change note: Version 4.2.0
has top concept: LGBTQ+ people
in scheme: v3
related: Two-Spirit survivors of human trafficking

Two-Spirit survivors of human trafficking
type: Concept
issued: 2024-10-30
modified: 2025-02-23
comment: Two-Spirit people who have experienced and survived human trafficking. Follow the individual's preference for "victims" or "survivors" whenever possible.
alternative label: Two Spirit survivors of human trafficking
alternative label: Two-Spirited survivors of human trafficking
alternative label: Two Spirited survivors of human trafficking
alternative label: 2S survivors of human trafficking
alternative label: Two-Spirit human trafficking survivors
broader: Two-Spirit victims of human trafficking
change note: Version 4.2.0
has top concept: Gender
in scheme: v3
related: LGBTQ+ survivors of human trafficking

LGBTQ+ survivors of sex trafficking
type: Concept
issued: 2024-10-30
modified: 2025-02-23
comment: LGBTQ+ people who have experienced and survived sex trafficking. Follow the individual's preference for "victims" or "survivors" whenever possible.
alternative label: Survivors of sex trafficking (LGBTQ)
alternative label: LGBTQ+ sex trafficking survivors
alternative label: Sex trafficking survivors (LGBTQ)
broader: LGBTQ+ victims of sex trafficking
change note: Version 4.2.0
has top concept: LGBTQ+ people
in scheme: v3
related: Two-Spirit survivors of sex trafficking

Two-Spirit survivors of sex trafficking
type: Concept
issued: 2024-10-30
modified: 2025-02-23
comment: Two-Spirit people who have experienced and survived sex trafficking. Follow the individual's preference for "victims" or "survivors" whenever possible.
alternative label: Two Spirit survivors of sex trafficking
alternative label: Two-Spirited survivors of sex trafficking
alternative label: Two Spirited survivors of sex trafficking
alternative label: 2S survivors of sex trafficking
alternative label: Two-Spirit sex trafficking survivors
broader: Two-Spirit victims of sex trafficking
change note: Version 4.2.0
has top concept: Gender
in scheme: v3
related: LGBTQ+ survivors of sex trafficking

LGBTQ+ survivors of labor trafficking
type: Concept
issued: 2024-10-30
modified: 2025-02-23
comment: LGBTQ+ people who have experienced and survived labor trafficking. Follow the individual's preference for "victims" or "survivors" whenever possible.
alternative label: Survivors of labor trafficking (LGBTQ)
alternative label: LGBTQ+ labor trafficking survivors
alternative label: Labor trafficking survivors (LGBTQ)
broader: LGBTQ+ victims of labor trafficking
change note: Version 4.2.0
has top concept: LGBTQ+ people
in scheme: v3
preferred label: LGBTQ+ survivors of labour trafficking
related: Two-Spirit survivors of labor trafficking

Two-Spirit survivors of labor trafficking
type: Concept
issued: 2024-10-30
modified: 2025-02-23
comment: Two-Spirit people who have experienced and survived labor trafficking. Follow the individual's preference for "victims" or "survivors" whenever possible.
alternative label: Two Spirit survivors of labor trafficking
alternative label: Two-Spirited survivors of labor trafficking
alternative label: Two Spirited survivors of labor trafficking
alternative label: 2S survivors of labor trafficking
alternative label: Two-Spirit labor trafficking survivors
broader: Two-Spirit victims of labor trafficking
change note: Version 4.2.0
has top concept: Gender
in scheme: v3
preferred label: Two-Spirit survivors of labour trafficking
related: LGBTQ+ survivors of labor trafficking

Phone sex work
type: Concept
issued: 2024-10-30
modified: 2025-02-23
comment: Real-time sex work via phone calls, text messaging, or online voice calls. Use "Cam modeling" for real-time sex work via online video calls and livestreams.
alternative label: Telephone sex work
broader: Sex work
change note: Version 4.2.0
has top concept: Sex industry
in scheme: v3
related: Phone sex workers

Stripping
type: Concept
issued: 2024-10-30
modified: 2025-02-23
comment: A form of sex work that involves undressing to music while using a pole to perform dance moves, whether in a venue like a strip club or by hire at private parties. Stripping may also be performed by amateurs in private settings.
alternative label: Pole dancing
alternative label: Pole-dancing
alternative label: Peeling
alternative label: Stripteasing
alternative label: Exotic dancing
broader: Sex work
change note: Version 4.2.0
has top concept: Sex industry
in scheme: v3
related: Strippers

SWERFs
type: Concept
issued: 2024-10-30
modified: 2025-02-23
comment: An acronym for "sex work-exclusionary radical feminists," this term refers to people who subscribe to a subset of radical feminism that rejects sex worker rights and solidarity with sex workers under the belief that sex work is antithetical to their ideology and inherently perpetuates oppression against women.
alternative label: Sex work exclusionary radical feminists
alternative label: Sex worker exclusionary radical feminists
broader: Radical feminists
change note: Version 4.2.0
has top concept: Feminists
in scheme: v3
related: Anti-sex work feminism

Cam modeling
type: Concept
issued: 2024-10-30
modified: 2025-02-23
comment: Short for "webcam modeling," this term refers to real-time sex work via online video calls and livestreams.
alternative label: Camming
alternative label: Webcam modeling
broader: Sex work
change note: Version 4.2.0
has top concept: Sex industry
in scheme: v3
related: Cam models

Curb crawling
type: Concept
issued: 2024-10-30
modified: 2025-02-23
comment: The practice of driving or idling in one's car around areas known for street sex work in order to solicit sex workers.
broader: Solicitation of sex work
change note: Version 4.2.0
has top concept: Solicitation of sex work
in scheme: v3
preferred label: Kerb crawling
related: Sex workers' clients

Erotic massage businesses
type: Concept
issued: 2024-10-30
modified: 2025-02-23
comment: Massage businesses that provide sexual services, either legally or under the table.
alternative label: Sexual massage parlors
alternative label: Rub and tug massage parlors
alternative label: Full service massage parlors
alternative label: Erotic massage parlors
broader: Sex industry
change note: Version 4.2.0
has top concept: Sex industry
in scheme: v3
related: Erotic massage

Red light districts
type: Concept
issued: 2024-10-30
modified: 2025-05-28
comment: Areas designated (often but not always legally) for the practice and solicitation of sex work.
alternative label: Red-light districts
alternative label: Pleasure districts
broader: Sex industry
change note: Version 4.2.0
has top concept: Sex industry
in scheme: v3
narrower: Sex drive-ins

Sex workers of color
type: Concept
issued: 2024-10-30
modified: 2025-02-23
comment: Sex workers who are not white and self-identify as people of color.
alternative label: People of color sex workers
alternative label: Racialized sex workers
alternative label: Non-white sex workers
broader: Sex workers
change note: Version 4.2.0
has top concept: Sex workers
in scheme: v3
preferred label: Sex workers of colour
related: LGBTQ+ people of color

Two-Spirit pornography
type: Concept
issued: 2024-10-30
modified: 2025-02-23
comment: Printed or visual materials that explicitly depict sexual acts. Use in reference to pornography featuring Two-Spirit performers and/or made for Two-Spirit people.
alternative label: 2S pornography
alternative label: Two-Spirited pornography
alternative label: Two Spirited pornography
alternative label: Two Spirit pornography
change note: Version 4.2.0
in scheme: v3
related: LGBTQ+ pornography

Binders (Chest)
type: Concept
issued: 2024-11-27
modified: 2025-02-23
comment: Tight-fitting shirts, straps, or similar materials worn to flatten or conceal the chest area, often by transgender men and transmasculine people.
alternative label: Chest binders
broader: Clothing
change note: Version 4.2.0
has top concept: Gender
in scheme: v3
related: Binding (Chest)

Queer bodies
type: Concept
issued: 2024-12-12
modified: 2025-02-23
comment: Bodies that resist definition by defying social norms such as heteronormativity, cisnormativity, and other forms of essentialism, regardless of the individual's identity.
alternative label: Queered bodies
broader: Queer theory
change note: Version 4.2.0
has top concept: Theories
in scheme: v3
related: Queer people

Two-Spirit organizations
type: Concept
issued: 2024-12-12
modified: 2025-02-23
comment: Groups or clubs of Two-Spirit people dedicated to a particular interest or activity.
alternative label: Two-Spirit groups
alternative label: Two-Spirited organizations
alternative label: Two-Spirited groups
alternative label: Two Spirit groups
alternative label: Two Spirit organizations
alternative label: Two Spirited groups
alternative label: Two Spirited organizations
alternative label: 2S groups
alternative label: 2S organizations
change note: Version 4.2.0
in scheme: v3
preferred label: Two-Spirit organisations
related: LGBTQ+ clubs and organizations

PVC (Erotic)
type: Concept
issued: 2025-01-09
modified: 2025-02-23
comment: Short for polyvinal chloride, PVC is a material commonly used in fetish fashion and for inflatables.
alternative label: Polyvinal chloride (Erotic)
broader: BDSM
broader: LGBTQ+ fashion
change note: Version 4.2.0
has top concept: Eroticism
in scheme: v3

Interviews with Two-Spirit people
type: Concept
issued: 2025-02-27
modified: 2025-04-29
comment: Structured conversations in which one participant asks questions and the other(s) provide answers. Use to refer to interviews with Two-Spirit subjects recorded in print, radio, television, etc.
alternative label: Two-Spirit interviews
alternative label: Interviews with Two Spirit people
alternative label: Interviews with Two-Spirited people
alternative label: Interviews with Two Spirited people
alternative label: Interviews with 2S people
change note: Version 4.2.0
in scheme: v4
related: Interviews with LGBTQ+ people

Lesbians' writings
type: Concept
issued: 2025-03-13
modified: 2025-03-13
comment: Written works created by lesbians.
alternative label: Writings of lesbians
broader: LGBTQ+ people's writings
change note: Version 4.2.0
has top concept: Subcultures
in scheme: v4
related: Lesbian authors

Gay men's writings
type: Concept
issued: 2025-03-13
modified: 2025-03-13
comment: Written works created by gay men.
alternative label: Writings of gay men
broader: LGBTQ+ people's writings
change note: Version 4.2.0
has top concept: Subcultures
in scheme: v4
related: Gay authors

Bisexual people's writings
type: Concept
issued: 2025-03-13
modified: 2025-03-13
comment: Written works created by bisexual people.
alternative label: Writings of bisexual people
broader: LGBTQ+ people's writings
change note: Version 4.2.0
has top concept: Subcultures
in scheme: v4
related: Bisexual authors

Queer people's writings
type: Concept
issued: 2025-03-13
modified: 2025-03-13
comment: Written works created by queer people.
alternative label: Writings of queer people
broader: LGBTQ+ people's writings
change note: Version 4.2.0
has top concept: Subcultures
in scheme: v4
related: Queer authors

Intersex people's writings
type: Concept
issued: 2025-03-13
modified: 2025-03-13
comment: Written works created by intersex people.
alternative label: Writings of intersex people
broader: LGBTQ+ people's writings
change note: Version 4.2.0
has top concept: Subcultures
in scheme: v4
related: Intersex authors

Non-binary people's writings
type: Concept
issued: 2025-03-13
modified: 2025-03-13
comment: Written works created by non-binary people.
alternative label: Nonbinary people's writings
alternative label: Writings of non-binary people
alternative label: Writings of nonbinary people
broader: LGBTQ+ people's writings
change note: Version 4.2.0
has top concept: Subcultures
in scheme: v4
related: Non-binary authors

Asexual people's writings
type: Concept
issued: 2025-03-13
modified: 2025-03-13
comment: Written works created by asexual people.
alternative label: Writings of asexual people
broader: LGBTQ+ people's writings
change note: Version 4.2.0
has top concept: Subcultures
in scheme: v4
related: Asexual authors

Aromantic people's writings
type: Concept
issued: 2025-03-13
modified: 2025-03-13
comment: Written works created by aromantic people.
alternative label: Writings of aromantic people
broader: LGBTQ+ people's writings
change note: Version 4.2.0
has top concept: Subcultures
in scheme: v4
related: Aromantic authors

Demisexual people's writings
type: Concept
issued: 2025-03-13
modified: 2025-03-13
comment: Written works created by demisexual people.
alternative label: Writings of demisexual people
broader: LGBTQ+ people's writings
change note: Version 4.2.0
has top concept: Subcultures
in scheme: v4
related: Demisexual authors

Greyromantic people's writings
type: Concept
issued: 2025-03-13
modified: 2025-03-13
comment: Written works created by greyromantic people.
alternative label: Writings of greyromantic people
broader: LGBTQ+ people's writings
change note: Version 4.2.0
has top concept: Subcultures
in scheme: v4
related: Greyromantic authors

Megasexual people's writings
type: Concept
issued: 2025-03-13
modified: 2025-03-13
comment: Written works created by megasexual people.
alternative label: Writings of megasexual people
broader: LGBTQ+ people's writings
change note: Version 4.2.0
has top concept: Subcultures
in scheme: v4
related: Megasexual authors

Two-Spirit cartoonists
type: Concept
issued: 2025-03-13
modified: 2025-03-13
comment: Two-Spirit people who draw cartoons, comics, or graphic novels.
alternative label: Two-Spirit comics creators
alternative label: Two-Spirit cartoon artists
alternative label: Two-Spirited cartoonists
alternative label: Two Spirit cartoonists
alternative label: Two Spirited cartoonists
alternative label: 2S cartoonists
broader: Two-Spirit artists
change note: Version 4.2.0
has top concept: Gender
in scheme: v4
related: LGBTQ+ cartoonists

Lesbian celebrities
type: Concept
issued: 2025-03-20
modified: 2025-04-23
comment: Lesbians who have achieved fame and broad public recognition due to the attention given to them by mass media.
alternative label: Lesbian celebs
alternative label: Famous lesbians
alternative label: Lesbian famous people
broader: LGBTQ+ celebrities
change note: Version 4.2.0
has top concept: LGBTQ+ people
in scheme: v4
related: Lesbians in mass media

Gay celebrities
type: Concept
issued: 2025-03-20
modified: 2025-04-23
comment: Gay men who have achieved fame and broad public recognition due to the attention given to them by mass media.
alternative label: Gay celebs
alternative label: Famous gay men
alternative label: Gay famous men
broader: LGBTQ+ celebrities
change note: Version 4.2.0
has top concept: LGBTQ+ people
in scheme: v4
related: Gay men in mass media

Bisexual celebrities
type: Concept
issued: 2025-03-20
modified: 2025-04-23
comment: Bisexual people who have achieved fame and broad public recognition due to the attention given to them by mass media.
alternative label: Bisexual celebs
alternative label: Famous bisexual people
alternative label: Bisexual famous people
broader: LGBTQ+ celebrities
change note: Version 4.2.0
has top concept: LGBTQ+ people
in scheme: v4
related: Bisexual people in mass media

Transgender celebrities
type: Concept
issued: 2025-03-20
modified: 2025-04-23
comment: Trans people who have achieved fame and broad public recognition due to the attention given to them by mass media.
alternative label: Transgender celebs
alternative label: Famous transgender people
alternative label: Transgender famous people
alternative label: Trans celebrities
alternative label: Trans celebs
alternative label: Famous trans people
alternative label: Trans famous people
broader: LGBTQ+ celebrities
change note: Version 4.2.0
has top concept: LGBTQ+ people
in scheme: v4
related: Transgender people in mass media

Queer celebrities
type: Concept
issued: 2025-03-20
modified: 2025-04-23
comment: Queer people who have achieved fame and broad public recognition due to the attention given to them by mass media.
alternative label: Queer celebs
alternative label: Famous queer people
alternative label: Queer famous people
broader: LGBTQ+ celebrities
change note: Version 4.2.0
has top concept: LGBTQ+ people
in scheme: v4
related: Queer people in mass media

Non-binary celebrities
type: Concept
issued: 2025-03-20
modified: 2025-04-23
comment: Non-binary people who have achieved fame and broad public recognition due to the attention given to them by mass media.
alternative label: Non-binary celebs
alternative label: Famous non-binary people
alternative label: Non-binary famous people
alternative label: Nonbinary celebrities
alternative label: Nonbinary celebs
alternative label: Famous nonbinary people
alternative label: Nonbinary famous people
broader: LGBTQ+ celebrities
change note: Version 4.2.0
has top concept: LGBTQ+ people
in scheme: v4
related: Non-binary people in mass media

Intersex celebrities
type: Concept
issued: 2025-03-20
modified: 2025-04-23
comment: Intersex people who have achieved fame and broad public recognition due to the attention given to them by mass media.
alternative label: Intersex celebs
alternative label: Famous intersex people
alternative label: Intersex famous people
broader: LGBTQ+ celebrities
change note: Version 4.2.0
has top concept: LGBTQ+ people
in scheme: v4
related: Intersex people in mass media

PEP (HIV)
type: Concept
issued: 2025-03-20
modified: 2025-03-20
comment: Medication taken after a possible exposure to HIV to prevent infection.
alternative label: Post-exposure prophylaxis (HIV)
alternative label: HIV PEP
alternative label: HIV post-exposure prophylaxis
broader: Medication
change note: Version 4.2.0
has top concept: Medical care
in scheme: v4
related: HIV/AIDS

Two-Spirit survival guides
type: Concept
issued: 2025-03-20
modified: 2025-03-20
comment: Written publications designed to support Two-Spirit people by sharing common advice and community knowledge.
alternative label: Two Spirit survival guides
alternative label: Two-Spirited survival guides
alternative label: Two Spirited survival guides
alternative label: 2S survival guides
broader: Two-Spirit literature
change note: Version 4.2.0
has top concept: Two-Spirit literature
in scheme: v4
related: LGBTQ+ survival guides

Two-Spirit journalists
type: Concept
issued: 2025-03-26
modified: 2025-04-29
comment: Two-Spirit people who gather information in the form of text, audio, or pictures, process it into a newsworthy form, and disseminate it to the public.
alternative label: Two Spirit journalists
alternative label: Two-Spirited journalists
alternative label: Two Spirited journalists
alternative label: 2S journalists
broader: Two-Spirit people
change note: Version 4.2.0
has top concept: Gender
in scheme: v4
related: LGBTQ+ journalists

Lesbians with breast cancer
type: Concept
issued: 2025-03-26
modified: 2025-04-29
comment: Lesbians who have been diagnosed with breast cancer, whether or not they are currently undergoing treatment. This term can also be used to refer to the particular challenges lesbians and/or their partners face in obtaining cancer treatment due to discrimination.
alternative label: Lesbian breast cancer patients
broader: Lesbians
change note: Version 4.2.0
has top concept: LGBTQ+ people
in scheme: v4
related: Health care for LGBTQ+ people

LGBTQ+ journalism
type: Concept
issued: 2025-03-26
modified: 2025-04-29
comment: The collection and editing of news for presentation through mass media, including interviewing subjects, writing and publishing articles, recording and broadcasting news, etc. Use to refer to journalism created by or focusing on LGBTQ+ communities.
alternative label: Journalism (LGBTQ)
broader: LGBTQ+ press
change note: Version 4.2.0
has top concept: LGBTQ+ press
in scheme: v4
related: LGBTQ+ journalists

Gay demonstrations
type: Concept
issued: 2025-04-17
modified: 2025-04-17
comment: Marches, rallies, and other large, public gatherings organized to protest discrimination against gay men and advocate for gay visibility, rights, and issues.
alternative label: Gay marches
alternative label: Gay rallies
alternative label: Gay protests
broader: LGBTQ+ demonstrations
change note: Version 4.2.0
has top concept: LGBTQ+ activism
in scheme: v4
related: Gay movement

Bisexual demonstrations
type: Concept
issued: 2025-04-17
modified: 2025-04-17
comment: Marches, rallies, and other large, public gatherings organized to protest discrimination against bisexual people and advocate for bisexual visibility, rights, and issues.
alternative label: Bisexual marches
alternative label: Bisexual rallies
alternative label: Bisexual protests
broader: LGBTQ+ demonstrations
change note: Version 4.2.0
has top concept: LGBTQ+ activism
in scheme: v4
related: Bisexual movement

Queer demonstrations
type: Concept
issued: 2025-04-23
modified: 2025-04-23
comment: Marches, rallies, and other large, public gatherings organized to protest discrimination against queer people and advocate for queer visibility, rights, and issues.
alternative label: Queer marches
alternative label: Queer rallies
alternative label: Queer protests
broader: LGBTQ+ demonstrations
change note: Version 4.2.0
has top concept: LGBTQ+ activism
in scheme: v4
related: Queer movement

Intersex demonstrations
type: Concept
issued: 2025-04-23
modified: 2025-04-23
comment: Marches, rallies, and other large, public gatherings organized to protest discrimination against intersex people and advocate for intersex visibility, rights, and issues.
alternative label: Intersex marches
alternative label: Intersex rallies
alternative label: Intersex protests
broader: LGBTQ+ demonstrations
change note: Version 4.2.0
has top concept: LGBTQ+ activism
in scheme: v4
related: Intersex movement

Two-Spirit pride
type: Concept
issued: 2025-04-23
modified: 2025-04-23
comment: The recognition and celebration of Two-Spirit people and culture, thereby affirming the visibility, dignity, and diversity of Two-Spirit communities.
alternative label: Two Spirit pride
alternative label: Two-Spirited pride
alternative label: Two Spirited pride
alternative label: 2S pride
change note: Version 4.2.0
in scheme: v4
related: LGBTQ+ pride

Two-Spirit dancers
type: Concept
issued: 2025-04-23
modified: 2025-04-23
comment: Two-Spirit people who dance, either professionally or as a hobby.
alternative label: Two Spirit dancers
alternative label: Two-Spirited dancers
alternative label: Two Spirited dancers
alternative label: 2S dancers
broader: Two-Spirit people
change note: Version 4.2.0
has top concept: Gender
in scheme: v4
related: LGBTQ+ dancers

Two-Spirit makeup artists
type: Concept
issued: 2025-04-23
modified: 2025-04-23
comment: Two-Spirit people who apply makeup and/or prosthetics on themselves or others, either professionally or as a hobby.
alternative label: Two Spirit makeup artists
alternative label: Two-Spirited makeup artists
alternative label: Two Spirited makeup artists
alternative label: 2S makeup artists
broader: Two-Spirit artists
change note: Version 4.2.0
has top concept: Gender
in scheme: v4
related: LGBTQ+ makeup artists

Warmipangui
type: Concept
issued: 2025-04-23
modified: 2025-04-23
comment: Amongst the Canelos-Quichua, one of the indigenous Kichwa peoples of the Ecuadorian Amazon, this term is used to refer to people who were assigned male at birth but have the ability to transition between feminine and masculine.
broader: Non-Euro-American gender and sexual identities
change note: Version 4.2.0
has top concept: Gender
in scheme: v4
related: South American Indigenous LGBTQ+ people

Crip time
type: Concept
issued: 2025-04-23
modified: 2025-04-23
comment: Term used to describe the ways in which disabled and chronically ill people experience and relate to time differently than is socially expected. According to Alison Kafer, quoted in a paper published by Ellen Samuels, "rather than bend disabled bodies and minds to meet the clock, crip time bends the clock to meet disabled bodies and minds."
alternative label: Crip temporality
broader: Crip
change note: Version 4.2.0
has top concept: LGBTQ+ slang
in scheme: v4
related: Chrononormativity

Queer time
type: Concept
issued: 2025-04-23
modified: 2025-04-23
comment: Term used to describe the ways in which queer people experience and relate to time differently than is socially expected. This may include delayed or non-linear development before coming out, disrupted life trajectories, and a sense of impending mortality, particularly during the AIDS epidemic.
alternative label: Queer temporality
broader: Queer theory
change note: Version 4.2.0
has top concept: Theories
in scheme: v4
related: Chrononormativity

White time
type: Concept
issued: 2025-04-23
modified: 2025-04-23
comment: Term used to describe the racialization of time in a white supremacist society, which results in unequal temporal access to institutions, resources, power, etc. This term also references the ways in which non-white people are expected to conform to specific, linear patterns over time, as well as the calculation of time and history through white, Western expectations for progress and productivity.
alternative label: White temporality
alternative label: White temporal imaginary
alternative label: Racialization of time
alternative label: Racial time
broader: Chrononormativity
change note: Version 4.2.0
has top concept: Social norms
in scheme: v4
related: Critical race theory

Lesbians in visual art
type: Concept
issued: 2025-04-23
modified: 2025-04-23
comment: The depiction of lesbians and lesbian communities in visual art, including painting, performance art, sculpture, photography, cinema, etc.
alternative label: Lesbians in art
broader: LGBTQ+ people in visual art
change note: Version 4.2.0
has top concept: LGBTQ+ people
in scheme: v4
related: Lesbian art

Gay men in visual art
type: Concept
issued: 2025-04-23
modified: 2025-04-23
comment: The depiction of gay men and gay communities in visual art, including painting, performance art, sculpture, photography, cinema, etc.
alternative label: Gay men in art
broader: LGBTQ+ people in visual art
change note: Version 4.2.0
has top concept: LGBTQ+ people
in scheme: v4
related: Gay art

Bisexual people in visual art
type: Concept
issued: 2025-04-23
modified: 2025-04-23
comment: The depiction of bisexual people and communities in visual art, including painting, performance art, sculpture, photography, cinema, etc.
alternative label: Bi people in visual art
alternative label: Bisexual people in art
alternative label: Bi people in art
broader: LGBTQ+ people in visual art
change note: Version 4.2.0
has top concept: LGBTQ+ people
in scheme: v4
related: Bisexual art

Transgender people in visual art
type: Concept
issued: 2025-04-23
modified: 2025-04-23
comment: The depiction of trans people and communities in visual art, including painting, performance art, sculpture, photography, cinema, etc.
alternative label: Trans people in visual art
alternative label: Transgender people in art
alternative label: Trans people in art
broader: LGBTQ+ people in visual art
change note: Version 4.2.0
has top concept: LGBTQ+ people
in scheme: v4
related: Transgender art

Queer people in visual art
type: Concept
issued: 2025-04-23
modified: 2025-04-23
comment: The depiction of queer people and communities in visual art, including painting, performance art, sculpture, photography, cinema, etc.
alternative label: Queer people in art
broader: LGBTQ+ people in visual art
change note: Version 4.2.0
has top concept: LGBTQ+ people
in scheme: v4
related: Queer art

Intersex people in visual art
type: Concept
issued: 2025-04-23
modified: 2025-04-23
comment: The depiction of intersex people and communities in visual art, including painting, performance art, sculpture, photography, cinema, etc.
alternative label: Intersex people in art
broader: LGBTQ+ people in visual art
change note: Version 4.2.0
has top concept: LGBTQ+ people
in scheme: v4
related: Intersex art

Lesbians in mass media
type: Concept
issued: 2025-04-23
modified: 2025-04-23
comment: The depiction of lesbians in various means of communication that reach large audiences simultaneously, including newspapers, television, radio, advertisements, and the internet.
alternative label: Lesbians in media
broader: LGBTQ+ people in mass media
change note: Version 4.2.0
has top concept: LGBTQ+ people
in scheme: v4
related: Lesbian celebrities

Gay men in mass media
type: Concept
issued: 2025-04-23
modified: 2025-04-23
comment: The depiction of gay men in various means of communication that reach large audiences simultaneously, including newspapers, television, radio, advertisements, and the internet.
alternative label: Gay men in media
broader: LGBTQ+ people in mass media
change note: Version 4.2.0
has top concept: LGBTQ+ people
in scheme: v4
related: Gay celebrities

Bisexual people in mass media
type: Concept
issued: 2025-04-23
modified: 2025-04-23
comment: The depiction of bisexual people in various means of communication that reach large audiences simultaneously, including newspapers, television, radio, advertisements, and the internet.
alternative label: Bi people in mass media
alternative label: Bisexual people in media
alternative label: Bi people in media
broader: LGBTQ+ people in mass media
change note: Version 4.2.0
has top concept: LGBTQ+ people
in scheme: v4
related: Bisexual celebrities

Transgender people in mass media
type: Concept
issued: 2025-04-23
modified: 2025-04-23
comment: The depiction of trans people in various means of communication that reach large audiences simultaneously, including newspapers, television, radio, advertisements, and the internet.
alternative label: Trans people in mass media
alternative label: Transgender people in media
alternative label: Trans people in media
broader: LGBTQ+ people in mass media
change note: Version 4.2.0
has top concept: LGBTQ+ people
in scheme: v4
related: Transgender celebrities

Queer people in mass media
type: Concept
issued: 2025-04-23
modified: 2025-04-23
comment: The depiction of queer people in various means of communication that reach large audiences simultaneously, including newspapers, television, radio, advertisements, and the internet.
alternative label: Queer people in media
broader: LGBTQ+ people in mass media
change note: Version 4.2.0
has top concept: LGBTQ+ people
in scheme: v4
related: Queer celebrities

Intersex people in mass media
type: Concept
issued: 2025-04-23
modified: 2025-04-23
comment: The depiction of intersex people in various means of communication that reach large audiences simultaneously, including newspapers, television, radio, advertisements, and the internet.
alternative label: Intersex people in media
broader: LGBTQ+ people in mass media
change note: Version 4.2.0
has top concept: LGBTQ+ people
in scheme: v4
related: Intersex celebrities

Non-binary people in mass media
type: Concept
issued: 2025-04-23
modified: 2025-04-23
comment: The depiction of non-binary people in various means of communication that reach large audiences simultaneously, including newspapers, television, radio, advertisements, and the internet.
alternative label: Nonbinary people in mass media
alternative label: Non-binary people in media
alternative label: Nobinary people in media
broader: LGBTQ+ people in mass media
change note: Version 4.2.0
has top concept: LGBTQ+ people
in scheme: v4
related: Non-binary celebrities

Lesbians in literature
type: Concept
issued: 2025-04-23
modified: 2025-04-23
comment: The depiction of lesbians in literature.
broader: LGBTQ+ people in literature
change note: Version 4.2.0
has top concept: LGBTQ+ people
in scheme: v4
related: Lesbian literature

Gay men in literature
type: Concept
issued: 2025-04-23
modified: 2025-04-23
comment: The depiction of gay men in literature.
broader: LGBTQ+ people in literature
change note: Version 4.2.0
has top concept: LGBTQ+ people
in scheme: v4
related: Gay literature

Bisexual people in literature
type: Concept
issued: 2025-04-23
modified: 2025-04-23
comment: The depiction of bisexual people in literature.
alternative label: Bi people in literature
broader: LGBTQ+ people in literature
change note: Version 4.2.0
has top concept: LGBTQ+ people
in scheme: v4
related: Bisexual literature

Transgender people in literature
type: Concept
issued: 2025-04-23
modified: 2025-04-23
comment: The depiction of trans people in literature.
alternative label: Trans people in literature
broader: LGBTQ+ people in literature
change note: Version 4.2.0
has top concept: LGBTQ+ people
in scheme: v4
related: Transgender literature

Queer people in literature
type: Concept
issued: 2025-04-23
modified: 2025-04-23
comment: The depiction of queer people in literature.
broader: LGBTQ+ people in literature
change note: Version 4.2.0
has top concept: LGBTQ+ people
in scheme: v4
related: Queer literature

Intersex people in literature
type: Concept
issued: 2025-04-23
modified: 2025-04-23
comment: The depiction of intersex people in literature.
broader: LGBTQ+ people in literature
change note: Version 4.2.0
has top concept: LGBTQ+ people
in scheme: v4
related: Intersex literature

Two-Spirit people practicing sobriety
type: Concept
issued: 2025-04-24
modified: 2025-04-24
comment: Two-Spirit people intentionally refraining from substance use (typically drugs or alcohol). Follow the individual's preference for "sobriety" or "recovery" whenever possible.
alternative label: Two-Spirit sober people
alternative label: Two Spirit people practicing sobriety
alternative label: Two-Spirited people practicing sobriety
alternative label: Two Spirited people practicing sobriety
alternative label: 2S people practicing sobriety
broader: Two-Spirit people
change note: Version 4.2.0
has top concept: Gender
in scheme: v4
related: Sobriety

Two-Spirit people in recovery
type: Concept
issued: 2025-04-24
modified: 2025-04-24
comment: Two-Spirit people currently in recovery from use disorders, conditions, or addictions. Follow the individual's preference for "recovery" or "sobriety" whenever possible.
alternative label: Two Spirit people in recovery
alternative label: Two-Spirited people in recovery
alternative label: Two Spirited people in recovery
alternative label: 2S people practicing in recovery
broader: Two-Spirit people
change note: Version 4.2.0
has top concept: Gender
in scheme: v4
related: LGBTQ+ people in recovery

Two-Spirit people in recovery groups
type: Concept
issued: 2025-04-24
modified: 2025-04-24
comment: Two-Spirit people who are members of recovery groups, or voluntary associations of people in recovery from use disorders, conditions, or addictions.
alternative label: Two Spirit people in recovery groups
alternative label: Two-Spirited people in recovery groups
alternative label: Two Spirited people in recovery groups
alternative label: 2S people practicing in recovery groups
broader: Two-Spirit people
change note: Version 4.2.0
has top concept: Gender
in scheme: v4
related: LGBTQ+ people in Adult Children of Alcoholics

Māhū historical fiction
type: Concept
issued: 2026-02-23
modified: 2026-02-23
comment: Written works of fiction in which the plot takes place in the setting of particular real historical events; use in reference to historical fiction focusing on māhū characters or themes.
alternative label: Mahu historical fiction
broader: Māhū fiction
change note: Version 4.2.0
has top concept: Māhū fiction
in scheme: v4
related: LGBTQ+ historical fiction

Two-Spirit historical fiction
type: Concept
issued: 2026-02-23
modified: 2026-02-23
comment: Written works of fiction in which the plot takes place in the setting of particular real historical events; use in reference to historical fiction focusing on Two-Spirit characters or themes.
alternative label: 2S historical fiction
alternative label: Two Spirit historical fiction
alternative label: Two Spirited historical fiction
alternative label: Two-Spirited historical fiction
broader: Two-Spirit fiction
change note: Version 4.2.0
has top concept: Two-Spirit literature
in scheme: v4
related: LGBTQ+ historical fiction

Asexual historical fiction
type: Concept
issued: 2026-02-23
modified: 2026-02-23
comment: Written works of fiction in which the plot takes place in the setting of particular real historical events; use in reference to historical fiction focusing on asexual characters or themes.
alternative label: Ace historical fiction
broader: Asexual fiction
broader: LGBTQ+ historical fiction
change note: Version 4.2.0
has top concept: Subcultures
in scheme: v4

Bisexual historical fiction
type: Concept
issued: 2026-02-23
modified: 2026-02-23
comment: Written works of fiction in which the plot takes place in the setting of particular real historical events; use in reference to historical fiction focusing on bisexual characters or themes.
alternative label: Bi historical fiction
broader: Bisexual fiction
broader: LGBTQ+ historical fiction
change note: Version 4.2.0
has top concept: Subcultures
in scheme: v4

Gay historical fiction
type: Concept
issued: 2026-02-23
modified: 2026-02-23
comment: Written works of fiction in which the plot takes place in the setting of particular real historical events; use in reference to historical fiction focusing on gay characters or themes.
broader: Gay fiction
broader: LGBTQ+ historical fiction
change note: Version 4.2.0
has top concept: Subcultures
in scheme: v4

Intersex historical fiction
type: Concept
issued: 2026-02-23
modified: 2026-02-23
comment: Written works of fiction in which the plot takes place in the setting of particular real historical events; use in reference to historical fiction focusing on intersex characters or themes.
broader: Intersex fiction
broader: LGBTQ+ historical fiction
change note: Version 4.2.0
has top concept: Subcultures
in scheme: v4

Lesbian historical fiction
type: Concept
issued: 2026-02-23
modified: 2026-02-23
comment: Written works of fiction in which the plot takes place in the setting of particular real historical events; use in reference to historical fiction focusing on lesbian characters or themes.
broader: Lesbian fiction
broader: LGBTQ+ historical fiction
change note: Version 4.2.0
has top concept: Subcultures
in scheme: v4

Non-binary historical fiction
type: Concept
issued: 2026-02-23
modified: 2026-02-23
comment: Written works of fiction in which the plot takes place in the setting of particular real historical events; use in reference to historical fiction focusing on non-binary characters or themes.
alternative label: Nonbinary historical fiction
broader: Non-binary fiction
broader: LGBTQ+ historical fiction
change note: Version 4.2.0
has top concept: Subcultures
in scheme: v4

Queer historical fiction
type: Concept
issued: 2026-02-23
modified: 2026-02-23
comment: Written works of fiction in which the plot takes place in the setting of particular real historical events; use in reference to historical fiction focusing on queer characters or themes.
broader: Queer fiction
broader: LGBTQ+ historical fiction
change note: Version 4.2.0
has top concept: Subcultures
in scheme: v4

Transgender historical fiction
type: Concept
issued: 2026-02-23
modified: 2026-02-23
comment: Written works of fiction in which the plot takes place in the setting of particular real historical events; use in reference to historical fiction focusing on transgender characters or themes.
alternative label: Trans historical fiction
broader: Transgender fiction
broader: LGBTQ+ historical fiction
change note: Version 4.2.0
has top concept: Subcultures
in scheme: v4

Two-Spirit academic journals
type: Concept
issued: 2026-02-23
modified: 2026-02-23
comment: Academic journals focusing on Two-Spirit identities, issues, or culture(s).
alternative label: Two Spirit academic journals
alternative label: Two-Spirited academic journals
alternative label: Two Spirited academic journals
alternative label: 2S academic journals
change note: Version 4.2.0
in scheme: v4
related: LGBTQ+ academic journals

Lesbian podcasts
type: Concept
issued: 2026-02-23
modified: 2026-02-23
comment: A recorded series (primarily in audio, but sometimes with a video component) with recurring hosts that feature content about lesbians and/or lesbian issues and that are available digitally for streaming or download. Podcasts are typically episodic and may feature different guests.
broader: LGBTQ+ podcasts
change note: Version 4.2.0
has top concept: LGBTQ+ podcasts
in scheme: v4
related: Lesbian radio

Gay podcasts
type: Concept
issued: 2026-02-23
modified: 2026-02-23
comment: A recorded series (primarily in audio, but sometimes with a video component) with recurring hosts that feature content about gay men and/or gay men's issues and that are available digitally for streaming or download. Podcasts are typically episodic and may feature different guests.
broader: LGBTQ+ podcasts
change note: Version 4.2.0
has top concept: LGBTQ+ podcasts
in scheme: v4
related: Gay radio

Bisexual podcasts
type: Concept
issued: 2026-02-23
modified: 2026-02-23
comment: A recorded series (primarily in audio, but sometimes with a video component) with recurring hosts that feature content about bisexual people and/or bisexual issues and that are available digitally for streaming or download. Podcasts are typically episodic and may feature different guests.
alternative label: Bi podcasts
broader: LGBTQ+ podcasts
change note: Version 4.2.0
has top concept: LGBTQ+ podcasts
in scheme: v4
related: Bisexual radio

Transgender podcasts
type: Concept
issued: 2026-02-23
modified: 2026-02-23
comment: A recorded series (primarily in audio, but sometimes with a video component) with recurring hosts that feature content about transgender people and/or transgender issues and that are available digitally for streaming or download. Podcasts are typically episodic and may feature different guests.
alternative label: Trans podcasts
broader: LGBTQ+ podcasts
change note: Version 4.2.0
has top concept: LGBTQ+ podcasts
in scheme: v4
related: Transgender radio

Queer podcasts
type: Concept
issued: 2026-02-23
modified: 2026-02-23
comment: A recorded series (primarily in audio, but sometimes with a video component) with recurring hosts that feature content about queer people and/or queer issues and that are available digitally for streaming or download. Podcasts are typically episodic and may feature different guests.
broader: LGBTQ+ podcasts
change note: Version 4.2.0
has top concept: LGBTQ+ podcasts
in scheme: v4
related: Queer radio

Asexual podcasts
type: Concept
issued: 2026-02-23
modified: 2026-02-23
comment: A recorded series (primarily in audio, but sometimes with a video component) with recurring hosts that feature content about asexual people and/or asexual issues and that are available digitally for streaming or download. Podcasts are typically episodic and may feature different guests.
alternative label: Ace podcasts
broader: LGBTQ+ podcasts
change note: Version 4.2.0
has top concept: LGBTQ+ podcasts
in scheme: v4
related: Asexual radio

Non-binary political activists
type: Concept
issued: 2026-02-23
modified: 2026-02-26
comment: Non-binary people working to bring about political or social change through public organizing.
alternative label: Nonbinary political activists
broader: LGBTQ+ political activists
change note: Version 4.2.0
has top concept: LGBTQ+ people
in scheme: v4
related: Non-binary political activism

Non-binary political activism
type: Concept
issued: 2026-02-23
modified: 2026-02-23
comment: Direct action and organizing to achieve political or social change and acceptance for non-binary people.
alternative label: Nonbinary political activism
broader: LGBTQ+ activism
change note: Version 4.2.0
has top concept: LGBTQ+ activism
in scheme: v4
related: Non-binary political activists

Neopronoun users
type: Concept
issued: 2026-02-23
modified: 2026-02-23
comment: People who use personal pronouns that are not officially (i.e., in dictionaries, style guides, etc.) recognized by the language that they are used in.
change note: Version 4.2.0
in scheme: v4
related: Neopronouns

Canadian Two-Spirit people
type: Concept
issued: 2026-02-23
modified: 2026-02-23
comment: Two-Spirit people who were born, raised, or currently reside in Canada, or who hold Canadian citizenship. Only use to describe people who self-identify as Canadian and Two-Spirit.
alternative label: Two-Spirit Canadians
alternative label: Two-Spirit Canadian people
alternative label: 2S Canadians
alternative label: 2S Canadian people
alternative label: Two Spirit Canadians
alternative label: Two Spirit Canadian people
alternative label: Two Spirited Canadians
alternative label: Two Spirited Canadian people
alternative label: Two-Spirited Canadians
alternative label: Two-Spirited Canadian people
broader: Two-Spirit people
change note: Version 4.2.0
has top concept: Gender
in scheme: v4
related: Canadian LGBTQ+ people

Two-Spirit shepherds
type: Concept
issued: 2026-02-24
modified: 2026-02-24
comment: Two-Spirit people who tend sheep.
alternative label: 2S shepherds
alternative label: Two Spirit shepherds
alternative label: Two Spirited shepherds
alternative label: Two-Spirited shepherds
broader: Two-Spirit people
change note: Version 4.2.0
has top concept: Gender
in scheme: v4
related: LGBTQ+ shepherds

LGBTQ+ historians
type: Concept
issued: 2026-02-24
modified: 2026-02-24
comment: LGBTQ+ people who study and interpret historical events.
broader: LGBTQ+ people
change note: Version 4.2.0
has top concept: LGBTQ+ people
in scheme: v4
related: LGBTQ+ history

Queer law students
type: Concept
issued: 2026-02-24
modified: 2026-02-27
comment: Queer people who are studying law at an institution of higher education in preparation to become lawyers.
broader: LGBTQ+ law students
change note: Version 4.2.0
has top concept: LGBTQ+ people
in scheme: v4
related: Queer lawyers

Gay law students
type: Concept
issued: 2026-02-24
modified: 2026-02-27
comment: Gay men who are studying law at an institution of higher education in preparation to become lawyers.
broader: LGBTQ+ law students
change note: Version 4.2.0
has top concept: LGBTQ+ people
in scheme: v4
related: Gay lawyers

Lesbian law students
type: Concept
issued: 2026-02-24
modified: 2026-02-27
comment: Lesbians who are studying law at an institution of higher education in preparation to become lawyers.
broader: LGBTQ+ law students
change note: Version 4.2.0
has top concept: LGBTQ+ people
in scheme: v4
related: Lesbian lawyers

Bisexual law students
type: Concept
issued: 2026-02-24
modified: 2026-02-27
comment: Bisexual people who are studying law at an institution of higher education in preparation to become lawyers.
alternative label: Bi law students
broader: LGBTQ+ law students
change note: Version 4.2.0
has top concept: LGBTQ+ people
in scheme: v4
related: Bisexual lawyers

Asexual law students
type: Concept
issued: 2026-02-24
modified: 2026-02-27
comment: Asexual people who are studying law at an institution of higher education in preparation to become lawyers.
alternative label: Ace law students
broader: LGBTQ+ law students
change note: Version 4.2.0
has top concept: LGBTQ+ people
in scheme: v4
related: Asexual lawyers

Intersex law students
type: Concept
issued: 2026-02-24
modified: 2026-02-27
comment: Intersex people who are studying law at an institution of higher education in preparation to become lawyers.
broader: LGBTQ+ law students
change note: Version 4.2.0
has top concept: LGBTQ+ people
in scheme: v4
related: Intersex lawyers

Non-binary law students
type: Concept
issued: 2026-02-24
modified: 2026-02-27
comment: Non-binary people who are studying law at an institution of higher education in preparation to become lawyers.
alternative label: Nonbinary law students
broader: LGBTQ+ law students
change note: Version 4.2.0
has top concept: LGBTQ+ people
in scheme: v4
related: Non-binary lawyers

Transgender law students
type: Concept
issued: 2026-02-24
modified: 2026-02-27
comment: Transgender people who are studying law at an institution of higher education in preparation to become lawyers.
alternative label: Trans law students
broader: LGBTQ+ law students
change note: Version 4.2.0
has top concept: LGBTQ+ people
in scheme: v4
related: Transgender lawyers

Two-Spirit cattle herders
type: Concept
issued: 2026-02-24
modified: 2026-02-27
comment: Two-Spirit people who tend cattle.
alternative label: Two Spirit cattle herders
alternative label: Two Spirited cattle herders
alternative label: Two-Spirited cattle herders
alternative label: 2S cattle herders
broader: Two-Spirit people
change note: Version 4.2.0
has top concept: Gender
in scheme: v4
related: LGBTQ+ cattle herders

Gay lawyers
type: Concept
issued: 2026-02-24
modified: 2026-02-27
comment: Gay men who are licensed to provide legal advice, draft legal documents, and represent others in legal matters.
broader: LGBTQ+ lawyers
change note: Version 4.2.0
has top concept: LGBTQ+ people
in scheme: v4
related: Gay law students

Lesbian lawyers
type: Concept
issued: 2026-02-24
modified: 2026-02-27
comment: Lesbians who are licensed to provide legal advice, draft legal documents, and represent others in legal matters.
broader: LGBTQ+ lawyers
change note: Version 4.2.0
has top concept: LGBTQ+ people
in scheme: v4
related: Lesbian law students

Bisexual lawyers
type: Concept
issued: 2026-02-24
modified: 2026-02-27
comment: Bisexual people who are licensed to provide legal advice, draft legal documents, and represent others in legal matters.
alternative label: Bi lawyers
broader: LGBTQ+ lawyers
change note: Version 4.2.0
has top concept: LGBTQ+ people
in scheme: v4
related: Bisexual law students

Asexual lawyers
type: Concept
issued: 2026-02-24
modified: 2026-02-27
comment: Asexual people who are licensed to provide legal advice, draft legal documents, and represent others in legal matters.
alternative label: Ace lawyers
broader: LGBTQ+ lawyers
change note: Version 4.2.0
has top concept: LGBTQ+ people
in scheme: v4
related: Asexual law students

Intersex lawyers
type: Concept
issued: 2026-02-24
modified: 2026-02-27
comment: Intersex people who are licensed to provide legal advice, draft legal documents, and represent others in legal matters.
broader: LGBTQ+ lawyers
change note: Version 4.2.0
has top concept: LGBTQ+ people
in scheme: v4
related: Intersex law students

Non-binary lawyers
type: Concept
issued: 2026-02-24
modified: 2026-02-27
comment: Non-binary people who are licensed to provide legal advice, draft legal documents, and represent others in legal matters.
alternative label: Nonbinary lawyers
broader: LGBTQ+ lawyers
change note: Version 4.2.0
has top concept: LGBTQ+ people
in scheme: v4
related: Non-binary law students

Transgender lawyers
type: Concept
issued: 2026-02-24
modified: 2026-02-27
comment: Transgender people who are licensed to provide legal advice, draft legal documents, and represent others in legal matters.
alternative label: Trans lawyers
broader: LGBTQ+ lawyers
change note: Version 4.2.0
has top concept: LGBTQ+ people
in scheme: v4
related: Transgender law students

Queer lawyers
type: Concept
issued: 2026-02-24
modified: 2026-02-27
comment: Queer people who are licensed to provide legal advice, draft legal documents, and represent others in legal matters.
broader: LGBTQ+ lawyers
change note: Version 4.2.0
has top concept: LGBTQ+ people
in scheme: v4
related: Queer law students

Two-Spirit police officers
type: Concept
issued: 2026-02-24
modified: 2026-02-24
comment: Two-Spirit people who are members of a police force.
alternative label: Two Spirit police officers
alternative label: Two Spirited police officers
alternative label: Two-Spirited police officers
alternative label: 2S police officers
alternative label: Two Spirit cops
alternative label: Two Spirited cops
alternative label: Two-Spirited cops
alternative label: 2S cops
alternative label: Two-Spirit cops
broader: Two-Spirit people
change note: Version 4.2.0
has top concept: Gender
in scheme: v4
related: LGBTQ+ police officers

Throuple
type: Concept
issued: 2026-02-24
modified: 2026-03-05
comment: A committed polyamorous relationship in which a couple adds a third partner to their relationship. Often, this relationship dynamic does not have a flat hierarchy and the third is seen as dating the couple as a unit or joining the couple's pre-existing relationship rather than individually dating both other members of the throuple.
broader: Polyamory
change note: Version 4.2.0
has top concept: Relationship orientation
in scheme: v4
related: Polysexuality

Two-Spirit composers
type: Concept
issued: 2026-02-24
modified: 2026-02-24
comment: Two-Spirit people who create and arrange original music.
alternative label: Two Spirit composers
alternative label: Two-Spirited composers
broader: Two-Spirit people
change note: Version 4.2.0
has top concept: Gender
in scheme: v4
related: LGBTQ+ composers

Cowboys (LGBTQ+ culture)
type: Concept
issued: 2026-02-24
modified: 2026-02-24
comment: An LGBTQ+ subculture rooted in the romanticization and/or sexualization of the cowboy aesthetic and the associated idea of masculinity in which people dress like and adopt cultural norms from cowboys.
change note: Version 4.2.0
in scheme: v4
related: LGBTQ+ cattle herders

Gay basketball players
type: Concept
issued: 2026-02-24
modified: 2026-02-24
comment: Gay men who play basketball.
broader: LGBTQ+ basketball players
broader: Gay athletes
change note: Version 4.2.0
has top concept: LGBTQ+ people
in scheme: v4

Lesbian basketball players
type: Concept
issued: 2026-02-24
modified: 2026-02-24
comment: Lesbians who play basketball.
broader: Lesbian athletes
broader: LGBTQ+ basketball players
change note: Version 4.2.0
has top concept: LGBTQ+ people
in scheme: v4

Bisexual basketball players
type: Concept
issued: 2026-02-24
modified: 2026-02-24
comment: Bisexual people who play basketball.
alternative label: Bi basketball players
broader: Bisexual athletes
broader: LGBTQ+ basketball players
change note: Version 4.2.0
has top concept: LGBTQ+ people
in scheme: v4

Asexual basketball players
type: Concept
issued: 2026-02-24
modified: 2026-02-24
comment: Asexual people who play basketball.
alternative label: Ace basketball players
broader: Asexual athletes
broader: LGBTQ+ basketball players
change note: Version 4.2.0
has top concept: Sexual minorities
in scheme: v4

Intersex basketball players
type: Concept
issued: 2026-02-24
modified: 2026-02-24
comment: Intersex people who play basketball.
broader: Intersex athletes
broader: LGBTQ+ basketball players
change note: Version 4.2.0
has top concept: LGBTQ+ people
in scheme: v4

Non-binary basketball players
type: Concept
issued: 2026-02-24
modified: 2026-02-24
comment: Non-binary people who play basketball.
alternative label: Nonbinary basketball players
broader: Non-binary athletes
broader: LGBTQ+ basketball players
change note: Version 4.2.0
has top concept: LGBTQ+ people
in scheme: v4

Two-Spirit basketball players
type: Concept
issued: 2026-02-24
modified: 2026-02-24
comment: Two-Spirit people who play basketball.
alternative label: Two Spirit basketball players
alternative label: Two-Spirited basketball players
alternative label: Two Spirited basketball players
alternative label: 2S basketball players
broader: Two-Spirit athletes
change note: Version 4.2.0
has top concept: Gender
in scheme: v4
related: LGBTQ+ basketball players

Transgender basketball players
type: Concept
issued: 2026-02-24
modified: 2026-02-24
comment: Transgender people who play basketball.
alternative label: Trans basketball players
broader: Transgender athletes
broader: LGBTQ+ basketball players
change note: Version 4.2.0
has top concept: LGBTQ+ people
in scheme: v4

Queer basketball players
type: Concept
issued: 2026-02-24
modified: 2026-02-24
comment: Queer people who play basketball.
broader: Queer athletes
broader: LGBTQ+ basketball players
change note: Version 4.2.0
has top concept: LGBTQ+ people
in scheme: v4

Gay medical doctors
type: Concept
issued: 2026-02-25
modified: 2026-02-25
comment: Gay men who are licensed, qualified practitioners of medicine.
alternative label: Gay doctors
alternative label: Gay physicians
broader: Gay medical professionals
broader: LGBTQ+ medical doctors
change note: Version 4.2.0
has top concept: LGBTQ+ people
in scheme: v4
preferred label: Gay medical practitioners

Lesbian medical doctors
type: Concept
issued: 2026-02-25
modified: 2026-02-25
comment: Lesbians who are licensed, qualified practitioners of medicine.
alternative label: Lesbian doctors
alternative label: Lesbian physicians
broader: Lesbian medical professionals
broader: LGBTQ+ medical doctors
change note: Version 4.2.0
has top concept: LGBTQ+ people
in scheme: v4
preferred label: Lesbian medical practitioners

Bisexual medical doctors
type: Concept
issued: 2026-02-25
modified: 2026-02-25
comment: Bisexual people who are licensed, qualified practitioners of medicine.
alternative label: Bi physicians
alternative label: Bi doctors
alternative label: Bisexual doctors
broader: LGBTQ+ medical doctors
broader: Bisexual medical professionals
change note: Version 4.2.0
has top concept: LGBTQ+ people
in scheme: v4
preferred label: Bisexual medical practitioners

Asexual medical doctors
type: Concept
issued: 2026-02-25
modified: 2026-02-25
comment: Asexual people who are licensed, qualified practitioners of medicine.
alternative label: Ace physicians
alternative label: Ace doctors
alternative label: Asexual doctors
broader: LGBTQ+ medical doctors
broader: Asexual medical professionals
change note: Version 4.2.0
has top concept: LGBTQ+ people
in scheme: v4
preferred label: Asexual medical practitioners

Intersex medical doctors
type: Concept
issued: 2026-02-25
modified: 2026-02-25
comment: Intersex people who are licensed, qualified practitioners of medicine.
alternative label: Intersex doctors
alternative label: Intersex physicians
broader: LGBTQ+ medical doctors
broader: Intersex medical professionals
change note: Version 4.2.0
has top concept: LGBTQ+ people
in scheme: v4
preferred label: Intersex medical practitioners

Non-binary medical doctors
type: Concept
issued: 2026-02-25
modified: 2026-02-25
comment: Non-binary people who are licensed, qualified practitioners of medicine.
alternative label: Nonbinary physicians
alternative label: Non-binary doctors
alternative label: Nonbinary doctors
alternative label: Nonbinary medical doctors
alternative label: Non-binary physicians
broader: LGBTQ+ medical doctors
broader: Non-binary medical professionals
change note: Version 4.2.0
has top concept: LGBTQ+ people
in scheme: v4
preferred label: Non-binary medical practitioners

Transgender medical doctors
type: Concept
issued: 2026-02-25
modified: 2026-02-25
comment: Transgender people who are licensed, qualified practitioners of medicine.
alternative label: Trans medical doctors
alternative label: Transgender physicians
alternative label: Trans physicians
alternative label: Transgender doctors
alternative label: Trans doctors
broader: LGBTQ+ medical doctors
broader: Transgender medical professionals
change note: Version 4.2.0
has top concept: LGBTQ+ people
in scheme: v4
preferred label: Transgender medical practitioners

Queer medical doctors
type: Concept
issued: 2026-02-25
modified: 2026-02-25
comment: Queer people who are licensed, qualified practitioners of medicine.
alternative label: Queer doctors
alternative label: Queer physicians
broader: LGBTQ+ medical doctors
broader: Queer medical professionals
change note: Version 4.2.0
has top concept: LGBTQ+ people
in scheme: v4
preferred label: Queer medical practitioners

Two-Spirit architects
type: Concept
issued: 2026-03-03
modified: 2026-03-03
comment: Two-Spirit people who professionally design buildings and are qualified to plan and supervise their construction.
alternative label: Two Spirit architects
alternative label: Two-Spirited architects
alternative label: Two Spirited architects
alternative label: 2S architects
broader: Two-Spirit people
change note: Version 4.2.0
has top concept: Gender
in scheme: v4
related: LGBTQ+ architects

Gay nurses
type: Concept
issued: 2026-03-04
modified: 2026-03-04
comment: Gay men who are licensed nurses and practice independently or in collaboration with a multidisciplinary team.
broader: LGBTQ+ nurses
broader: Gay medical professionals
change note: Version 4.2.0
has top concept: LGBTQ+ people
in scheme: v4

Lesbian nurses
type: Concept
issued: 2026-03-04
modified: 2026-03-04
comment: Lesbians who are licensed nurses and practice independently or in collaboration with a multidisciplinary team.
broader: LGBTQ+ nurses
broader: Lesbian medical professionals
change note: Version 4.2.0
has top concept: LGBTQ+ people
in scheme: v4

Bisexual nurses
type: Concept
issued: 2026-03-04
modified: 2026-03-04
comment: Bisexual people who are licensed nurses and practice independently or in collaboration with a multidisciplinary team.
alternative label: Bi nurses
broader: LGBTQ+ nurses
broader: Bisexual medical professionals
change note: Version 4.2.0
has top concept: LGBTQ+ people
in scheme: v4

Asexual nurses
type: Concept
issued: 2026-03-04
modified: 2026-03-04
comment: Asexual people who are licensed nurses and practice independently or in collaboration with a multidisciplinary team.
alternative label: Ace nurses
broader: LGBTQ+ nurses
broader: Asexual medical professionals
change note: Version 4.2.0
has top concept: LGBTQ+ people
in scheme: v4

Intersex nurses
type: Concept
issued: 2026-03-04
modified: 2026-03-04
comment: Intersex people who are licensed nurses and practice independently or in collaboration with a multidisciplinary team.
broader: LGBTQ+ nurses
broader: Intersex medical professionals
change note: Version 4.2.0
has top concept: LGBTQ+ people
in scheme: v4

Non-binary nurses
type: Concept
issued: 2026-03-04
modified: 2026-03-04
comment: Non-binary people who are licensed nurses and practice independently or in collaboration with a multidisciplinary team.
alternative label: Nonbinary nurses
broader: LGBTQ+ nurses
broader: Non-binary medical professionals
change note: Version 4.2.0
has top concept: LGBTQ+ people
in scheme: v4

Transgender nurses
type: Concept
issued: 2026-03-04
modified: 2026-03-04
comment: Transgender people who are licensed nurses and practice independently or in collaboration with a multidisciplinary team.
alternative label: Trans nurses
broader: LGBTQ+ nurses
broader: Transgender medical professionals
change note: Version 4.2.0
has top concept: LGBTQ+ people
in scheme: v4

Queer nurses
type: Concept
issued: 2026-03-04
modified: 2026-03-04
comment: Queer people who are licensed nurses and practice independently or in collaboration with a multidisciplinary team.
broader: LGBTQ+ nurses
broader: Queer medical professionals
change note: Version 4.2.0
has top concept: LGBTQ+ people
in scheme: v4

Adoptive parenthood
type: Concept
issued: 2019-05-14
modified: 2025-02-23
replaces: adoptiveParenthood
comment: The experience of being an adoptive parent to a child or children. An adoptive parent is the person or persons who become permanent parents through adoption with all the responsibilities therein.
comment: La experiencia de ser madre adoptiva o padre adoptivo de un(a) niño(a) o niños(as). Es la persona o las personas que se convierten en madres o padres permanentes mediante la adopción con todas las responsabilidades que ello implica.
alternative label: Maternidad adoptiva
alternative label: Paternidad adoptiva
broader: LGBTQ+ parenthood
change note: Version 4.2.0
has top concept: LGBTQ+ parenthood
in scheme: v3
preferred label: Maternidad adoptiva / Paternidad adoptiva
related: Social parenthood
related: LGBTQ+ adoption

Agî
type: Concept
issued: 2019-05-14
modified: 2025-02-23
replaces: agi
comment: Filipino word that translates to both hermaphrodite and a gay slur.
comment: Palabra filipina que se traduce tanto como hermafrodita o como insulto contra los hombres gay.
alternative label: Agi
broader: Non-Euro-American gender and sexual identities
broader: Slurs
change note: Version 4.2.0
has top concept: Gender
in scheme: v3
related: Bakla

AIDS awareness
type: Concept
issued: 2019-05-14
modified: 2025-02-23
replaces: AIDSAwareness
comment: Activism and other efforts to bring attention to the AIDS epidemic.
comment: Activismo y otros esfuerzos para generar atención sobre la epidemia del SIDA.
change note: Version 4.2.0
in scheme: v3
preferred label: Conciencia sobre el SIDA
related: HIV/AIDS
related: Red ribbons (AIDS)

AIDS memorial quilts
type: Concept
issued: 2019-05-14
modified: 2025-02-23
replaces: AIDSMemorialQuilts
comment: Quilts created to celebrate the lives of people who have died of AIDS-related causes, bring awareness to the AIDS epidemic, and provide support and healing for those affected. The term is often used to refer to the NAMES Project AIDS Memorial Quilt started by Cleve Jones in 1985.
comment: Colchas creadas para celebrar las vidas de las personas que han muerto por causas relacionadas con el SIDA, generar conciencia sobre la epidemia del SIDA y brindar apoyo y sanación a las personas afectadas. El término se utiliza a menudo para referirse a la colcha conmemorativa del SIDA del proyecto NAMES iniciada por Cleve Jones en 1985.
broader: AIDS memorials
change note: Version 4.2.0
has top concept: Medical care
in scheme: v3
preferred label: Colchas conmemorativas del SIDA
related: HIV/AIDS
related: LGBTQ+ memorials

AIDS phobia
type: Concept
issued: 2019-05-14
modified: 2025-02-23
replaces: AIDSPhobia
comment: Antagonism or disgust directed toward individuals with HIV/AIDS or behaviors perceived as putting oneself at risk for contracting HIV/AIDS. AIDS phobia may include isolation, stereotypes, verbal harassment, and physical violence.
comment: Antagonismo o disgusto dirigido hacia personas con VIH/SIDA o hacia comportamientos percibidos como riesgosos en relación a la contracción de VIH/SIDA. La fobia al SIDA puede incluir el aislamiento, los estereotipos, el acoso verbal y la violencia física.
alternative label: AIDSphobia
alternative label: Fear of AIDS
alternative label: Fobia al SIDA
alternative label: AIDSfobia
alternative label: Miedo al SIDA
alternative label: Sidafobia
alternative label: Sidofobia
change note: Version 4.2.0
in scheme: v3
preferred label: Serofobia
related: HIV/AIDS
related: LGBTQ+ phobia

Red ribbons (AIDS)
type: Concept
issued: 2019-05-14
modified: 2025-02-23
replaces: redRibbons
comment: Red ribbon that acts as an international symbol for HIV and AIDS awareness; first adopted in the early 1990s for the Red Ribbon Project.
comment: Cinta roja que actúa como símbolo internacional para la concientización sobre el VIH y el SIDA; adoptado por primera vez a principios de la década de 1990 para el Proyecto Cinta Roja.
alternative label: AIDS ribbons
alternative label: Red ribbons
alternative label: Lazos rojos
alternative label: Lazos rojos (SIDA)
alternative label: Cintas por el SIDA
broader: LGBTQ+ symbols
change note: Version 4.2.0
has top concept: LGBTQ+ symbols
in scheme: v3
preferred label: Cintas rojas (SIDA)
related: HIV/AIDS
related: AIDS awareness

Alyha
type: Concept
issued: 2019-05-14
modified: 2025-02-23
replaces: alyha
comment: In Native American Mohave tribes, people assigned male at birth who exhibit feminine traits and could become socially female, often serving as healers.
comment: En las tribus nativas americanas mohave, las personas asignadas al sexo masculino al nacer que exhiben rasgos femeninos y pueden convertirse socialmente en mujeres, a menudo sirviendo como curanderos.
broader: Non-Euro-American gender and sexual identities
change note: Version 4.2.0
has top concept: Gender
in scheme: v3
related: Hwame
related: Two-Spirit people

Androgynos
type: Concept
issued: 2019-05-14
modified: 2025-02-23
replaces: androgynos
comment: Israeli term used in Rabbinical literature to describe both an intersex mythological creature and refer to a legal condition.
comment: Término griego utilizado en la literatura rabínica para describir tanto una criatura mitológica intersexual como para referirse a una condición legal.
broader: Non-Euro-American gender and sexual identities
change note: Version 4.2.0
has top concept: Gender
in scheme: v3
related: Intersex people

Anti-bisexual violence
type: Concept
issued: 2019-05-14
modified: 2025-02-23
replaces: antiBisexualViolence
comment: Behavior involving physical force intended to harm or kill bisexual people on the basis of their identity.
comment: Comportamiento que involucra fuerza física destinada a hacer daño o a matar a personas bisexuales por su identidad.
broader: Anti-LGBTQ+ violence
change note: Version 4.2.0
has top concept: Anti-LGBTQ+ violence
in scheme: v3
preferred label: Violencia anti-bisexual
related: Hate crimes
related: Biphobia

Anti-discrimination law
type: Concept
issued: 2019-05-14
modified: 2025-02-23
replaces: anti-discriminationLaw
comment: Legislation designed to prevent employment, housing, education, and other forms of discrimination against protected groups of people.
comment: Legislación diseñada para prevenir la discriminación de empleo, vivienda, educación y otras formas de discriminación contra grupos protegidos de personas.
broader: Law
change note: Version 4.2.0
has top concept: Law
in scheme: v3
preferred label: Leyes anti-discriminación
related: LGBTQ+ discrimination
related: Public facilities

Anti-feminism
type: Concept
issued: 2019-05-14
modified: 2025-02-23
replaces: anti-feminism
comment: Opposition to some or all forms of feminism.
comment: Oposición a algunas o todas las formas del feminismo.
change note: Version 4.2.0
in scheme: v3
preferred label: Anti-feminismo
related: Feminism
related: Social privilege

Anti-queer violence
type: Concept
issued: 2019-05-14
modified: 2025-02-23
replaces: antiQueerViolence
comment: Behavior involving physical force intended to harm or kill queer people on the basis of their identity.
comment: Comportamiento que involucra fuerza física con el fin de dañar o matar a personas queer por su identidad.
broader: Anti-LGBTQ+ violence
change note: Version 4.2.0
has top concept: Anti-LGBTQ+ violence
in scheme: v3
preferred label: Violencia anti-queer
related: Hate crimes
related: Queerphobia

Anti-transgender violence
type: Concept
issued: 2019-05-14
modified: 2025-02-23
replaces: anti-transgenderViolence
comment: Behavior involving physical force intended to harm or kill transgender people on the basis of their identity.
comment: Comportamiento que involucra fuerza física destinada a hacer daño o a matar a personas transgénero por su identidad.
broader: Anti-LGBTQ+ violence
change note: Version 4.2.0
has top concept: Anti-LGBTQ+ violence
in scheme: v3
preferred label: Violencia anti-transgénero
related: Hate crimes
related: Transphobia

Aravani
type: Concept
issued: 2019-05-14
modified: 2025-02-23
replaces: aravani
comment: Indian term for people who identify as women trapped in male bodies; many prefer other terms, such as hijra or thirunangai.
comment: Término indio para personas que seautoidentificancomo mujeres atrapadas en cuerpos masculinos; muches prefieren otros términos, como hijra o thirunangai.
alternative label: Aruvani
broader: Non-Euro-American gender and sexual identities
change note: Version 4.2.0
has top concept: Gender
in scheme: v3
related: Hijras
related: Thirunangai

Ballroom families
type: Concept
issued: 2019-05-14
modified: 2025-02-23
replaces: ballroomFamilies
comment: In ball culture, ballroom families (or houses) are chosen families headed by and named after established community members (e.g., the House of Xtravaganza); heads of ballroom families are typically called "mothers" or "fathers," while members are termed "children" and "siblings."
comment: En la cultura del baile, las familias (o casas) de ballroom son familias elegidas encabezadas por miembros establecidos de la comunidad y que reciben su nombre de ellos (por ejemplo, la Casa de Xtravaganza); a los cabezas de familia de baile se les suele llamar "madres" o "padres", mientras que a los miembros se les denomina "hijos" y "hermanos".
alternative label: Ballroom houses
alternative label: Casas de ballroom
broader: Ball culture
broader: LGBTQ+ chosen families
change note: Version 4.2.0
has top concept: Subcultures
in scheme: v3
preferred label: Familias de ballroom
related: Drag families

Barebacking
type: Concept
issued: 2019-05-14
modified: 2025-02-23
replaces: barebacking
comment: The practice of engaging in anal sex without using a condom.
comment: La práctica de tener sexo anal sin preservativo.
broader: Ass fucking
broader: Risk behaviors
change note: Version 4.2.0
has top concept: Sex (Act)
in scheme: v3
preferred label: Sexo a pelo
related: Bugchasing

Bayot
type: Concept
issued: 2019-05-14
modified: 2025-02-23
replaces: bayot
comment: Derogatory Cebuano term used in the Philippines to describe effeminate gay men or masculine women.
comment: Término despectivo cebuano utilizado en Filipinas para referirse a los hombres gay afeminados o a las mujeres masculinas.
broader: Non-Euro-American gender and sexual identities
broader: Slurs
change note: Version 4.2.0
has top concept: Gender
in scheme: v3
related: Bakla

Behavioral therapy
type: Concept
issued: 2019-05-14
modified: 2025-02-23
replaces: behaviouralTherapy
comment: Therapeutic techniques and treatments derived from cognitive psychology that are designed to identify and potentially change behaviors perceived as self-destructive or unhealthy. Includes behavioral therapy intended to alter an individual's sexual or gender identity or expression.
comment: Técnicas y tratamientos terapéuticos derivados de la psicología cognitiva diseñados para identificar y potencialmente cambiar conductas percibidas como autodestructivas o poco saludables. Incluye la terapia conductual destinada a modificar la identidad o expresión sexual o de género de una persona.
alternative label: Terapia de comportamiento
alternative label: Terapia de conducta
broader: Therapies
change note: Version 4.2.0
has top concept: Medical care
in scheme: v3
narrower: Aversion therapy
narrower: Conversion therapy
preferred label: Terapia conductual
preferred label: Behavioural therapy

Bigender identity
type: Concept
issued: 2019-05-14
modified: 2025-02-23
replaces: bigenderIdentity
comment: Term used to describe the identities of people who have two genders.
comment: Término utilizado para describir la identidad de personas que tienen dos géneros.
broader: Gender identity
change note: Version 4.2.0
has top concept: Gender
in scheme: v3
preferred label: Identidad bigénero
related: Bigender people
related: Genderfluid identity

Bigender people
type: Concept
issued: 2019-05-14
modified: 2025-02-23
replaces: bigenderPeople
comment: People who identify as any two genders, either simultaneously or more fluidly.
comment: Personas que seautoidentificancon dos géneros, ya sea simultáneamente o de forma más fluida.
broader: Transgender people
change note: Version 4.2.0
has top concept: LGBTQ+ people
in scheme: v3
preferred label: Personas bigénero
related: Bigender identity
related: Genderfluid people

African American bisexual people
type: Concept
issued: 2019-05-14
modified: 2025-02-23
replaces: bisexualAfricanAmericans
comment: Bisexual people of African descent born in the United States or bisexual people born in African countries who live in or have a strong connection to the United States. Use for individuals who self-identity as African American. Follow the individual’s preference for African American or Black whenever possible.
comment: Personas bisexuales de ascendencia africana nacidas en los Estados Unidos o personas bisexuales nacidas en países africanos que viven o tienen una conexión fuerte con los Estados Unidos. Utilícese para personas que se autoidentifiquen como afroamericanas.
alternative label: Bisexual African American people
alternative label: Bisexual African Americans
alternative label: Afroamericanos bisexuales
alternative label: Bisexuales afroamericanos
alternative label: Afroamericanas bisexuales
alternative label: Bisexuales afroamericanas
broader: African American LGBTQ+ people
broader: Black bisexual people
change note: Version 4.2.0
has top concept: LGBTQ+ people
in scheme: v3
preferred label: Personas bisexuales afroamericanas
related: Down-low

Bisexual boys
type: Concept
issued: 2019-05-14
modified: 2025-02-23
replaces: bisexualBoys
comment: Boys (typically children younger than 18) who are bisexual.
comment: Niños (normalmente menores de 18 años) que son bisexuales.
broader: Bisexual children
broader: Bisexual youth
broader: Boys
change note: Version 4.2.0
has top concept: LGBTQ+ people
in scheme: v3
preferred label: Niños bisexuales

Bisexual information centers
type: Concept
issued: 2019-05-14
modified: 2025-02-23
replaces: bisexualInformationCentres
comment: Institutions providing education, support, and information about bisexuality and bisexual communities to bisexual people.
comment: Término utilizado para describir la identidad sexual de personas que se sienten atraídas romántica y/o sexualmente por personas de más de un género y que prefieren el término bisexual a alternativas como pansexual, polisexual, etc.
broader: LGBTQ+ information centers
change note: Version 4.2.0
has top concept: LGBTQ+ centers
in scheme: v3
preferred label: Identidad bisexual
preferred label: Bisexual information centres
related: Bisexual activism
related: Bisexual movement

Bisexual girls
type: Concept
issued: 2019-05-14
modified: 2025-02-23
replaces: bisexualGirls
comment: Girls (typically children younger than 18) who are bisexual.
comment: Películas creadas por directores bisexuales, que representan a personas bisexuales o a personas consideradas importantes dentro de la cultura bisexual.
broader: Bisexual children
broader: Bisexual youth
broader: Girls
change note: Version 4.2.0
has top concept: LGBTQ+ people
in scheme: v3
preferred label: Películas bisexuales

Bisexual newsletters
type: Concept
issued: 2019-05-14
modified: 2025-02-23
replaces: bisexualNewsletters
comment: Serialized print or digital periodicals created by or for bisexual people, often with the purpose of sharing news and information related to bisexual communities and bisexual issues.
comment: Obras literarias escritas sobre la investigación de crímenes o el trabajo de detectives; utilícese en referencia a la ficción de misterio y de detectives centrada en personajes y temas bisexuales.
broader: Bisexual press
broader: LGBTQ+ newsletters
change note: Version 4.2.0
has top concept: LGBTQ+ press
in scheme: v3
preferred label: Ficción bisexual de misterio y detectives
related: Bisexual newspapers

Bisexual newspapers
type: Concept
issued: 2019-05-14
modified: 2025-02-23
replaces: bisexualNewspapers
comment: Serialized print or digital publications about bisexuality or bisexual issues (and typically produced by bisexual people or organizations) that contain news, articles, columns, correspondence, and advertisements.
comment: Personas bisexuales cuyos cerebros procesan, aprenden y/o se comportan de manera diferente a lo que la sociedad considera típico. Algunas de estas diferencias neurológicas pueden presentarse como problemas de aprendizaje, trastornos médicos y otras condiciones.
broader: Bisexual press
broader: LGBTQ+ newspapers
change note: Version 4.2.0
has top concept: LGBTQ+ press
in scheme: v3
preferred label: Personas bisexuales neurodivergentes
related: Bisexual newsletters

Bisexual poetry
type: Concept
issued: 2019-05-14
modified: 2025-02-23
replaces: bisexualPoetry
comment: Literary work, typically written in verse, that focuses on bisexual characters, themes, or identity.
comment: Personas bisexuales que no son blancas y que se autoidentifican como personas de color.
broader: LGBTQ+ poetry
change note: Version 4.2.0
has top concept: Subcultures
in scheme: v3
preferred label: Personas bisexuales de color
related: Bisexual literature
related: Bisexual authors

Bisexual porn films
type: Concept
issued: 2019-05-14
modified: 2025-02-23
replaces: bisexualPornFilms
comment: Erotic or sexually explicit films featuring bisexual people.
comment: Personas bisexuales que trabajan para lograr cambios políticos o sociales a través de la organización pública.
broader: LGBTQ+ porn films
broader: Bisexual erotic art
change note: Version 4.2.0
has top concept: Subcultures
in scheme: v3
preferred label: Activistas políticos bisexuales
related: Bisexual erotic films

Boys' friendships
type: Concept
issued: 2019-05-14
modified: 2025-02-23
replaces: boysFriendships
comment: Connections based on affection and trust between two or more boys.
comment: Conexiones basadas en el afecto y la confianza entre dos o más niños.
alternative label: Amistades de niños
broader: Friendships
broader: Homosociality
change note: Version 4.2.0
has top concept: Relationship satisfaction
in scheme: v3
preferred label: Amistades entre niños
related: Boys

Brotherboys
type: Concept
issued: 2019-05-14
modified: 2025-02-23
replaces: brotherboys
comment: Indigenous Australian term for people who transition from female to male.
comment: Término indígena australiano para personas que transicionan de mujer a hombre.
alternative label: Brothaboys
broader: Non-Euro-American gender and sexual identities
change note: Version 4.2.0
has top concept: Gender
in scheme: v3
related: FtMs
related: Sistergirls

Sodomites
type: Concept
issued: 2019-05-14
modified: 2025-02-23
replaces: sodomites
comment: Pejorative historical term for individuals who engage in sexual activities that are characterized as unnatural or immoral; commonly applied to gay men engaging in anal sex. Only use in historical contexts.
comment: Término histórico peyorativo para personas que participan en actividades sexuales que se caracterizan como antinaturales o inmorales; comúnmente se aplica a hombres gay que practican sexo anal. Utilícese únicamente en contextos históricos.
alternative label: Buggers
broader: LGBTQ+ historical terms
change note: Version 4.2.0
has top concept: LGBTQ+ historical terms
in scheme: v3
preferred label: Sodomitas
related: Sexual minorities
related: Sodomy

Butt
type: Concept
issued: 2019-05-14
modified: 2025-02-23
replaces: buttocks
comment: Colloquial term for the buttocks, or the fleshy protuberances at the back of the hips on which people sit.
comment: Término coloquial para las nalgas o las protuberancias carnosas en la parte trasera de las caderas sobre las que se sienta la gente.
alternative label: Arse
alternative label: Ass
alternative label: Bum
alternative label: Buttock
alternative label: Buttocks
alternative label: Culo
alternative label: Poto
alternative label: Pompis
alternative label: Trasero
broader: Erogenous body parts
change note: Version 4.2.0
has top concept: Erogenous body parts
in scheme: v3
preferred label: Nalgas
related: Anal play
related: Spanking

Butt plugs
type: Concept
issued: 2019-05-14
modified: 2025-02-23
replaces: buttplugs
comment: A sex toy designed to be inserted into the anus for sexual stimulation or pleasure. Butt plugs tend to be shorter than dildos and have a flared base that prevents them from being lost in the rectum.
comment: Un juguete sexual diseñado para insertarse en el ano para estimulación o placer sexual. Los plugs anales tienden a ser más cortos que los consoladores y tienen una base acampanada que evita que se pierdan en el recto.
alternative label: Anal dilators
alternative label: Anal inserts
alternative label: Anal plugs
alternative label: Buttplugs
alternative label: Dilatadores anales
alternative label: Enchufe anal
alternative label: Tapón anal
broader: Sex accessories
change note: Version 4.2.0
has top concept: Sex accessories
in scheme: v3
preferred label: Plugs anales
related: Anal sex
related: Anal play

Camp (Gay culture)
type: Concept
issued: 2019-05-14
modified: 2025-02-23
replaces: camp
comment: An aesthetic style and sensibility that values irony and bad taste.
comment: Un estilo y una sensibilidad estética que valora la ironía y el mal gusto.
alternative label: Camp
change note: Version 4.2.0
in scheme: v3
preferred label: Camp (cultura gay)
related: Drag
related: Gay culture

Eunuchs
type: Concept
issued: 2019-05-14
modified: 2025-02-23
replaces: eunuchs
comment: Individuals assigned male at birth who have been castrated. Historically, eunuchs served in royal courts as slaves or servants; in some cases, individuals were castrated before puberty to retain childlike vocal qualities.
comment: Personas asignadas al sexo masculino al nacer que han sido castradas. Históricamente, los eunucos sirvieron en las cortes reales como esclavos o sirvientes; en algunos casos, las personas fueron castradas antes de la pubertad para conservar sus cualidades vocales infantiles.
alternative label: Castrati
broader: Non-Euro-American gender and sexual identities
change note: Version 4.2.0
has top concept: Gender
in scheme: v3
preferred label: Eunucos
related: Castration
related: Hijras

Chakka
type: Concept
issued: 2019-05-14
modified: 2025-02-23
replaces: chakka
comment: Derogatory term for a third gender person in Karnataka culture in India.
comment: Término despectivo para una persona de tercer género en la cultura de Karnataka en India.
broader: Non-Euro-American gender and sexual identities
broader: Slurs
change note: Version 4.2.0
has top concept: Gender
in scheme: v3
related: Hijras

Chromosomes
type: Concept
issued: 2019-05-14
modified: 2025-02-23
replaces: chromosomes
comment: Structures found in the nucleus of most living cells that carry genetic information in the form of genes. Often used in reference to sex chromosomes, a type of chromosome involved in sex determination.
comment: Estructuras que se encuentran en el núcleo de la mayoría de las células vivas y que transportan información genética en forma de genes. A menudo, se utiliza en referencia a los cromosomas sexuales, un tipo de cromosoma involucrado en la determinación del sexo.
broader: Sex (Body)
change note: Version 4.2.0
has top concept: Sex (Body)
in scheme: v3
preferred label: Cromosomas
related: Assigned gender
related: Assigned sex

Chubs (Gay culture)
type: Concept
issued: 2019-05-14
modified: 2025-02-23
replaces: chubsGayMen
comment: Slang term used in gay communities (primarily in the United States) to describe larger or heavy-set gay men.
comment: Término de la jerga utilizado en las comunidades gay (principalmente en los Estados Unidos) para describir a hombres gay más grandes o corpulentos.
alternative label: Chubs (Gay men)
alternative label: Chubs
alternative label: Chubs (hombres gay)
broader: Gay culture
broader: Sexual identity
change note: Version 4.2.0
has top concept: Subcultures
in scheme: v3
preferred label: Chubs (cultura gay)
related: Bears (Gay culture)

Clitoridectomy
type: Concept
issued: 2019-05-14
modified: 2025-02-23
replaces: clitoridectomy
comment: Surgical procedure involving the removal or reduction of the clitoris.
comment: Procedimiento quirúrgico que implica la extirpación o reducción del clítoris.
alternative label: Clitorectomy
alternative label: Female circumcision
alternative label: Clitorectomía
alternative label: Circuncisión femenina
broader: Female genital mutilation
broader: Intersex genital mutilation
change note: Version 4.2.0
has top concept: Female genital mutilation
in scheme: v3
preferred label: Clitoridectomía
related: Circumcision

Congenital adrenal hyperplasia
type: Concept
issued: 2019-05-14
modified: 2025-02-23
replaces: congenitalAdrenalHyperplasia
comment: Congenital adrenal hyperplasia (CAH) is a group of different but related genetic variations that affect the enzymes that allow the adrenal glands to make hormones that regulate the body’s functions. People with CAH do not consistently produce the amount of cortisol or aldosterone they need, but they may naturally produce higher-than-typical levels of androgens such as testosterone to help the body compensate. Someone with CAH can be born with XX or XY chromosomes. People with CAH and XY chromosomes are usually not considered to have a variation in sex characteristics since an increased amount of androgens will not cause the development of any characteristics that are not considered typical for people assigned male at birth. In people with XX chromosomes and CAH, the increase in androgen production can result in genital differences such as a larger-than-typical clitoris, fused labia, and the fusion of the urethra and vaginal canal to form a single opening. They may also develop some characteristics like body and facial hair or increased muscle mass during childhood or puberty.
comment: La hiperplasia suprarrenal congénita (HSC) es un grupo de variaciones genéticas diferentes pero relacionadas que afectan las enzimas que permiten a las glándulas suprarrenales producir hormonas que regulan las funciones del cuerpo. Las personas con HSC no producen consistentemente la cantidad de cortisol o aldosterona que necesitan, pero puede que naturalmente produzcan niveles más altos de lo usual de andrógenos, como la testosterona, para ayudar al cuerpo a compensar. Alguien con HSC puede nacer con cromosomas XX o XY. Por lo general, no se considera que las personas con HSC y cromosomas XY tengan una variación en características sexuales, ya que una mayor cantidad de andrógenos no provocará el desarrollo de ninguna característica que no se considere típica de las personas asignadas al sexo masculino al nacer. En personas con HSC y cromosomas XX, el aumento en la producción de andrógenos puede resultar en diferencias genitales, como un clítoris más grande de lo usual, labios fusionados y la fusión de la uretra y el canal vaginal para formar una única apertura. También pueden desarrollar algunas características como vello corporal y facial o aumento de masa muscular durante la infancia o la pubertad.
alternative label: CAH
alternative label: HSC
broader: Intersex variations
change note: Version 4.2.0
has top concept: Sex (Body)
in scheme: v3
narrower: Classical congenital adrenal hyperplasia
narrower: Non-classical congenital adrenal hyperplasia
preferred label: Hiperplasia suprarrenal congénita

Scat play
type: Concept
issued: 2019-05-14
modified: 2025-02-23
replaces: scat
comment: Use of feces for erotic enjoyment.
comment: Uso de heces para disfrute erótico.
alternative label: Coprophilia
alternative label: Coprolagnia
alternative label: Extrementophilia
alternative label: Fecalphilia
alternative label: Fecophilia
alternative label: Poop fetish
alternative label: Poop fetishism
alternative label: Poop kink
alternative label: Scat fetish
alternative label: Scat fetishism
alternative label: Scat kink
alternative label: Scat
alternative label: Scatophilia
broader: BDSM
change note: Version 4.2.0
has top concept: Eroticism
in scheme: v3
preferred label: Juego con heces
related: Anal play
related: Urine play

Cross-cultural relationships
type: Concept
issued: 2019-05-14
modified: 2025-02-23
replaces: cross-culturalRelationships
comment: Relationships between people of different ethnic or racial backgrounds.
comment: Relaciones entre personas de diferentes orígenes étnicos o raciales.
alternative label: Intercultural relationships
alternative label: Interracial relationships
alternative label: Relaciones interraciales
preferred label: Relaciones interculturales
broader: Relationship satisfaction
change note: Version 4.2.0
has top concept: Relationship satisfaction
in scheme: v3
related: Sexual identity
related: Relationship orientation

LGBTQ+ victims of cyberbullying
type: Concept
issued: 2019-05-14
modified: 2025-04-01
replaces: cyberbullying
comment: LGBTQ+ people who have experienced and may or may not have survived cyberbullying, a form of bullying or harassment that takes place online. Follow the individual's preference for "victims" or "survivors" whenever possible.
comment: Intimidación o acoso que se lleva a cabo en línea.
alternative label: Victims of cyberbullying (LGBTQ)
alternative label: LGBTQ+ cyberbullying victims
alternative label: Cyberbullying victims (LGBTQ)
alternative label: Ciberbullying
broader: LGBTQ+ victims of bullying
change note: Version 4.2.0
has top concept: LGBTQ+ people
in scheme: v3
narrower: LGBTQ+ survivors of cyberbullying
preferred label: Ciberacoso

Cybersex
type: Concept
issued: 2019-05-14
modified: 2025-03-20
replaces: cybersex
comment: Erotic or sexual communication and activity between two or more people that takes place online or using technology (e.g., texting, video chatting).
comment: Comunicación y actividad erótica o sexual entre dos o más personas que se lleva a cabo en línea o utilizando tecnología (por ejemplo, mensajes de texto, video chat).
alternative label: Internet sex
alternative label: Online sex
alternative label: Sexo online
alternative label: Sexo por Internet
alternative label: Sexo virtual
change note: Version 4.2.0
in scheme: v3
preferred label: Cibersexo
related: Sexuality

Dee
type: Concept
issued: 2019-05-14
modified: 2025-02-23
replaces: dee
comment: In Thailand, cisgender women who conform to feminine gender norms and who often partner with masculine-identified toms; similar to a femme in U.S. lesbian culture.
comment: En Tailandia, las mujeres cisgénero que se conforman con las normas de género femeninas y que a menudo se emparejan con "toms"; similar a una mujer femme en la cultura lésbica estadounidense.
broader: Non-Euro-American gender and sexual identities
change note: Version 4.2.0
has top concept: Gender
in scheme: v3
related: Katoey
related: Tom

Detention of LGBTQ+ people under a hospital order
type: Concept
issued: 2019-05-14
modified: 2025-02-23
replaces: detentionOfLGBTQPeopleUnderAHospital
comment: Physical and legal confinement of LGBTQ+ people in hospitals or medical institutions, typically to receive evaluation and treatment ordered by a court or other such authority. Can be used to describe both short-term or long-term institutionalization.
comment: Confinamiento físico y legal de personas LGBTQ+ en hospitales o instituciones médicas, generalmente para recibir evaluación y tratamiento, ordenado por un tribunal u otra autoridad similar. Puede usarse para describir el internamiento en instituciones tanto a corto como a largo plazo.
alternative label: Detention of LGBTQ people under a hospital order
alternative label: Detención de personas LGBTQ por orden de un hospital
broader: Detention of LGBTQ+ people
change note: Version 4.2.0
has top concept: Detention of LGBTQ+ people
in scheme: v3
preferred label: Detención de personas LGBTQ+ por orden de un hospital
related: Electroshock therapy
related: Mental health care for LGBTQ+ people

Dilbaa
type: Concept
issued: 2019-05-14
modified: 2025-02-23
replaces: dilbaa
comment: Navajo term for a person assigned female at birth who takes on the role of a boy in childhood and a man in adulthood.
comment: Término navajo para una persona asignada al sexo femenino al nacer que asume el papel de niño en la infancia y de hombre en la edad adulta.
broader: Non-Euro-American gender and sexual identities
change note: Version 4.2.0
has top concept: Gender
in scheme: v3
related: Nádleehi
related: Two-Spirit people

Divorced people
type: Concept
issued: 2019-05-14
modified: 2025-02-23
replaces: divorcedPeople
comment: People whose marriages have been legally dissolved.
comment: Personas cuyos matrimonios han sido legalmente disueltos.
broader: Marital status
change note: Version 4.2.0
has top concept: Living arrangements
in scheme: v3
preferred label: Personas divorciadas
related: LGBTQ+ divorce
related: Single people

Domestic partnership retirement benefits
type: Concept
issued: 2019-05-14
modified: 2025-02-23
replaces: domesticPartnershipRetirementBenefits
comment: Employee benefit plans for people in domestic partnerships that can be accessed upon retirement.
comment: Planes de beneficios para empleados para personas en parejas de hecho a los que se puede acceder al jubilarse.
alternative label: Same-sex pension benefits
alternative label: Beneficios de jubilación de uniones de hecho
alternative label: Beneficios de jubilación de parejas del mismo sexo
change note: Version 4.2.0
in scheme: v3
preferred label: Beneficios de jubilación de parejas de hecho
related: Domestic partnership contracts
related: LGBTQ+ personal and family law

Drab (LGBTQ+ culture)
type: Concept
issued: 2019-05-14
modified: 2025-02-23
replaces: drab
comment: Slang term used to describe people wearing masculine clothing, typically drag queens or crossdressers who also sometimes wear feminine clothing. Drab is a shortened form of the phrase "dressed as a boy" or "dress resembling a boy."
comment: Término de la jerga utilizado para describir a personas que visten ropa masculina, generalmente drag queens o transformistas que a veces también visten ropa femenina. Drab es una forma abreviada de la frase en inglés "dressed as a boy" o "dress resembling a boy".
alternative label: Drab
broader: Gender expression
change note: Version 4.2.0
has top concept: Gender
in scheme: v3
preferred label: Drab (cultura LGBTQ+)
related: Clothing
related: Drag

Dykes on bikes
type: Concept
issued: 2019-05-14
modified: 2025-02-23
replaces: dykesOnBikes
comment: A chartered motorcycle club with many loosely affiliated chapters that are comprised of lesbian members who identify as dykes; known for their participation in gay pride events.
comment: Un club de motociclistas autorizado con muchas secciones libremente afiliadas que están compuestas por miembros lesbianas que se autoidentifican como bolleras; conocido por su participación en eventos del orgullo gay.
broader: Lesbian culture
change note: Version 4.2.0
has top concept: Subcultures
in scheme: v3
preferred label: Dykes on Bikes
related: LGBTQ+ motorcycle clubs
related: Leather and kink clubs

Fa'afafine
type: Concept
issued: 2019-05-14
modified: 2025-02-23
replaces: faafafine
comment: In New Zealand, Samoan people who were assigned male at birth but behave in feminine ways and may consider themselves women.
comment: En Nueva Zelanda, los samoanos a quienes se les asignó al sexo masculino al nacer pero que se comportan de manera femenina y pueden considerarse mujeres.
broader: Non-Euro-American gender and sexual identities
broader: MVPFAFF+
change note: Version 4.2.0
has top concept: Gender
in scheme: v3
related: Fa'afatama

Fag stags
type: Concept
issued: 2019-05-14
modified: 2025-02-23
replaces: fagStags
comment: Slang for heterosexual men who enjoy the company of gay men.
comment: Jerga para hombres heterosexuales que disfrutan de la compañía de hombres gay.
alternative label: Mosca de la fruta
broader: Heterosexual men
change note: Version 4.2.0
has top concept: Heterosexuals
in scheme: v3
preferred label: fag stag
related: Friendships
related: Social privilege

Female impersonators
type: Concept
issued: 2019-05-14
modified: 2025-02-23
replaces: femaleImpersonators
comment: Historical term describing performers, often male-identified people, who enact female personas for the purpose of entertainment, often for straight audiences. Eclipsed by other terms (such as drag queen) in the late 20th century.
comment: Término histórico para describir a artistas, a menudo, personas que se identificaban como masculinas, que encarnan personajes femeninos con fines de entretenimiento, a menudo, para audiencias heterosexuales. Fue por otros términos (como "drag queen") a finales del siglo XX.
alternative label: Imitador femenino
broader: LGBTQ+ theater
change note: Version 4.2.0
has top concept: LGBTQ+ theater
in scheme: v3
preferred label: Imitadores femeninos
related: Drag queens
related: Female impersonation shows

Female masculinity
type: Concept
issued: 2019-05-14
modified: 2025-03-20
replaces: femaleMasculinity
comment: Form of masculinity enacted by people with a female or feminine gender identity, often by performing masculine roles, characteristics, and styles of dress.
comment: Forma de masculinidad representada por personas con una identidad de género femenina, a menudo, por medio de la actuación de roles, características y estilos de vestir masculinos.
broader: Masculinities
change note: Version 4.2.0
has top concept: Gender
in scheme: v3
preferred label: Masculinidad femenina
related: Bois
related: Butches

Fingering
type: Concept
issued: 2019-05-14
modified: 2025-02-23
replaces: fingering
comment: Sexual act involving the use of and insertion of the fingers to stimulate the vagina and/or anus.
comment: Acto sexual que consiste en utilizar e introducir los dedos para estimular la vagina y/o el ano.
alternative label: Finger banging
alternative label: Finger fucking
alternative label: Dar dedo
alternative label: Dedeo
alternative label: Penetración digital
alternative label: Hacer un dedo
alternative label: Hacerse un dedo
alternative label: Hacer dedos
alternative label: Hacerse dedos
broader: Manual sex
broader: Vaginal sex
change note: Version 4.2.0
has top concept: Sex (Act)
in scheme: v3
preferred label: Dedear
related: Fisting

Flagellation
type: Concept
issued: 2019-05-14
modified: 2025-02-23
replaces: flagellation
comment: Consensual flogging of a person.
comment: Impacto o latigazos consensuados a una persona.
broader: Whipping
broader: Impact play
change note: Version 4.2.0
has top concept: Eroticism
in scheme: v3
preferred label: Flagelación
related: Whips

Frottage
type: Concept
issued: 2019-05-14
modified: 2025-02-23
replaces: frottage
comment: Non-penetrative sex act in which individuals rub parts of their body (usually the genitals) against another person's body. Not to be confused with "frotteurism" (nonconsensual frottage), though both are often abbreviated as "frot."
comment: Acto sexual sin penetración en el que las personas frotan partes de su cuerpo (generalmente los genitales) contra el cuerpo de otra persona. No debe confundirse con el "frotteurismo" (frottage no consensual), aunque ambos términos suelen abreviarse como "frot".
broader: Sex (Act)
broader: Sexual practices
change note: Version 4.2.0
has top concept: Sex (Act)
in scheme: v3
narrower: Scissoring

Gay community centers
type: Concept
issued: 2019-05-14
modified: 2025-02-23
replaces: gayCommunityCentres
comment: Spaces in which people from gay communities meet for social, education, recreational, or organizing activities.
comment: Espacios donde las personas de comunidades gay se reúnen para actividades sociales, educativas, recreativas u organizativas.
broader: LGBTQ+ community centers
change note: Version 4.2.0
has top concept: LGBTQ+ centers
in scheme: v3
preferred label: Centros comunitarios gay
preferred label: Gay community centres
related: Gay community
related: Gay movement

Gay families
type: Concept
issued: 2019-05-14
modified: 2025-02-23
replaces: gayFamilies
comment: Families, whether biological, adoptive, or chosen, in which one or more individuals identify as gay men.
comment: Familias, ya sean biológicas, adoptivas o elegidas, en las que una o más personas se autoidentifican como hombres gay.
broader: LGBTQ+ families
change note: Version 4.2.0
has top concept: LGBTQ+ families
in scheme: v3
preferred label: Familias gay
related: Children of gay men
related: Gay parents

Gay for pay
type: Concept
issued: 2019-05-14
modified: 2025-02-23
replaces: gayForPay
comment: Sex workers who identify as heterosexual but are paid to perform as if they are gay or lesbian.
comment: Actores o actrices, estrellas pornográficas o trabajadores sexuales que se autoidentifican como heterosexuales pero a quienes se les paga por actuar como si fueran gay.
broader: Sex work
change note: Version 4.2.0
has top concept: Sex industry
in scheme: v3
preferred label: Gay por paga
related: Porn stars
related: Sex workers

Lesbian-gay relations
type: Concept
issued: 2019-05-14
modified: 2025-02-23
replaces: lesbian-gayRelations
comment: Connections between individuals and communities of lesbians and gay men, including historic and ongoing solidarity, advocacy, and activism.
comment: Conexiones entre personas y comunidades de lesbianas y hombres gay, incluida la solidaridad, la incidencia política y el activismo histórico y continuo.
alternative label: Gay-lesbian relations
alternative label: Relaciones gay-lésbicas
broader: Gender relations
change note: Version 4.2.0
has top concept: LGBTQ+ social processes
in scheme: v3
preferred label: Relaciones lésbicas-gay
related: Gay men
related: Lesbians

Gay literature
type: Concept
issued: 2019-05-14
modified: 2025-04-23
replaces: gayLiterature
comment: Written literary works about gay men, gay characters, or gay themes.
comment: Obras literarias escritas sobre hombres gay, personajes gay o temas gay.
broader: LGBTQ+ literature
change note: Version 4.2.0
has top concept: Subcultures
in scheme: v3
preferred label: Literatura gay
related: Gay authors
related: Gay men in literature

Same-sex marriage
type: Concept
issued: 2019-05-14
modified: 2025-02-23
replaces: same-sexMarriage
comment: Legal union between two people of the same sex who are in a partnership. In the United States, same-sex marriage differs from civil unions in that the former is recognized at the federal level, whereas the latter is only recognized at the state level and may not be recognized by other states.
comment: Unión jurídica entre dos personas del mismo sexo que forman una pareja. En los Estados Unidos, el matrimonio entre personas del mismo sexo se diferencia de las uniones civiles en que el primero se reconoce a nivel federal, mientras que el segundo sólo se reconoce a nivel estatal y puede no ser reconocido por otros estados.
alternative label: Gay marriage
alternative label: Lesbian marriage
alternative label: Matrimonio gay
alternative label: Matrimonio lesbiana
broader: Marriage
change note: Version 4.2.0
has top concept: Living arrangements
in scheme: v3
preferred label: Matrimonio entre personas del mismo sexo
related: LGBTQ+ conscientious objection
related: Women's marriages

Gay newsletters
type: Concept
issued: 2019-05-14
modified: 2025-02-23
replaces: gayNewsletters
comment: Serialized print or digital periodicals created by or for gay men, often with the purpose of sharing news and information related to gay communities and issues.
comment: Hombres gay cuyos cerebros procesan, aprenden y/o se comportan de manera diferente a lo que la sociedad considera típico. Algunas de estas diferencias neurológicas pueden presentarse como problemas de aprendizaje, trastornos médicos y otras condiciones.
alternative label: Personas neurodivergentes gay
broader: Gay press
broader: LGBTQ+ newsletters
change note: Version 4.2.0
has top concept: LGBTQ+ press
in scheme: v3
preferred label: Hombres gay neurodivergentes
related: Gay newspapers

Gay newspapers
type: Concept
issued: 2019-05-14
modified: 2025-02-23
replaces: gayNewspapers
comment: Serialized print or digital publications about gay men or gay issues (and typically produced by gay men or gay organizations) that contain news, articles, columns, correspondence, and advertisements.
comment: Publicaciones periódicas impresas o digitales serializadas creadas por o para hombres gay, a menudo con el propósito de compartir noticias e información relacionadas con comunidades y temas gay.
broader: Gay press
broader: LGBTQ+ newspapers
change note: Version 4.2.0
has top concept: LGBTQ+ press
in scheme: v3
preferred label: Boletines gay
related: Gay newsletters

Gay radio
type: Concept
issued: 2019-05-14
modified: 2026-02-23
replaces: gayRadio
comment: Auditory content broadcast on the radio (analog or digital) about gay men and gay issues.
comment: Contenido auditivo emitido por radio (analógica o digital) sobre hombres gay y asuntos gay.
broader: LGBTQ+ radio
change note: Version 4.2.0
has top concept: LGBTQ+ radio
in scheme: v3
preferred label: Radio gay
related: Gay movement
related: Gay podcasts

Gay shame
type: Concept
issued: 2019-05-14
modified: 2025-02-23
replaces: gayShame
comment: Movement within queer communities that is described as a radical alternative to gay culture being brought into the mainstream; directly posits an alternative view of gay pride events and activities that rejects increasing commercialization, corporate sponsors, and "safer" agendas to avoid offending heterosexual supporters and sponsors.
comment: Movimiento dentro de comunidades queer que se describe como una alternativa radical a la incorporación de la cultura gay a la corriente principal; postula directamente una visión alternativa a los eventos y actividades del orgullo gay que rechaza su creciente comercialización, los patrocinadores corporativos y las agendas "más seguras" que evitan ofender a partidarios y patrocinadores heterosexuales.
change note: Version 4.2.0
in scheme: v3
preferred label: Vergüenza gay
related: LGBTQ+ activism
related: Stigma

Gay slang
type: Concept
issued: 2019-05-14
modified: 2025-02-23
replaces: gaySlang
comment: Colloquial or informal language related to gay men or used by gay men.
comment: Lenguaje coloquial o informal relacionado con hombres gay o utilizado por hombres gay.
alternative label: Gay speak
alternative label: Habla gay
alternative label: Modismos gay
alternative label: Argot gay
broader: Gay culture
broader: LGBTQ+ slang
change note: Version 4.2.0
has top concept: Subcultures
in scheme: v3
preferred label: Jerga gay
related: Fairies (Gay culture)

Gay youth literature
type: Concept
issued: 2019-05-14
modified: 2025-02-23
replaces: gayYouthLiterature
comment: Written literary works for an audience of readers from 12-18 years of age, also known as young adult literature or YA; use in reference to youth literature focusing on gay characters or themes.
comment: Obras literarias escritas para una audiencia de lectores de 12 a 18 años de edad, también conocidas como literatura para adultos jóvenes o YA; utilícese en referencia a la literatura juvenil que se centra en personajes o temas gay.
broader: LGBTQ+ youth literature
change note: Version 4.2.0
has top concept: Subcultures
in scheme: v3
preferred label: Literatura juvenil gay
related: Gay and lesbian youth
related: Boys' Love (Genre)

Genderfluid identity
type: Concept
issued: 2019-05-14
modified: 2025-02-23
replaces: genderfluid
comment: A gender identity in which an individual's gender varies over time and across circumstances; some genderfluid people may identify as a mixture of more than one gender simultaneously.
comment: Una identidad de género en la que el género de una persona varía con el tiempo y según las circunstancias; algunas personas de género fluido pueden identificarse como una mezcla de más de un género simultáneamente.
alternative label: Genderfluidity
broader: Gender identity
change note: Version 4.2.0
has top concept: Gender
in scheme: v3
preferred label: Identidad de género fluido
related: Bigender identity
related: Genderfluid people

Girls' friendships
type: Concept
issued: 2019-05-14
modified: 2025-02-23
replaces: girlsFriendships
comment: Connections based on affection and trust between two or more girls.
comment: Conexiones basadas en el afecto y la confianza entre dos o más niñas.
broader: Friendships
broader: Homosociality
change note: Version 4.2.0
has top concept: Relationship satisfaction
in scheme: v3
preferred label: Amistades entre niñas
related: Girls

Grandchildren
type: Concept
issued: 2019-05-14
modified: 2025-02-23
replaces: grandchildren
comment: The children of an individual's children.
comment: Los hijos de los hijos de una persona.
broader: Family members
change note: Version 4.2.0
has top concept: Family members
in scheme: v3
narrower: LGBTQ+ grandchildren
narrower: Grandchildren of LGBTQ+ people
preferred label: Nietos

Grandparents
type: Concept
issued: 2019-05-14
modified: 2025-02-23
replaces: grandparents
comment: The parents of an individual's parents.
comment: Los padres de los padres de una persona.
broader: Family members
change note: Version 4.2.0
has top concept: Family members
in scheme: v3
narrower: LGBTQ+ grandparents
narrower: Grandparents of LGBTQ+ people
preferred label: Abuelos

Hair removal
type: Concept
issued: 2019-05-14
modified: 2025-02-23
replaces: hairRemoval
comment: The process of removing hair from the body through shaving, waxing, depilatories, laser hair removal, etc. May have a social component related to gender identity and/or have an erotic component.
comment: El proceso de eliminación del vello del cuerpo mediante afeitado, depilación, productos depilatorios, depilación láser, etc. Puede tener un componente social relacionado con la identidad de género y/o tener un componente erótico.
alternative label: Shaving
alternative label: Waxing
alternative label: Eliminación del vello
alternative label: Afeitarse
broader: Gender expression
change note: Version 4.2.0
has top concept: Gender
in scheme: v3
preferred label: Depilación
related: Transitioning (Gender)
related: Wax play

Herbal treatments
type: Concept
issued: 2019-05-14
modified: 2025-02-23
replaces: herbalTreatments
comment: The use of plants to improve health, prevent disease, and/or treat illness.
comment: El uso de plantas para mejorar la salud, prevenir enfermedades y/o tratar enfermedades.
alternative label: Tratamientos herbales
alternative label: Tratamientos con hierbas
broader: Therapies
change note: Version 4.2.0
has top concept: Medical care
in scheme: v3
preferred label: Tratamientos de hierbas
related: No hormone identity
related: Non-operative

Heterosexual boys
type: Concept
issued: 2019-05-14
modified: 2025-02-23
replaces: heterosexualBoys
comment: Boys (typically children or youth younger than 18) who are heterosexual.
comment: Niños (normalmente menores de 18 años) que son heterosexuales.
alternative label: Straight boys
broader: Boys
broader: Heterosexual youth
broader: Heterosexual children
change note: Version 4.2.0
has top concept: Family members
in scheme: v3
preferred label: Niños heterosexuales

Heterosexual feminism
type: Concept
issued: 2019-05-14
modified: 2025-02-23
replaces: heterosexualFeminism
comment: A form of feminism that prioritizes the experiences of heterosexual women and focuses on securing equitable economic, political, and social rights for heterosexual women. Often discussed in juxtaposition to political lesbianism.
comment: Una forma de feminismo que prioriza las experiencias de las mujeres heterosexuales y se centra en garantizar derechos económicos, políticos y sociales equitativos para las mujeres heterosexuales. A menudo se discute en yuxtaposición al lesbianismo político.
broader: Feminism
change note: Version 4.2.0
has top concept: Feminism
in scheme: v3
preferred label: Feminismo heterosexual
related: Lesbian feminism
related: Social privilege

Heterosexual girls
type: Concept
issued: 2019-05-14
modified: 2025-02-23
replaces: heterosexualGirls
comment: Girls (typically children or youth younger than 18) who are heterosexual.
comment: Niñas (normalmente menores de 18 años) que son heterosexuales.
alternative label: Straight girls
broader: Girls
broader: Heterosexual youth
broader: Heterosexual children
change note: Version 4.2.0
has top concept: Family members
in scheme: v3
preferred label: Niñas heterosexuales

Serodiscordant couples
type: Concept
issued: 2019-05-14
modified: 2025-02-23
replaces: serodiscordantCouples
comment: Partnerships in which one person has HIV and the other does not.
comment: Parejas en las que una persona tiene VIH y la otra no.
alternative label: HIV-serodiscordant couples
alternative label: Parejas serodiscordantes-VIH
change note: Version 4.2.0
in scheme: v3
preferred label: Parejas serodiscordantes
related: HIV-negative people
related: HIV-positive people

Homonormativity
type: Concept
issued: 2019-05-14
modified: 2025-02-23
replaces: homonormativity
comment: The projection of heteronormative ideals and constructs onto LGBTQ+ cultures and identities, predicated on the assumption that LGBTQ+ people (particularly cisgender gay men and lesbians) must conform to the norms and values of heterosexuality (e.g., the gender binary, marriage, procreation, and monogamy) in order to be viewed as "normal" and gain social acceptance.
comment: La proyección de ideales y construcciones homonormativas en culturas e identidades LGBTQ+, basada en el supuesto de que las personas LGBTQ+ (particularmente hombres gay y lesbianas cisgénero) deben ajustarse a las normas y valores de la heterosexualidad (por ejemplo, el binario de género, el matrimonio, la procreación y la monogamia) para ser vistos como "normales" y ganar aceptación social.
alternative label: Homosexual norms
alternative label: Normas homosexuales
broader: Social norms
change note: Version 4.2.0
has top concept: Social norms
in scheme: v3
preferred label: Homonormatividad
related: Normalization
related: Heteronormativity

Homophiles
type: Concept
issued: 2019-05-14
modified: 2026-02-24
replaces: homophiles
comment: Outdated term for lesbians and gay men. The use of the word began to disappear with the emergence of the gay liberation movement of the late 1960s and early 1970s.
comment: Término obsoleto para lesbianas y hombres gay. El uso de la palabra comenzó a desaparecer con el surgimiento del movimiento de liberación gay a finales de la década de los sesenta y principios de los setenta.
broader: LGBTQ+ historical terms
change note: Version 4.2.0
has top concept: LGBTQ+ historical terms
in scheme: v3
preferred label: Homófilos
related: Sexual minorities
related: Homophile movement

Hormone blockers
type: Concept
issued: 2019-05-14
modified: 2025-02-23
replaces: hormoneBlockers
comment: Medications used to block the body from producing certain hormones in order to replace or supplement them with other types of hormones.
comment: Medicamentos utilizados para impedir que el cuerpo produzca ciertas hormonas con el fin de reemplazarlas o complementarlas con otros tipos de hormonas.
broader: Hormone therapy (Gender)
broader: Medication
change note: Version 4.2.0
has top concept: Medical care
in scheme: v3
narrower: Puberty blockers
preferred label: Bloqueadores hormonales

Hwame
type: Concept
issued: 2019-05-14
modified: 2025-02-23
replaces: hwame
comment: In Native American Mohave tribes, hwame are people assigned female at birth who exhibit masculine traits and are socially male.
comment: En las tribus nativas americanas mohave, los hwame son personas asignadas al sexo femenino al nacer que exhiben rasgos masculinos y son socialmente masculinos.
broader: Non-Euro-American gender and sexual identities
change note: Version 4.2.0
has top concept: Gender
in scheme: v3
related: Alyha
related: Two-Spirit people

Intersex identity
type: Concept
issued: 2019-05-14
modified: 2025-02-23
replaces: intersexIdentity
comment: Used to describe the experience of selfhood of intersex people. Intersex identity is not gender identity, sexual identity, nor sexual orientation. For the subject of intersex variations, use "intersex variations" or "intersex". For the subject of intersex people, use "intersex people". Do not use in place of gender-identity-related terms such as non-binary identity or genderfluid identity.
comment: Se utiliza para describir la experiencia de identidad de las personas intersex. La identidad intersex no es una identidad de género, identidad sexual ni orientación sexual. Para el tema de las variaciones intersex, utilice "variaciones intersex" o "intersex". Para el tema de las personas intersex, utilice "personas intersex". No lo utilice en lugar de términos relacionados con la identidad de género, como identidad no binaria o identidad de género fluido.
change note: Version 4.2.0
in scheme: v3
preferred label: Identidad intersex
related: Intersex
related: Intersex people

Latent homosexuality
type: Concept
issued: 2019-05-14
modified: 2025-02-23
replaces: latentHomosexuality
comment: Term coined by Sigmund Freud to describe erotic attraction towards members of the same sex or gender that is not (and may never be) consciously experienced or expressed openly.
comment: Término acuñado por Sigmund Freud para describir la atracción erótica hacia miembros del mismo sexo o género que no se experimenta (y puede que nunca se experimente) conscientemente ni se expresa abiertamente.
change note: Version 4.2.0
in scheme: v3
preferred label: Homosexualidad latente
related: Denial of sexual orientation
related: Internalized homophobia

Latex gloves
type: Concept
issued: 2019-05-14
modified: 2025-02-23
replaces: latexGloves
comment: Protective coverings for the hands made from latex, a thin-plastic like material; often used as a barrier to protect against STIs while engaging in safer sex practices.
comment: Cubiertas protectoras de látex, un material fino parecido al plástico, para las manos; a menudo se utilizan como barrera para protegerse de las ITS mientras se practican relaciones sexuales seguras.
broader: Sex accessories
broader: Gloves (Erotic)
change note: Version 4.2.0
has top concept: Sex accessories
in scheme: v3
preferred label: Guantes de latex
related: Safer sex

Lavender Scare
type: Concept
issued: 2019-05-14
modified: 2025-02-23
replaces: lavenderScare
comment: Term used to describe the mid-20th century purge of lesbians and gay men in the U.S. government as a result of moral panic incited by Joseph McCarthy and others.
comment: Término utilizado para describir la purga de lesbianas y hombres gay en el gobierno estadounidense a mediados del siglo XX como resultado del pánico moral incitado por Joseph McCarthy y otras personas.
alternative label: Lavender scare
alternative label: Terror lavanda
change note: Version 4.2.0
in scheme: v3
preferred label: Terror lila
related: LGBTQ+ discrimination
related: LGBTQ+ persecutions

Lesbian characters
type: Concept
issued: 2019-05-14
modified: 2025-02-23
replaces: lesbianCharacters
comment: Characters in creative works who are lesbians.
comment: Personajes de obras creativas que son lesbianas.
broader: LGBTQ+ characters
change note: Version 4.2.0
has top concept: LGBTQ+ characters
in scheme: v3
preferred label: Personajes lesbianas
related: Lesbians
related: Lesbian youth

Lesbian choruses
type: Concept
issued: 2019-05-14
modified: 2025-02-23
replaces: lesbianChoruses
comment: Organized groups of lesbians who sing together.
comment: Grupos organizados de lesbianas que cantan juntas.
alternative label: Lesbian choirs
broader: Lesbian culture
broader: LGBTQ+ choruses
change note: Version 4.2.0
has top concept: Subcultures
in scheme: v3
preferred label: Coros lésbicos
related: Gay choruses

Lesbian community centers
type: Concept
issued: 2019-05-14
modified: 2025-02-23
replaces: lesbianCommunityCentres
comment: Spaces in which people from lesbian communities meet for social, education, recreational, or organizing activities.
comment: Espacios en los que personas de comunidades lésbicas se reúnen para realizar actividades sociales, educativas, recreativas u organizativas.
broader: LGBTQ+ community centers
change note: Version 4.2.0
has top concept: LGBTQ+ centers
in scheme: v3
preferred label: Centros comunitarios lésbicos
preferred label: Lesbian community centres
related: Lesbian community
related: Lesbian movement

Lesbian identity
type: Concept
issued: 2019-05-14
modified: 2025-02-23
replaces: lesbianIdentity
comment: Term used to describe the sexual identity of women and femmes who are romantically and/or sexually attracted to other women and femmes. However, not all lesbians are women, and gender non-conforming people who belong to lesbian communities have often identified as lesbian.
comment: Término utilizado para describir la identidad sexual de mujeres y femmes que se sienten atraídas romántica y/o sexualmente por otras mujeres y femmes. Sin embargo, no todas las lesbianas son mujeres, y las personas disidentes de género que pertenecen a comunidades lésbicas a menudo se han identificado como lesbianas.
alternative label: Identidad lésbica
broader: Sexual identity
change note: Version 4.2.0
has top concept: Sexual identity
in scheme: v3
preferred label: Identidad lesbiana
related: Lesbians
related: Lesbian youth

Lesbian literature
type: Concept
issued: 2019-05-14
modified: 2025-04-23
replaces: lesbianLiterature
comment: Written literary works about lesbian characters or themes.
comment: Obras literarias escritas sobre personajes o temas lésbicos.
alternative label: Literatura lesbiana
broader: LGBTQ+ literature
change note: Version 4.2.0
has top concept: Subcultures
in scheme: v3
preferred label: Literatura lésbica
related: Lesbian authors
related: Lesbians in literature

Women's music
type: Concept
issued: 2019-05-14
modified: 2025-02-23
replaces: womensMusic
comment: Genre of music by women, for women, and about women that emerged in the 1960s and 1970s as a form of musical expression of the second-wave feminist movement.
comment: Género de música hecha por mujeres, para mujeres y sobre mujeres que surgió en las décadas de 1960 y 1970 como forma de expresión musical del movimiento feminista de la segunda ola.
alternative label: Lesbian music
alternative label: Wimmin's music
alternative label: Women-identified music
alternative label: Womyn's music
alternative label: Música lesbica
alternative label: Música de mujeres ||
broader: Lesbian culture
change note: Version 4.2.0
has top concept: Subcultures
in scheme: v3
preferred label: Música para mujeres
related: Women's music festivals
related: Lesbian operas

Lesbian newsletters
type: Concept
issued: 2019-05-14
modified: 2025-02-23
replaces: lesbianNewsletters
comment: Serialized print or digital periodicals created by or for lesbians, often with the purpose of sharing news and information related to lesbian communities and lesbian issues.
comment: Publicaciones impresas o digitales serializadas sobre lesbianas o temas lésbicos (y generalmente producidas por lesbianas u organizaciones de lesbianas) que contienen noticias, artículos, columnas, correspondencia y anuncios.
broader: Lesbian press
broader: LGBTQ+ newsletters
change note: Version 4.2.0
has top concept: LGBTQ+ press
in scheme: v3
preferred label: Boletines lésbicos
related: Lesbian newspapers

Lesbian newspapers
type: Concept
issued: 2019-05-14
modified: 2025-02-23
replaces: lesbianNewspapers
comment: Serialized print or digital publications about lesbians or lesbian issues (and typically produced by lesbians or lesbian organizations) that contain news, articles, columns, correspondence, and advertisements.
comment: Publicaciones periódicas impresas o digitales serializadas creadas por o para lesbianas, a menudo con el propósito de compartir noticias e información relacionadas con cuestiones y comunidades lésbicas.
alternative label: Periódicos de lesbianas
alternative label: Diarios lésbicos
broader: Lesbian press
broader: LGBTQ+ newspapers
change note: Version 4.2.0
has top concept: LGBTQ+ press
in scheme: v3
preferred label: Periódicos lésbicos
related: Lesbian newsletters

Lesbian Pagans
type: Concept
issued: 2019-05-14
modified: 2025-02-23
replaces: lesbianPagans
comment: Lesbians who are members of polytheistic religions or other religions outside of the dominant culture that typically incorporate nature worship and/or the sacred feminine, such as Wicca, Druidry, Heathenry, etc. Use to describe lesbians who self-identify as Pagan.
comment: Lesbianas que son miembros de religiones politeístas u otras religiones fuera de la cultura dominante que típicamente incorporan el culto a la naturaleza y/o lo sagrado femenino, como la Wicca, el druidismo, el paganismo, etc. Utilícese para describir a lesbianas que se autoidentifiquen como paganas.
alternative label: Lesbianas paganas
broader: LGBTQ+ Pagans
change note: Version 4.2.0
has top concept: LGBTQ+ African religions
in scheme: v3
preferred label: Paganas lesbianas
related: Lesbian witches

Lesbian radio
type: Concept
issued: 2019-05-14
modified: 2026-02-23
replaces: lesbianRadio
comment: Auditory content broadcast on the radio (analog or digital) about lesbians and lesbian issues.
comment: Contenido auditivo emitido en radio (analógica o digital) sobre lesbianas y asuntos lésbicos.
alternative label: Radio lesbiana
broader: LGBTQ+ radio
change note: Version 4.2.0
has top concept: LGBTQ+ radio
in scheme: v3
preferred label: Radio lésbica
related: Lesbian movement
related: Lesbian podcasts

Lesbian survivors of rape
type: Concept
issued: 2019-05-14
modified: 2025-02-23
replaces: lesbianSurvivorsOfRape
comment: Lesbians who have experienced and survived rape; follow the individual's preference for "victims" or "survivors" whenever possible.
comment: Lesbianas que han sufrido y sobrevivido una violación; siga la preferencia de la persona sobre el uso de "víctimas" o "sobrevivientes" siempre que sea posible.
alternative label: Lesbianas sobrevivientes de violación
broader: Lesbian victims of rape
broader: LGBTQ+ survivors of rape
change note: Version 4.2.0
has top concept: LGBTQ+ people
in scheme: v3
preferred label: Sobrevivientes lesbianas de violación
related: Corrective rape

Lesbian victims of rape
type: Concept
issued: 2019-05-14
modified: 2025-02-23
replaces: lesbianVictimsOfRape
comment: Lesbians who have experienced rape and may or may not have survived; follow the individual's preference for "victims" or "survivors" whenever possible.
comment: Lesbianas que han sufrido una violación y que pueden o no haber sobrevivido; siga la preferencia de la persona sobre el uso de "víctimas" o "sobrevivientes" siempre que sea posible.
alternative label: Víctimas lésbicas de violación
broader: LGBTQ+ victims of rape
change note: Version 4.2.0
has top concept: LGBTQ+ people
in scheme: v3
narrower: Lesbian survivors of rape
preferred label: Víctimas lesbianas de violación
related: Corrective rape

LGBTQ+ birth parents
type: Concept
issued: 2019-05-14
modified: 2025-02-23
replaces: LGBTQBirthParents
comment: In an adoption context, biological or genetic parents who are LGBTQ+ people.
comment: Padres y/o madres biológicos o genéticos de un niño o niños dados en adopción.
alternative label: LGBTQ birth parents
alternative label: Padres biológicos LGBTQ+
alternative label: Madres biológicos LGBTQ+
broader: Birth parents
broader: LGBTQ+ adoption
broader: LGBTQ+ parents
change note: Version 4.2.0
has top concept: LGBTQ+ families
in scheme: v3
preferred label: Madres y padres biológicos LGBTQ+

Chatrooms
type: Concept
issued: 2019-05-14
modified: 2025-07-16
modified: 2025-03-20
replaces: chatrooms
replaces: LGBTQChatrooms
comment: Dedicated websites or online applications used to exchange messages and images with other people, typically in real time.
comment: Sitios web o aplicaciones en línea orientadas a que se utilicen para intercambiar mensajes e imágenes con otras personas, normalmente en tiempo real.
comment: Online websites or applications for virtual, instant communication; use in reference to chatrooms focusing on LGBTQ+ communities or issues, as well as chatrooms with primarily LGBTQ+ members.
comment: Sitios web o aplicaciones en línea para comunicación virtual e instantánea; utilícese en referencia a salas de chat que se centran en comunidades o cuestiones LGBTQ+, así como salas de chat con miembros principalmente LGBTQ+.
alternative label: LGBTQ chatrooms
alternative label: Salas de chat LGBTQ
broader: Social media
broader: LGBTQ+ social media
change note: Version 4.2.0
has top concept: Social media
has top concept: LGBTQ+ social media
in scheme: v3
preferred label: Salas de chat
preferred label: LGBTQ+ chatrooms
preferred label: Salas de chat LGBTQ+

LGBTQ+ chosen families
type: Concept
issued: 2019-05-14
modified: 2025-02-23
replaces: LGBTQChosenFamilies
comment: Groups of LGBTQ+ people who have intentionally chosen to nurture, support, and love one another as family, whether or not they have biological or legal relationships.
comment: Grupos de personas LGBTQ+ que han elegido intencionalmente cuidarse, apoyarse y amarse unas a otras como familia, tengan o no relaciones biológicas o legales.
alternative label: LGBTQ chosen families
alternative label: Familia de elección LGBTQ+
alternative label: Familias elegidas LGBTQ+
broader: LGBTQ+ families
change note: Version 4.2.0
has top concept: LGBTQ+ families
in scheme: v3
narrower: Ballroom families
narrower: Drag families
preferred label: Familias escogidas LGBTQ+

LGBTQ+ fatherhood
type: Concept
issued: 2019-05-14
modified: 2025-02-23
replaces: LGBTQFatherhood
comment: Fatherhood experiences, as experienced by LGBTQ+ people.
comment: Experiencias de paternidad, tal como las viven las personas LGBTQ+.
alternative label: Fatherhood (LGBTQ)
alternative label: LGBTQ fatherhood
alternative label: Paternity (LGBTQ)
alternative label: LGBTQ+ paternity
broader: LGBTQ+ adoptive families
broader: LGBTQ+ parenthood
change note: Version 4.2.0
has top concept: LGBTQ+ families
in scheme: v3
preferred label: Paternidad LGBTQ+
related: Fathers

LGBTQ+ film censorship
type: Concept
issued: 2019-05-14
modified: 2025-02-23
replaces: LGBTQFilmCensorship
comment: The suppression or prohibition of films by LGBTQ+ filmmakers or about LGBTQ+ people and issues; includes censorship due to religious, moral, political, or social objections.
comment: La supresión o prohibición de películas de cineastas LGBTQ+ o sobre personas y temas LGBTQ+; incluye censura por objeciones religiosas, morales, políticas o sociales.
alternative label: LGBTQ film censorship
broader: LGBTQ+ censorship
change note: Version 4.2.0
has top concept: Censorship
in scheme: v3
preferred label: Censura de cine LGBTQ+
related: LGBTQ+ films
related: LGBTQ+ cinema

LGBTQ+ unhoused youth
type: Concept
issued: 2019-05-14
modified: 2025-02-23
replaces: LGBTQHomelessYouth
comment: LGBTQ+ people between the ages of childhood and adulthood who do not have access to stable, safe, and adequate housing; includes youth living in emergency shelters, transitional housing, and on the street.
comment: Personas LGBTQ+ entre las edades de la niñez y la edad adulta que no tienen acceso a una vivienda estable, segura y adecuada; incluye a jóvenes que viven en refugios de emergencia, viviendas de transición y en la calle.
alternative label: LGBTQ+ homeless youth
alternative label: LGBTQ+ unhoused adolescents
alternative label: LGBTQ+ unhoused teenagers
alternative label: LGBTQ+ unsheltered youth
broader: LGBTQ+ unhoused people
broader: LGBTQ+ youth
change note: Version 4.2.0
has top concept: LGBTQ+ people
in scheme: v3
preferred label: Jóvenes LGBTQ+ sin hogar
related: Aromantic youth

LGBTQ+ literary salons
type: Concept
issued: 2019-05-14
modified: 2025-02-23
replaces: LGBTQLiterarySalons
comment: Social gatherings, typically hosted by a notable public figure, for discussing literature or other shared topics; use in reference to literary salons with primarily LGBTQ+ membership or literary salons focused on works featuring LGBTQ+ characters and themes.
comment: Reuniones sociales, normalmente organizadas por una figura pública destacada, para discutir literatura u otros temas compartidos; utilícese en referencia a salones literarios con membresía principalmente LGBTQ+ o salones literarios centrados en obras con personajes y temas LGBTQ+.
alternative label: LGBTQ literary salons
alternative label: Salones literarios LGBTQ
change note: Version 4.2.0
in scheme: v3
preferred label: Salones literarios LGBTQ+
related: LGBTQ+ night life
related: LGBTQ+ literature

LGBTQ+ manga
type: Concept
issued: 2019-05-14
modified: 2025-02-23
replaces: LGBTQMangas
comment: Japanese comics or graphic novels focused on LGBTQ+ people or themes.
comment: Cómics o novelas gráficas japonesas centradas en personas o temas LGBTQ+.
alternative label: LGBTQ manga
alternative label: Manga LGBTQ
broader: LGBTQ+ comics
change note: Version 4.2.0
has top concept: Subcultures
in scheme: v3
preferred label: Manga LGBTQ+
related: Anime and manga fandom
related: Hentai

LGBTQ+ marketing
type: Concept
issued: 2019-05-14
modified: 2025-02-23
replaces: LGBTQMarketing
comment: Marketing strategies and campaigns specifically targeting LGBTQ+ people.
comment: Estrategias y campañas de marketing dirigidas específicamente a personas LGBTQ+.
alternative label: LGBTQ marketing
alternative label: Marketing LGBTQ
alternative label: Mercadeo LGBTQ+
alternative label: Mercadotecnia LGBTQ+
change note: Version 4.2.0
in scheme: v3
preferred label: Marketing LGBTQ+
related: Pinkwashing
related: Queerbaiting

LGBTQ+ restaurants
type: Concept
issued: 2019-05-14
modified: 2025-02-23
replaces: LGBTQRestaurants
comment: Commercial establishments that prepare and serve food and drinks; use in reference to restaurants that cater primarily to LGBTQ+ people or are known to be frequented by LGBTQ+ people.
comment: Establecimientos comerciales que preparan y sirven alimentos y bebidas; utilícese en referencia a restaurantes que atienden principalmente a personas LGBTQ+ o que son conocidos por ser frecuentados por personas LGBTQ+.
alternative label: LGBTQ restaurants
alternative label: Restaurants (LGBTQ)
change note: Version 4.2.0
in scheme: v3
preferred label: Restaurantes LGBTQ+
related: LGBTQ+ night life
related: LGBTQ+ tourism

LGBTQ+ spiritual people
type: Concept
issued: 2019-05-14
modified: 2025-03-20
replaces: LGBTQSpirituality
comment: LGBTQ+ people who hold spiritual beliefs or engage in spiritual practices, typically involving an understanding of something greater than human existence, whether divine or cosmic in nature.
comment: Personas LGBTQ+ que tienen creencias espirituales o participan en prácticas espirituales, que generalmente implican una comprensión de algo más grande que la existencia humana, ya sea de naturaleza divina o cósmica.
alternative label: LGBTQ+ spirituality
alternative label: Espiritualidad LGBTQ+
alternative label: Espirtualidad LGBTQ
change note: Version 4.2.0
in scheme: v3
preferred label: Personas espirituales LGBTQ+
related: LGBTQ+ African religions
related: Queer theology

LGBTQ+ youth centers
type: Concept
issued: 2019-05-14
modified: 2025-04-29
replaces: LGBTQYouthCentres
comment: Spaces in which LGBTQ+ young people meet for social, education, recreational, or organizing activities.
comment: Espacios en los que jóvenes LGBTQ+ se reúnen para realizar actividades sociales, educativas, recreativas u organizativas.
broader: LGBTQ+ centers
change note: Version 4.2.0
has top concept: LGBTQ+ centers
in scheme: v3
preferred label: Centros juveniles LGBTQ+
preferred label: LGBTQ+ youth centres
related: LGBTQ+ youth
related: Social work with LGBTQ+ youth

Licking
type: Concept
issued: 2019-05-14
modified: 2025-02-23
replaces: licking
comment: To touch or pass over with the tongue to moisten or taste; use to describe licking associated in the context of sexual practices or sexual arousal.
comment: Tocar o pasar con la lengua para humedecer o saborear; utilícese para describir el acto de lamer en relación al contexto de prácticas sexuales o de excitación sexual.
alternative label: Lamer
broader: Oral sex
change note: Version 4.2.0
has top concept: Sex (Act)
in scheme: v3
narrower: Rimming
narrower: Cunnilingus
preferred label: Lengüetear

Male bonding
type: Concept
issued: 2019-05-14
modified: 2025-02-23
replaces: maleBonding
comment: Friendship and connection between two or more male-identified people.
comment: Amistad y conexión entre dos o más personas que se autoidentifican como masculinas.
change note: Version 4.2.0
in scheme: v3
preferred label: Vinculación masculina
related: Homosociality
related: Men's friendships

Men's friendships
type: Concept
issued: 2019-05-14
modified: 2025-02-23
replaces: mensFriendships
comment: Connections based on affection and trust between two or more men.
comment: Conexiones basadas en el afecto y la confianza entre dos o más hombres.
alternative label: Male friendships
alternative label: Amistades masculinas
broader: Friendships
broader: Homosociality
change note: Version 4.2.0
has top concept: Relationship satisfaction
in scheme: v3
preferred label: Amistades entre hombres
related: Male bonding

Male impersonators
type: Concept
issued: 2019-05-14
modified: 2025-02-23
replaces: maleImpersonators
comment: Historical term used to describe performers, often female-identified people, who enact male personas for the purpose of entertainment, typically for straight audiences. Only use in historical contexts.
comment: Término histórico utilizado para describir a los artistas, a menudo personas identificadas como mujeres, que representan personajes masculinos con fines de entretenimiento, generalmente para audiencias heterosexuales. Utilícese únicamente en contextos históricos.
broader: LGBTQ+ theater
change note: Version 4.2.0
has top concept: LGBTQ+ theater
in scheme: v3
preferred label: Imitadores masculinos
related: Drag kings
related: Male impersonation shows

Marriage certificates
type: Concept
issued: 2019-05-14
modified: 2025-02-23
replaces: marriageCertificates
comment: Government-issued documents that serve as official records of marriages; can be used in reference to LGBTQ+ people's marriage certificates or their efforts to acquire marriage certificates.
comment: Documentos emitidos por el gobierno que sirven como registros oficiales de matrimonios; se puede utilizar en referencia a los certificados de matrimonio de personas LGBTQ+ o sus esfuerzos por adquirir certificados de matrimonio.
broader: Marriage
broader: Official documentation
change note: Version 4.2.0
has top concept: Living arrangements
in scheme: v3
preferred label: Certificados de matrimonio
related: Marriage law

Marriage licenses
type: Concept
issued: 2019-05-14
modified: 2025-02-23
replaces: marriageLicenses
comment: Legal documents issued by a religious organization or local authority that authorizes marriage. In some jurisdictions a license is necessary to legalize a union, but this varies by locale.
comment: Documentos legales emitidos por una organización religiosa o autoridad local que autoriza el matrimonio. En algunas jurisdicciones es necesaria una licencia para legalizar una unión, pero esto varía según la localidad.
broader: Marriage
broader: Official documentation
change note: Version 4.2.0
has top concept: Living arrangements
in scheme: v3
preferred label: Licencias de matrimonio
related: Marriage law

Mutual masturbation
type: Concept
issued: 2019-05-14
modified: 2025-02-23
replaces: mutualMasturbation
comment: Sex act in which two or more people simultaneously stimulate their own genitalia.
comment: Acto sexual en el que dos o más personas estimulan simultáneamente sus propios genitales.
broader: Masturbation
broader: Sex (Act)
broader: Sexual practices
change note: Version 4.2.0
has top concept: Sex (Act)
in scheme: v3
preferred label: Masturbación mutua

Nádleehi
type: Concept
issued: 2019-05-14
modified: 2025-02-23
replaces: nadleehi
comment: Term used in Native American Navajo tribes to describe people assigned male at birth who take on the role of girls in childhood and women in adulthood.
comment: Término utilizado en las tribus nativo americanas navajos para describir a las personas asignadas al sexo masculino al nacer que asumen el papel de niñas en la niñez y de mujeres en la adultez.
broader: Non-Euro-American gender and sexual identities
change note: Version 4.2.0
has top concept: Gender
in scheme: v3
related: Dilbaa
related: Two-Spirit people

Nipple clamps
type: Concept
issued: 2019-05-14
modified: 2025-02-23
replaces: nippleClamps
comment: Sex toys consisting of clamps, usually connected by a chain, that are attached to the nipples to cause pain and erotic pleasure.
comment: Juguetes sexuales que consisten de pinzas, generalmente conectadas por una cadena, que se sujetan a los pezones para provocar dolor y placer erótico.
broader: Sex accessories
broader: Clamps (Erotic)
change note: Version 4.2.0
has top concept: Sex accessories
in scheme: v3
preferred label: Pinzas para pezones
related: Nipple

Spanking paddles
type: Concept
issued: 2019-05-14
modified: 2025-02-23
replaces: spankingPaddles
comment: A tool with a short handle at one end and a wide, flat surface at the other that is used to strike the buttocks as a form of impact play.
comment: Herramienta con un mango corto en un extremo y una superficie ancha y plana en el otro que se utiliza para golpear las nalgas como forma de juego de impacto.
broader: Sex accessories
change note: Version 4.2.0
has top concept: Sex accessories
in scheme: v3
preferred label: Paletas para nalgadas
related: Spanking
related: Paddling

Parental rights
type: Concept
issued: 2019-05-14
modified: 2025-02-23
replaces: parentalRights
comment: The legal parent-child relationship that may be established by biological relations, at birth, or through adoption. These rights may include child custody and visitation, decision-making authority, and informational access.
comment: La relación legal padres-hijo que puede establecerse por relaciones biológicas, por nacimiento o por adopción. Estos derechos pueden incluir la custodia y el régimen de visitas, la toma de decisiones y el acceso a la información.
broader: Legal status
change note: Version 4.2.0
has top concept: Legal status
in scheme: v3
preferred label: Derechos parentales
related: LGBTQ+ parenthood
related: LGBTQ+ personal and family law

Partner rights
type: Concept
issued: 2019-05-14
modified: 2025-02-23
replaces: partnerRights
comment: Legal, economic, social, and cultural rights afforded to individuals who are in long-term partnerships (e.g., marriage, domestic partnership, civil union) that can include shared health insurance, life insurance benefits, adoption rights, and the authority to make medical and financial decisions on behalf of one's partner.
comment: Derechos legales, económicos, sociales y culturales otorgados a personas que están en parejas a largo plazo (por ejemplo, matrimonio, pareja de hecho, unión civil) que pueden incluir seguro médico compartido, beneficios de seguro de vida, derechos de adopción y la autoridad para tomar decisiones médicas y financieras en nombre de la pareja.
broader: Legal status
change note: Version 4.2.0
has top concept: Legal status
in scheme: v3
preferred label: Derechos de pareja
related: Significant others
related: Partners

Partners of transgender people
type: Concept
issued: 2019-05-14
modified: 2025-02-23
replaces: partnersOfTransgenderPeople
comment: People whose sexual, romantic, or play partner is transgender.
comment: Personas cuya pareja sexual, romántica o de juego es transgénero.
broader: Partners of LGBTQ+ people
change note: Version 4.2.0
has top concept: Partners
in scheme: v3
preferred label: Parejas de personas transgénero
related: Transgender people
related: t4t

Persecution of bisexual people
type: Concept
issued: 2019-05-14
modified: 2026-02-27
replaces: persecutionOfBisexualPeople
comment: Systematic mistreatment of bisexual people on the basis of their sexual identity.
comment: Maltrato sistemático a personas bisexuales por su identidad sexual.
broader: LGBTQ+ persecutions
change note: Version 4.2.0
has top concept: LGBTQ+ persecutions
in scheme: v3
preferred label: Persecución de personas bisexuales
related: Bisexual people
related: Bisexual erasure

Piercings
type: Concept
issued: 2019-05-14
modified: 2025-02-23
replaces: piercings
comment: Small holes or openings made in parts of the body to insert jewelry or implants, whether for aesthetic purposes, spiritual or religious reasons, or sexual pleasure.
comment: Pequeños agujeros o aperturas realizadas en partes del cuerpo para insertar joyas o implantes, ya sea con fines estéticos, espirituales o religiosos, o por placer sexual.
alternative label: Perforación
alternative label: Perforaciones
broader: Body adornment
broader: Body modification
change note: Version 4.2.0
has top concept: Body adornment
in scheme: v3
narrower: Piercing play

Police raids
type: Concept
issued: 2019-05-14
modified: 2025-02-23
replaces: policeRaids
comment: Unexpected and unannounced entry into and searches of residences or establishments by law enforcement officers with the aim of using surprise to seize evidence or arrest suspects. Police raids may be undertaken legally using a search warrant or through exigent circumstances, such as probable cause, though the latter is highly subjective and civilians often have little resources to appeal illegal raids.
comment: Entradas y registros inesperados y sin previo aviso en residencias o establecimientos por parte de agentes de las fuerzas policiales con el objetivo de utilizar la sorpresa para incautar pruebas o detener a sospechosos. Las redadas policiales pueden realizarse legalmente mediante una orden de registro o por circunstancias apremiantes, como la causa probable, aunque esta última es muy subjetiva y los civiles suelen tener pocos recursos para apelar a las redadas ilegales.
alternative label: Dawn raids
alternative label: No-knock raids
broader: Police harassment
change note: Version 4.2.0
has top concept: Harassment
in scheme: v3
narrower: Police raids on LGBTQ+-related establishments
preferred label: Redadas policiales
related: Police

Porn industry
type: Concept
issued: 2019-05-14
modified: 2025-02-23
replaces: pornIndustry
comment: Businesses that sell pornography, or materials intended for sexual arousal, including images, videos, literature, etc.
comment: Negocios que venden pornografía o materiales destinados a la excitación sexual, incluyendo imágenes, vídeos, literatura, etc.
alternative label: Porno industry
alternative label: Pornography industry
alternative label: Industria pornográfica
broader: Sex industry
change note: Version 4.2.0
has top concept: Sex industry
in scheme: v3
preferred label: Industria porno
related: LGBTQ+ porn films
related: LGBTQ+ porn magazines

Prostitution
type: Concept
is replaced by: homoit0001276
issued: 2019-05-14
modified: 2025-01-28
replaces: prostitution
broader: Sex work
broader: Sexual practices
change note: Version 4.2.0
has top concept: Sex industry
in scheme: v3
narrower: Transgender prostitution
related: Sex workers' clients

Puberty blockers
type: Concept
issued: 2019-05-14
modified: 2025-02-23
replaces: pubertyBlockers
comment: Group of medications used to inhibit puberty.
comment: Grupo de medicamentos utilizados para inhibir la pubertad.
broader: Hormone blockers
broader: Medication
change note: Version 4.2.0
has top concept: Medical care
in scheme: v3
preferred label: Bloqueadores de la pubertad
related: Transgender children

Queer characters
type: Concept
issued: 2019-05-14
modified: 2025-02-23
replaces: queerCharacters
comment: Characters in creative works who are queer.
comment: Personajes de obras creativas que son queer.
broader: LGBTQ+ characters
change note: Version 4.2.0
has top concept: LGBTQ+ characters
in scheme: v3
preferred label: Personajes queer
related: Queer children
related: Queer people

Queer identity
type: Concept
issued: 2019-05-14
modified: 2025-02-23
replaces: queerIdentity
comment: Identity term that can be used to describe several not-necessarily-mutually-exclusive understandings of queerness. Queerness can describe identities that exist outside of or between different identities, and also identities that actively resist normative understandings of sexuality and/or gender. This term should only be used for those who self-identify as queer.
comment: Término identitario que se puede utilizar para describir varias interpretaciones de lo queer, no necesariamente mutuamente excluyentes. Lo queer puede describir identidades que existen fuera de o entre diferentes identidades, y también identidades que se resisten activamente a entendimientos normativos de la sexualidad y/o el género. Utilícese únicamente para quienes se autoidentifiquen como queer.
broader: Sexual identity
change note: Version 4.2.0
has top concept: Sexual identity
in scheme: v3
preferred label: Identidad queer
related: Queer children
related: Queer people

Queer literature
type: Concept
issued: 2019-05-14
modified: 2025-04-23
replaces: queerLiterature
comment: Written literary works about queerness, queer characters, or queer themes.
comment: Obras literarias escritas sobre lo queer, personajes queer o temas queer.
broader: LGBTQ+ literature
change note: Version 4.2.0
has top concept: Subcultures
in scheme: v3
preferred label: Literatura queer
related: Queer authors
related: Queer people in literature

Queer men
type: Concept
issued: 2019-05-14
modified: 2025-02-23
replaces: queerMen
comment: Men who identify as queer.
comment: Hombres que se identifican como queer.
broader: Queer people
change note: Version 4.2.0
has top concept: LGBTQ+ people
in scheme: v3
preferred label: Hombres queer
related: Bisexual men
related: Gay men

Queer movement
type: Concept
issued: 2019-05-14
modified: 2025-04-23
replaces: queerMovement
comment: Umbrella term for activism focused on the rights of queer people and issues faced by queer communities.
comment: Término general para el activismo centrado en los derechos de las personas queer y los problemas que enfrentan las comunidades queer.
broader: LGBTQ+ movement
change note: Version 4.2.0
has top concept: Social movements
in scheme: v3
preferred label: Movimiento queer
related: Queer information centers
related: Queer demonstrations

Queer porn films
type: Concept
issued: 2019-05-14
modified: 2025-02-23
replaces: queerPornFilms
comment: Erotic or sexually explicit films featuring queer people.
comment: Películas eróticas o sexualmente explícitas protagonizadas por personas queer.
alternative label: Películas pornográficas queer
broader: LGBTQ+ porn films
broader: Queer erotic art
change note: Version 4.2.0
has top concept: Subcultures
in scheme: v3
preferred label: Películas porno queer
related: Queer erotic films

Ritual homosexuality
type: Concept
issued: 2019-05-14
modified: 2025-02-23
replaces: ritualHomosexuality
comment: Non-reciprocal genital contact, typically fellatio, between younger and older men that takes place during initiation rituals practiced by the Sambari people of Papua New Guinea. This term was developed by Western outsiders and has been strongly criticized by the affected community.
comment: Contacto genital no recíproco, típicamente felación, entre hombres jóvenes y mayores que ocurre durante los rituales de iniciación practicados por el pueblo simbari de Papúa Nueva Guinea. Este término fue desarrollado por extranjeros occidentales y ha sido fuertemente criticado por la comunidad afectada.
broader: Homosexuality
broader: Sexual practices
change note: Version 4.2.0
has top concept: Sexual orientation
in scheme: v3
preferred label: Homosexualidad ritual
related: Indigenous LGBTQ+ people

Sak veng
type: Concept
issued: 2019-05-14
modified: 2025-02-23
replaces: sakVeng
comment: Term used in Cambodia for people assigned male at birth who identify as women; translates to "long hairs."
comment: Término utilizado en Camboya para las personas asignadas al sexo masculino al nacer y que se autoidentifican como mujeres; se traduce como "cabellos largos".
broader: Non-Euro-American gender and sexual identities
change note: Version 4.2.0
has top concept: Gender
in scheme: v3
related: Khteuy
related: Srey sros

Second-wave feminism
type: Concept
issued: 2019-05-14
modified: 2025-02-23
replaces: secondWaveFeminism
comment: Period of feminist political activity (also referred to as women’s liberation) beginning in the early 1960s that critiqued male-dominated institutions and cultural practices in society.
comment: Período de actividad política feminista (también conocido como liberación de la mujer) que comenzó a principios de la década de 1960 y que criticó las instituciones y prácticas culturales dominadas por los hombres en la sociedad.
alternative label: Second wave feminism
broader: Feminism
change note: Version 4.2.0
has top concept: Feminism
in scheme: v3
preferred label: Feminismo de segunda ola
related: Trans-exclusionary radical feminism
related: Second-wave feminists

Self-insemination
type: Concept
issued: 2019-05-14
modified: 2025-02-23
replaces: self-insemination
comment: The practice of using collected sperm to induce one's own pregnancy outside of a clinical environment.
comment: La práctica de utilizar esperma recolectado para inducir el propio embarazo fuera de un entorno clínico.
broader: Insemination
broader: Conception by LGBTQ+ people
broader: Assisted reproduction
change note: Version 4.2.0
has top concept: LGBTQ+ family planning
in scheme: v3
preferred label: Autoinseminación

Sex tourism
type: Concept
issued: 2019-05-14
modified: 2025-02-23
replaces: sexTourism
comment: The practice of traveling with the intention of soliciting sex work, typically to countries where sex work is legal, decriminalized, or less stigmatized. Sex tourism often presents ethical concerns, such as the economic gap between tourists and residents, differences in age of consent laws globally, and the selective enforcement of anti-sex work laws by police.
comment: La práctica de viajar con la intención de solicitar trabajo sexual, normalmente a países donde el trabajo sexual es legal, está despenalizado o menos estigmatizado. El turismo sexual suele plantear problemas éticos, como la brecha económica entre turistas y residentes, las diferencias en las leyes sobre la edad de consentimiento en todo el mundo y la aplicación selectiva de las leyes contra el trabajo sexual por parte de la policía.
broader: Sex industry
change note: Version 4.2.0
has top concept: Sex industry
in scheme: v3
narrower: LGBTQ+ sex tourism
preferred label: Turismo sexual
related: Sex work

Sexting
type: Concept
issued: 2019-05-14
modified: 2025-02-23
replaces: sexting
comment: Act of sending sexually explicit messages or photographs, primarily between mobile phones.
comment: Acto de enviar mensajes o fotografías sexualmente explícitas, principalmente entre teléfonos móviles.
broader: Sex (Act)
change note: Version 4.2.0
has top concept: Sex (Act)
in scheme: v3
preferred label: Sextear
related: Pornography
related: Sexuality

Sexual assault
type: Concept
issued: 2019-05-14
modified: 2025-02-23
replaces: sexualAssault
comment: Sexual behavior or contact targeting an individual who has not consented; includes nonconsensual sex acts that may not be illegal or punishable by law in the given location or time period.
comment: Comportamiento o contacto sexual dirigido a una persona que no ha dado su consentimiento; incluye actos sexuales no consensuales que pueden no ser ilegales o punibles por la ley en un lugar o período de tiempo determinados.
broader: Sexual violence
change note: Version 4.2.0
has top concept: Sexual violence
in scheme: v3
preferred label: Agresión sexual
related: LGBTQ+ domestic violence
related: Rape culture

Sexual autonomy
type: Concept
issued: 2019-05-14
modified: 2025-02-23
replaces: sexualAutonomy
comment: One’s ability or prerogative to freely choose when, with whom, and under what circumstances they engage in sexual activity or relationships.
comment: La capacidad o prerrogativa de una persona para elegir libremente cuándo, con quién y bajo qué circunstancias participar en actividades o relaciones sexuales.
change note: Version 4.2.0
in scheme: v3
preferred label: Autonomía sexual
related: Sexual preference
related: Sexuality

Sexual reform
type: Concept
issued: 2019-05-14
modified: 2025-02-23
replaces: sexualReform
comment: Term used to describe the European movements for sexual reform in the 20th century.
comment: Término utilizado para describir los movimientos europeos por la reforma sexual en el siglo XX.
change note: Version 4.2.0
in scheme: v3
preferred label: Reforma sexual
related: LGBTQ+ social processes
related: Sexuality

Sexually abused LGBTQ+ children
type: Concept
issued: 2019-05-14
modified: 2025-02-23
replaces: sexuallyAbusedLGBTQChildren
comment: LGBTQ+ children younger than 18 years of age who are currently experiencing or have experienced sexual abuse.
comment: Niños LGBTQ+ menores de 18 años que actualmente sufren o han sufrido abuso sexual.
alternative label: Sexually abused LGBTQ children
alternative label: Niños LGBTQ abusados sexualmente
broader: LGBTQ+ children
broader: LGBTQ+ victims of sexual abuse
change note: Version 4.2.0
has top concept: Family members
in scheme: v3
preferred label: Niños LGBTQ+ abusados sexualmente
related: LGBTQ+ victims of rape

Single people
type: Concept
issued: 2019-05-14
modified: 2025-02-23
replaces: singlePeople
comment: People who are not involved in any committed sexual or romantic relationships, including marriages, civil unions, or other established partnerships.
comment: Personas que no están involucradas en ninguna relación sexual o romántica comprometida, incluidos matrimonios, uniones civiles u otras relaciones establecidas.
alternative label: Singles
alternative label: Solteros
alternative label: Solteras
broader: Marital status
change note: Version 4.2.0
has top concept: Living arrangements
in scheme: v3
narrower: LGBTQ+ single parents
preferred label: Personas solteras
related: Divorced people

Sissies
type: Concept
issued: 2019-05-14
modified: 2025-02-23
replaces: sissies
comment: Pejorative term applied to boys or men who are perceived to be effeminate or do not conform to traditional masculine roles.
comment: Término peyorativo que se aplica a niños u hombres que son percibidos como afeminados o que no se ajustan a los roles masculinos tradicionales.
alternative label: Sissy boys
alternative label: Maricón
alternative label: Niños marica
broader: Boys
broader: Gender roles
change note: Version 4.2.0
has top concept: Family members
in scheme: v3
preferred label: Maricas
related: Queens (Gay culture)

Sistergirls
type: Concept
issued: 2019-05-14
modified: 2025-02-23
replaces: sistergirls
comment: Indigenous Australian term for people who transition from male to female.
comment: Término indígena australiano para las personas que hacen la transición de hombre a mujer.
alternative label: Sistagirls
broader: Non-Euro-American gender and sexual identities
change note: Version 4.2.0
has top concept: Gender
in scheme: v3
related: Aboriginal Australian LGBTQ+ people
related: Brotherboys

Srey sros
type: Concept
issued: 2019-05-14
modified: 2025-02-23
replaces: sreySros
comment: Term used in Cambodia for people assigned male at birth who identify as women; translates to "charming girls."
comment: Término utilizado en Camboya para las personas asignadas al sexo masculino al nacer y que se autoidentifican como mujeres; se traduce como "chicas encantadoras".
broader: Non-Euro-American gender and sexual identities
change note: Version 4.2.0
has top concept: Gender
in scheme: v3
related: Khteuy
related: Sak veng

Terminal care (AIDS)
type: Concept
issued: 2019-05-14
modified: 2025-02-23
replaces: terminalCareAIDS
comment: End-of-life care for those with AIDS and their families; aimed at optimizing quality of life and mitigating suffering.
comment: Cuidados al final de la vida para personas con SIDA y sus familias; destinados a optimizar la calidad de vida y mitigar el sufrimiento.
broader: Health care for LGBTQ+ people
change note: Version 4.2.0
has top concept: Health care for LGBTQ+ people
in scheme: v3
preferred label: Cuidados terminales (SIDA)
related: LGBTQ+ death and dying
related: AIDS death and dying

Tom
type: Concept
issued: 2019-05-14
modified: 2025-02-23
replaces: tom
comment: In Thailand, this term is used to describe people assigned female at birth who exhibit masculine traits, often partnering with feminine dees; similar to a butch in U.S. lesbian culture.
comment: En Tailandia, este término se utiliza para describir a las personas asignadas al sexo femenino al nacer y que exhiben rasgos masculinos, a menudo, emparejándose con dees femeninos; similar a una marimacha en la cultura lésbica estadounidense.
broader: Non-Euro-American gender and sexual identities
change note: Version 4.2.0
has top concept: Gender
in scheme: v3
related: Dee
related: Katoey

Toxic masculinity
type: Concept
issued: 2019-05-14
modified: 2025-02-23
replaces: toxicMasculinity
comment: Set of attitudes, behaviors, and cultural norms stereotypically associated with or expected of men and which are regarded as having a negative impact on men and society at large.
comment: Conjunto de actitudes, comportamientos y normas culturales asociadas o esperadas de forma estereotípica de los hombres y que se considera que tienen un impacto negativo en los hombres y la sociedad en general.
broader: Masculinities
change note: Version 4.2.0
has top concept: Gender
in scheme: v3
preferred label: Masculinidad tóxica
related: Machismo
related: Social privilege

Transsexuality
type: Concept
issued: 2019-05-14
modified: 2025-02-23
replaces: transsexuality
comment: Term used to describe the identity of people who transition from female to male or male to female. Generally refers to individuals who transition their physical bodies to align with their gender identities. Though this term was popular in the 20th century and is still in use today, it has been largely replaced by "transgender identity" and "trans identity." Some but not all people regard this term as outdated and offensive. Only use to describe people who self-identify as transsexual.
comment: Término utilizado para describir la identidad de las personas que hacen la transición de mujer a hombre o de hombre a mujer. Generalmente se refiere a personas que hacen la transición de sus cuerpos físicos para alinearse con sus identidades de género. Aunque este término fue popular en el siglo XX y todavía se utiliza hoy en día, ha sido reemplazado en gran medida por "identidad transgénero" e "identidad trans". Algunas personas, pero no todas, consideran este término obsoleto y ofensivo. Utilícese únicamente para describir a personas que se identifiquen como transexuales.
alternative label: Transexuality
preferred label: Transexualidad
change note: Version 4.2.0
in scheme: v3
related: Transsexual people
related: Transsexualism

Transgender characters
type: Concept
issued: 2019-05-14
modified: 2025-02-23
replaces: transgenderCharacters
comment: Characters in creative works who are transgender.
comment: Personajes de obras creativas que son transgénero.
broader: LGBTQ+ characters
change note: Version 4.2.0
has top concept: LGBTQ+ characters
in scheme: v3
preferred label: Personajes transgénero
related: Transgender people
related: Transgender children

Transgender daughters
type: Concept
issued: 2019-05-14
modified: 2025-02-23
replaces: transgenderDaughters
comment: Daughters who identify as transgender.
comment: Hijas que se identifican como transgénero.
broader: LGBTQ+ daughters
broader: Transgender people
broader: Transgender children
change note: Version 4.2.0
has top concept: LGBTQ+ people
in scheme: v3
preferred label: Hijas transgénero

Transgender information centers
type: Concept
issued: 2019-05-14
modified: 2025-02-23
replaces: transgenderInformationCentres
comment: Institutions providing education, support, and information about transgender issues and transgender communities to transgender people.
comment: Instituciones que brindan educación, apoyo e información sobre asuntos transgénero y comunidades transgénero a personas transgénero.
alternative label: Transgender documentation centers
alternative label: Centros de documentación transgénero
broader: LGBTQ+ information centers
change note: Version 4.2.0
has top concept: LGBTQ+ centers
in scheme: v3
preferred label: Centros de información transgénero
preferred label: Transgender information centres
related: Transgender movement
related: Transgenderism

Transgender fathers
type: Concept
issued: 2019-05-14
modified: 2025-02-23
replaces: transgenderFathers
comment: Transgender people who are fathers.
comment: Personas transgénero que son padres.
broader: Transgender people
broader: Transgender parents
broader: LGBTQ+ fathers
change note: Version 4.2.0
has top concept: LGBTQ+ people
in scheme: v3
preferred label: Padres transgénero

Transgender literature
type: Concept
issued: 2019-05-14
modified: 2025-04-23
replaces: transgenderLiterature
comment: Written literary works about transgender characters or themes.
comment: Obras literarias escritas sobre personajes o temas transgénero.
broader: LGBTQ+ literature
change note: Version 4.2.0
has top concept: Subcultures
in scheme: v3
preferred label: Literatura transgénero
related: Transgender authors
related: Transgender people in literature

Transgender mothers
type: Concept
issued: 2019-05-14
modified: 2025-02-23
replaces: transgenderMothers
comment: Transgender people who are mothers.
comment: Personas transgénero que son madres.
alternative label: Mamás transgénero
broader: Transgender people
broader: Transgender parents
broader: LGBTQ+ mothers
change note: Version 4.2.0
has top concept: LGBTQ+ people
in scheme: v3
preferred label: Madres transgénero

Transgender newsletters
type: Concept
issued: 2019-05-14
modified: 2025-02-23
replaces: transgenderNewsletters
comment: Serialized print or digital periodicals created by or for transgender people, often with the purpose of sharing news and information related to transgender communities and transgender issues.
comment: Publicaciones periódicas impresas o digitales serializadas creadas por o para personas transgénero, a menudo con el propósito de compartir noticias e información relacionadas con comunidades transgénero y asuntos transgénero.
broader: LGBTQ+ newsletters
broader: Transgender press
change note: Version 4.2.0
has top concept: LGBTQ+ press
in scheme: v3
preferred label: Boletines transgénero
related: Transgender newspapers

Transgender newspapers
type: Concept
issued: 2019-05-14
modified: 2025-02-23
replaces: transgenderNewspapers
comment: Serialized print or digital publications about transgender people or transgender issues (and typically produced by transgender people or transgender organizations) that contain news, articles, columns, correspondence, and advertisements.
comment: Publicaciones impresas o digitales serializadas sobre personas transgénero o asuntos transgénero (y generalmente producidas por personas transgénero u organizaciones transgénero) que contienen noticias, artículos, columnas, correspondencia y anuncios.
alternative label: Diarios transgénero
broader: LGBTQ+ newspapers
broader: Transgender press
change note: Version 4.2.0
has top concept: LGBTQ+ press
in scheme: v3
preferred label: Periódicos transgénero
related: Transgender newsletters

Transgender porn films
type: Concept
issued: 2019-05-14
modified: 2025-02-23
replaces: transgenderPornFilms
comment: Erotic or sexually explicit films featuring transgender people.
comment: Películas eróticas o sexualmente explícitas protagonizadas por personas transgénero.
alternative label: Películas pornográficas transgénero
broader: LGBTQ+ porn films
broader: Transgender erotic art
change note: Version 4.2.0
has top concept: Subcultures
in scheme: v3
preferred label: Películas porno transgénero
related: Transgender erotic films

Transgender sons
type: Concept
issued: 2019-05-14
modified: 2025-02-23
replaces: transgenderSons
comment: Transgender people who are sons.
comment: Personas transgénero que son hijos.
broader: LGBTQ+ sons
broader: Transgender people
broader: Transgender children
change note: Version 4.2.0
has top concept: LGBTQ+ people
in scheme: v3
preferred label: Hijos transgénero

Tribades
type: Concept
issued: 2019-05-14
modified: 2025-02-23
replaces: tribades
comment: Historical term for individuals who engage in the sexual practice of tribadism; use only in historical contexts.
comment: Término histórico para personas que ejercen la práctica sexual del tribadismo; utilícese únicamente en contextos históricos.
alternative label: Cachaperas
alternative label: Tortilleras
alternative label: Tortalleras
alternative label: Tortaletas
alternative label: Tortas
alternative label: Tribadas
broader: LGBTQ+ historical terms
change note: Version 4.2.0
has top concept: LGBTQ+ historical terms
in scheme: v3
preferred label: Bolleras
related: Lesbians
related: Tribadism

Uranians
type: Concept
issued: 2019-05-14
modified: 2025-02-23
replaces: uranians
comment: 19th century term used to refer to gender and sexual minorities; use only in historical contexts.
comment: Término del siglo XIX utilizado para referirse a minorías sexuales y de género; utilícese únicamente en contextos históricos.
alternative label: Urnings
broader: LGBTQ+ historical terms
change note: Version 4.2.0
has top concept: LGBTQ+ historical terms
in scheme: v3
preferred label: Uranistas
related: Sexual minorities
related: Uranism

Vaginal fisting
type: Concept
issued: 2019-05-14
modified: 2025-02-23
replaces: vaginalFisting
comment: Sexual practice of inserting a fist into a vagina.
comment: Práctica sexual de introducir un puño en la vagina.
broader: Fisting
broader: Vaginal sex
change note: Version 4.2.0
has top concept: Sexual practices
in scheme: v3
preferred label: Fisting vaginal
related: Anal fisting

Virginity
type: Concept
issued: 2019-05-14
modified: 2025-02-23
replaces: virginity
comment: Term used to describe the sexual status of people who have never engaged in sexual activity.
comment: Término utilizado para describir el estado sexual de personas que nunca han tenido actividad sexual.
broader: Sexual abstinence
change note: Version 4.2.0
has top concept: Sex (Act)
in scheme: v3
preferred label: Virginidad
related: Asexuality
related: Sexual preference

Voice
type: Concept
issued: 2019-05-14
modified: 2025-02-23
replaces: voice
comment: Sound produced by the larynx and vocal tract that is used for communication and expression.
comment: Sonido producido por la laringe y el tracto vocal que se utiliza para la comunicación y la expresión.
broader: Secondary sex characteristics
change note: Version 4.2.0
has top concept: Sex (Body)
in scheme: v3
preferred label: Voz
related: Feminizing vocal surgery
related: Masculinizing vocal surgery

Wanking
type: Concept
issued: 2019-05-14
modified: 2025-02-23
replaces: wanking
comment: Slang term for masturbation commonly used in the United Kingdom and Ireland; typically refers to the manual stimulation of the penis.
comment: Término de la jerga para la masturbación, comúnmente utilizado en el Reino Unido e Irlanda; normalmente se refiere a la estimulación manual del pene.
alternative label: Haciendo una paja
alternative label: Hacerse una puñeta
broader: Manual sex
broader: Phallic sex
broader: Wacking off
change note: Version 4.2.0
has top concept: Sex (Act)
in scheme: v3

Whakawāhine
type: Concept
issued: 2019-05-14
modified: 2025-02-23
replaces: whakawahine
comment: In Māori culture in New Zealand, this term is used to describe people assigned male at birth who pursue traditionally female roles.
comment: En la cultura maorí de Nueva Zelanda, este término se utiliza para describir a las personas asignadas al sexo masculino al nacer y que desempeñan roles tradicionalmente femeninos.
alternative label: Whakawahine
broader: Non-Euro-American gender and sexual identities
broader: MVPFAFF+
change note: Version 4.2.0
has top concept: Gender
in scheme: v3
related: Whakatane

Women's music festivals
type: Concept
issued: 2019-05-14
modified: 2025-02-23
replaces: womensMusicFestivals
comment: Organized events typically lasting more than one day that feature performances by women’s musical groups and performers. Though centered on music, women’s music festivals may also incorporate aspects of lesbian and feminist culture by offering workshops, arts and crafts, and community resources.
comment: Eventos organizados que suelen durar más de un día y que cuentan con presentaciones de artistas y grupos musicales de mujeres. Aunque se centran en la música, los festivales de música para mujeres también pueden incorporar aspectos de la cultura lésbica y feminista al ofrecer talleres, artes y manualidades, y recursos comunitarios.
alternative label: Festivales de música de mujeres
broader: Women's events
change note: Version 4.2.0
has top concept: Women's events
in scheme: v3
preferred label: Festivales de música para mujeres
related: Women's music
related: Womyn

X-jendā
type: Concept
issued: 2019-05-14
modified: 2025-02-23
replaces: XJenda
comment: Japanese term for people who do not fit within the categories of man or woman; includes individuals born intersex, female, or male, and is often abbreviated using FTX, MTX, or XTX to describe individuals' transitions; some definitions equate the term to genderqueer or beyond the binary identities.
comment: Término japonés para personas que no encajan en las categorías de hombre o mujer; incluye a personas nacidas intersex, mujeres u hombres, y a menudo se abrevia utilizando FTX, MTX o XTX para describir las transiciones de las personas; algunas definiciones equiparan el término con genderqueer o más allá de las identidades binarias.
broader: Non-Euro-American gender and sexual identities
change note: Version 4.2.0
has top concept: Gender
in scheme: v3
related: FtXs
related: MtXs

Erotomania
type: Concept
issued: 2020-06-02
modified: 2025-02-23
replaces: erotomania
comment: Condition characterized by an individual's persistent and often mistaken belief that another person is infatuated or in love with them. Can also be used to describe a level or frequency of sexual desire perceived as excessive within a given culture. Medical doctors and psychologists have historically diagnosed LGBTQ+ people with erotomania in order to wrongly treat their identities and desires as medical disorders. Should only be used in a historical context or if an individual self-identifies with the term.
comment: Condición caracterizada por la creencia persistente y a menudo errónea de una persona de que otra persona está encaprichada o enamorada de él. También se puede utilizar para describir un nivel o una frecuencia de deseo sexual percibida como excesiva dentro de una cultura determinada. Históricamente, los médicos y psicólogos han diagnosticado a las personas LGBTQ+ con erotomanía para erróneamente tratar sus identidades y deseos como trastornos médicos. Utilícese únicamente en un contexto histórico o si una persona se identifica con el término.
alternative label: Clinical erotomania
alternative label: De Clérambault syndrome
alternative label: De Clérambault's syndrome
alternative label: Obsessional erotomania
alternative label: Primary erotomania
alternative label: Erotomanía clínica
alternative label: Síndrome de De Clérambault
alternative label: Erotomanía obsesiva
alternative label: Erotomanía primaria
change note: Version 4.2.0
in scheme: v3
preferred label: Erotomanía
related: Hypersexuality
related: LGBTQ+ people with sexual addictions

Lesbian erotic literature
type: Concept
issued: 2020-06-03
modified: 2025-02-23
replaces: lesbianEroticLiterature
comment: Literary works that have erotic or sexual elements; use in reference to erotic literature focusing on lesbian characters or themes.
comment: Obras literarias que tiene elementos eróticos o sexuales; utilícese en referencia a la literatura erótica que se centra en personajes o temas lésbicos.
broader: LGBTQ+ erotic literature
broader: Femslash
change note: Version 4.2.0
has top concept: Erotica
in scheme: v3
preferred label: Literatura erótica lesbiana
related: Yuri

Lesbian biographies
type: Concept
issued: 2020-06-03
modified: 2025-02-23
replaces: lesbianBiographies
comment: Written accounts of the lives of lesbians. For written accounts of lesbians' lives written by the subject, use "Lesbian autobiographies."
comment: Relatos escritos de la vida de mujeres conocidas por ser lesbianas.
broader: LGBTQ+ biographies
change note: Version 4.2.0
has top concept: LGBTQ+ biographies
in scheme: v3
preferred label: Biografías lesbianas
related: Lesbian autobiographies
related: Lesbian authors

Bisexual biographies
type: Concept
issued: 2020-06-03
modified: 2025-02-23
replaces: bisexualBiographies
comment: Written accounts of the lives of bisexual people. For written accounts of bisexual people's lives written by the subject, use "Bisexual autobiographies."
comment: Relatos escritos de la vida de personas conocidas por ser bisexuales.
broader: LGBTQ+ biographies
change note: Version 4.2.0
has top concept: LGBTQ+ biographies
in scheme: v3
preferred label: Biografías bisexuales
related: Bisexual autobiographies
related: Bisexual authors

Transgender biographies
type: Concept
issued: 2020-06-03
modified: 2025-02-23
replaces: transgenderBiographies
comment: Written accounts of the lives of trans people. For written accounts of trans people's lives written by the subject, use "Transgender autobiographies."
comment: Relatos escritos de la vida de personas conocidas por ser transgénero.
alternative label: Trans biographies
broader: LGBTQ+ biographies
change note: Version 4.2.0
has top concept: LGBTQ+ biographies
in scheme: v3
preferred label: Biografías transgénero
related: Transgender autobiographies
related: Transgender authors

Queer biographies
type: Concept
issued: 2020-06-03
modified: 2025-02-23
replaces: queerBiographies
comment: Written accounts of the lives of queer people. For written accounts of queer people's lives written by the subject, use "Queer autobiographies."
comment: Relatos escritos de la vida de personas conocidas por ser queer.
broader: LGBTQ+ biographies
change note: Version 4.2.0
has top concept: LGBTQ+ biographies
in scheme: v3
preferred label: Biografías queer
related: Queer autobiographies
related: Queer authors

Breast reduction
type: Concept
issued: 2020-12-11
modified: 2025-02-23
replaces: breastReduction
comment: A surgical procedure to decrease breast size. Often undertaken by transgender men or non-binary people as a gender affirming surgery.
comment: Un procedimiento quirúrgico para disminuir el tamaño de los senos. A menudo realizado por hombres transgénero como cirugía de afirmación de género.
alternative label: Reduction mammaplasty
alternative label: Reduction mammoplasty
alternative label: Reducción de mamas
alternative label: Mamoplastia de reducción
change note: Version 4.2.0
in scheme: v3
preferred label: Reducción de senos
related: Breast
related: Mastectomy

Greysexuality
type: Concept
issued: 2020-12-11
modified: 2025-02-23
replaces: greysexuality
comment: A sexual orientation generally characterized by infrequent, rare, or low-intensity sexual attraction.
comment: Orientación sexual caracterizada generalmente por una atracción sexual poco frecuente, rara o de baja intensidad.
alternative label: Graysexuality
alternative label: Grey-sexuality
alternative label: Gray-sexuality
broader: Sexual orientation
change note: Version 4.2.0
has top concept: Sexual orientation
in scheme: v3
preferred label: Grissexualidad
related: Greysexual people
related: Greyromanticism

Greysexual people
type: Concept
issued: 2020-12-11
modified: 2025-02-23
replaces: greysexualPeople
comment: People who experience infrequent, rare, or low-intensity sexual attraction.
comment: Personas que experimentan una atracción sexual infrecuente, rara o de baja intensidad.
alternative label: Graysexual people
alternative label: Grey-sexual people
alternative label: Gray-sexual people
broader: Sexual minorities
change note: Version 4.2.0
has top concept: Sexual minorities
in scheme: v3
preferred label: Personas grissexuales
related: Greysexuality
related: Greyromantic people

Primary partners
type: Concept
issued: 2020-12-11
modified: 2025-02-23
replaces: primaryPartners
comment: A term used in hierarchical polyamory to refer to the partner whose interests and desires come before those of any secondary partner(s).
comment: Un término utilizado en el poliamor jerárquico para referirse a la pareja cuyos intereses y deseos están por delante de los de cualquier pareja secundaria.
broader: Partners
change note: Version 4.2.0
has top concept: Partners
in scheme: v3
preferred label: Parejas primarias
related: Hierarchical non-monogamy
related: Secondary partners

Monogamish
type: Concept
issued: 2021-06-30
modified: 2025-02-23
replaces: monogamish
comment: Term used to describe relationships that are mostly monogamous with occasional exceptions made for sexual play.
comment: Término utilizado para describir relaciones que son, en su mayoría, monógamas con excepciones ocasionales para el juego sexual.
alternative label: Relaciones casi monógamas
broader: Hierarchical non-monogamy
change note: Version 4.2.0
has top concept: Relationship orientation
in scheme: v3
related: Swinging
related: Monogamous people

Polyfidelity
type: Concept
issued: 2021-06-30
modified: 2025-02-23
replaces: polyfidelity
comment: In polyamory circles, this term refers to the practice of engaging in multiple-partner relationships that are "closed off" to new participants per the agreement of those involved.
comment: En los círculos de poliamor, este término se refiere a la práctica de entablar relaciones con múltiples parejas que están "cerradas" a nuevos participantes según el acuerdo de las partes involucradas.
alternative label: Poliexclusividad
change note: Version 4.2.0
in scheme: v3
preferred label: Polifidelidad
related: Polyamory
related: Hierarchical non-monogamy

Scissoring
type: Concept
issued: 2021-06-30
modified: 2025-02-23
replaces: scissoring
comment: Typically, a sexual activity in which two women rub their genitalia against one another while intertwining their legs.
comment: Una actividad sexual en la que, normalmente, dos mujeres frotan sus genitales una contra la otra mientras entrelazan sus piernas.
alternative label: Frotar
alternative label: Golpearse las almejas
alternative label: Hacer la tijera
broader: Frottage
broader: Sex (Act)
change note: Version 4.2.0
has top concept: Sex (Act)
in scheme: v3
preferred label: Tribadismo
related: Tribadism

Xenogender identity
type: Concept
issued: 2021-06-30
modified: 2025-02-23
replaces: xenogender
comment: Non-binary gender identity that is not defined in relation to human understandings of gender (i.e., female or male, woman or man), but instead in relation to animals, plants, or other things
comment: Identidad de género no binaria que no se define en relación a la interpretación humana del género (es decir, femenino o masculino, mujer u hombre), sino en relación a animales, plantas u otras cosas.
broader: Gender identity
change note: Version 4.2.0
has top concept: Gender
in scheme: v3
preferred label: Identidad xenogénero
related: Non-binary people
related: Xenogender people

Lesbian autobiographies
type: Concept
issued: 2021-11-02
modified: 2025-02-23
comment: Accounts of lesbians' lives written by those people. For written accounts of lesbians' lives that were not written by the subject, use "Lesbian biographies."
comment: Relatos de vida de personas escritos por esas mismas personas; utilícese para autobiografías escritas por autoras lesbianas.
alternative label: Lesbian autobios
alternative label: Lesbian memoirs
alternative label: Autobiografías de lesbianas
alternative label: Memorias lesbianas
broader: LGBTQ+ autobiographies
change note: Version 4.2.0
has top concept: LGBTQ+ autobiographies
in scheme: v3
preferred label: Autobiografías lésbicas
related: Lesbian biographies
related: Lesbian authors

Gay autobiographies
type: Concept
issued: 2021-11-02
modified: 2025-02-23
comment: Accounts of gay men's lives written by those people. For written accounts of gay men's lives that were not written by the subject, use "Gay biographies."
comment: Relatos de vida de personas escritos por esas mismas personas; utilícese para autobiografías escritas por autores gay.
alternative label: Gay autobios
alternative label: Gay memoirs
alternative label: Memorias gay
broader: LGBTQ+ autobiographies
change note: Version 4.2.0
has top concept: LGBTQ+ autobiographies
in scheme: v3
preferred label: Autobiografías gay
related: Gay biographies
related: Gay authors

Bisexual autobiographies
type: Concept
issued: 2021-11-02
modified: 2025-02-23
comment: Accounts of bisexual peoples' lives written by those people. For written accounts of bisexual people's lives that were not written by the subject, use "Bisexual biographies."
comment: Relatos de vida de personas escritos por esas mismas personas; utilícese para autobiografías escritas por autores bisexuales.
alternative label: Bisexual autobios
alternative label: Bisexual memoirs
broader: LGBTQ+ autobiographies
change note: Version 4.2.0
has top concept: LGBTQ+ autobiographies
in scheme: v3
preferred label: Autobiografías bisexuales
related: Bisexual biographies
related: Bisexual authors

Transgender autobiographies
type: Concept
issued: 2021-11-02
modified: 2025-02-23
comment: Accounts of trans peoples' lives written by those people. For written accounts of trans people's lives that were not written by the subject, use "Transgender biographies."
comment: Relatos de vida de personas escritos por esas mismas personas; utilícese para autobiografías escritas por autores transgénero.
alternative label: Transgender autobios
alternative label: Transgender memoirs
alternative label: Trans autobiographies
alternative label: Trans autobios
alternative label: Trans memoirs
alternative label: Memorias transgénero
broader: LGBTQ+ autobiographies
change note: Version 4.2.0
has top concept: LGBTQ+ autobiographies
in scheme: v3
preferred label: Autobiografías transgénero
related: Transgender biographies
related: Transgender authors

Queer autobiographies
type: Concept
issued: 2021-11-02
modified: 2025-02-23
comment: Accounts of queer peoples' lives written by those people. For written accounts of queer people's lives that were not written by the subject, use "Queer biographies."
comment: Relatos de vida de personas escritos por esas mismas personas; utilícese para autobiografías escritas por autores queer.
alternative label: Queer autobios
alternative label: Queer memoirs
alternative label: Memorias queer
broader: LGBTQ+ autobiographies
change note: Version 4.2.0
has top concept: LGBTQ+ autobiographies
in scheme: v3
preferred label: Autobiografías queer
related: Queer biographies
related: Queer authors

Children of Two-Spirit people
type: Concept
issued: 2021-11-23
modified: 2025-02-23
comment: Children who have one or more Two-Spirit parent.
comment: Hijos o hijas que tienen uno o más madres o padres de dos espíritus.
alternative label: Children of 2S people
alternative label: Children of Two Spirit people
alternative label: Children of Two Spirited people
alternative label: Children of Two-Spirited people
alternative label: Hijas de personas dos espíritus
alternative label: Hijos de personas 2S
alternative label: Hijas de personas 2S
broader: Children
change note: Version 4.2.0
has top concept: Family members
in scheme: v3
preferred label: Hijos de personas dos espíritus
related: Two-Spirit families
related: Two-Spirit parents

Anti-intersex violence
type: Concept
issued: 2021-11-23
modified: 2025-02-23
comment: Behavior involving physical force intended to harm or kill intersex people because they are intersex.
comment: Comportamiento que involucra fuerza física destinada a hacer daño o a matar a personas intersexuales por su identidad.
broader: Anti-LGBTQ+ violence
change note: Version 4.2.0
has top concept: Anti-LGBTQ+ violence
in scheme: v3
preferred label: Violencia anti-intersex
related: Hate crimes
related: Intersexphobia

Packers (Phallus)
type: Concept
issued: 2021-12-14
modified: 2025-02-23
comment: Padding or phallic objects designed to be worn in the front of an individual's pants or underwear to give the appearance of having a bulge.
comment: Objetos acolchados o fálicos diseñados para usarse en la parte delantera de los pantalones o la ropa interior de una persona para dar la apariencia de tener un protuberancia.
alternative label: Prótesis de pene
broader: Gender expression
change note: Version 4.2.0
has top concept: Gender
in scheme: v3
preferred label: Packers
related: Packing (Phallus)
related: Penis

Biromanticism
type: Concept
issued: 2021-12-14
modified: 2025-02-23
comment: A romantic orientation characterized by the occurrence of romantic attraction or desire in a frequent and consistent manner toward more than one sex or gender.
comment: Orientación romántica caracterizada por la atracción o el deseo romántico de forma frecuente y constante hacia más de un sexo o género.
broader: Alloromanticism
broader: Romantic orientation
change note: Version 4.2.0
has top concept: Romantic orientation
in scheme: v3
preferred label: Birromanticismo
related: Biromantic people

Homoromanticism
type: Concept
issued: 2021-12-14
modified: 2025-02-23
comment: A romantic orientation characterized by the occurrence of romantic attraction or desire in a frequent and consistent manner toward members of the same sex or gender.
comment: Una orientación romántica caracterizada por la ocurrencia de atracción o deseo romántico de manera frecuente y consistente hacia miembros del mismo sexo o género.
broader: Alloromanticism
broader: Romantic orientation
change note: Version 4.2.0
has top concept: Romantic orientation
in scheme: v3
preferred label: Homoromanticismo
related: Homoromantic people

Heteroromanticism
type: Concept
issued: 2021-12-14
modified: 2025-02-23
comment: A romantic orientation characterized by the occurrence of romantic attraction or romantic desire in a frequent and consistent manner toward members of the opposite sex or gender.
comment: Una orientación romántica caracterizada por la ocurrencia de atracción romántica o deseo romántico de manera frecuente y consistente hacia miembros del sexo o género opuesto.
broader: Alloromanticism
broader: Romantic orientation
change note: Version 4.2.0
has top concept: Romantic orientation
in scheme: v3
preferred label: Heteroromanticismo
related: Heteroromantic people

Panromanticism
type: Concept
issued: 2021-12-14
modified: 2025-02-23
comment: A romantic orientation characterized by the occurrence of romantic attraction or romantic desire in a frequent and consistent manner irrespective of sex or gender.
comment: Una orientación romántica caracterizada por la ocurrencia de atracción romántica o deseo romántico de manera frecuente y consistente, independientemente del sexo o género.
broader: Alloromanticism
broader: Romantic orientation
change note: Version 4.2.0
has top concept: Romantic orientation
in scheme: v3
preferred label: Panromanticismo
related: Panromantic people

Content warnings
type: Concept
issued: 2022-01-18
modified: 2025-02-23
comment: Statements used to caution individuals that materials may be disturbing or offensive. Includes warnings assigned to fanworks (usually by the creator) that give information about possibly upsetting, triggering, or controversial elements within a work.
comment: Declaraciones utilizadas para advertir a personas que los materiales pueden ser perturbadores u ofensivos. Incluye advertencias asignadas a obras de fanwork (generalmente por el creador) que brindan información sobre elementos posiblemente perturbadores, desencadenantes o controversiales dentro de una obra.
alternative label: Trigger warnings
alternative label: Advertencias
broader: Fanworks
change note: Version 4.2.0
has top concept: Subcultures
in scheme: v3
narrower: Rape/non-con (Content warning)
narrower: Underage (Content warning)
preferred label: Advertencias de contenido

Hermaphrodites
type: Concept
issued: 2022-02-14
modified: 2025-02-23
comment: A term originating from Greek mythology that refers to beings that are both fully female and fully male. The term was once adopted in the medical realm to describe people with intersex variations generally (and later to describe someone with both ovarian and testicular tissue specifically), but it is now recognized to be stigmatizing, imprecise, and misleading. Many people in the intersex community consider the use of this term to be pathologizing and deeply offensive, while other intersex people have chosen to reclaim the term to describe themselves and their bodies. Do not use this term to describe an individual unless they explicitly identify with it and have chosen to use it.
comment: Término originado en la mitología griega que se refiere a seres que son tanto completamente femeninos como completamente masculinos. El término fue adoptado alguna vez en el ámbito médico para describir a personas con variaciones intersex en general (y más tarde para describir a alguien con tejido tanto ovárico como testicular específicamente), pero ahora se reconoce como estigmatizante, impreciso y engañoso. Muchas personas de la comunidad intersex consideran que el uso de este término es patologizante y profundamente ofensivo, mientras que otras personas intersex han optado por reclamar el término para describirse a sí mismas y a sus cuerpos. No utilice este término para describir a una persona a menos que se identifique explícitamente con él y haya elegido utilizarlo.
broader: LGBTQ+ historical terms
change note: Version 4.2.0
has top concept: LGBTQ+ historical terms
in scheme: v3
preferred label: Hermafroditas
related: Intersex
related: Intersex people

Tracheal shave
type: Concept
issued: 2022-02-15
modified: 2025-02-23
comment: A surgery in which the laryngeal prominence, colloquially referred to as the Adam's apple, is reduced in size, often as part of facial feminization surgery for transfeminine people. Cisgender men and cisgender women may also undergo tracheal shaves if they feel their laryngeal prominence is too prominent.
comment: Una cirugía en la que se reduce de tamaño la prominencia laríngea, coloquialmente conocida como la nuez de Adán, a menudo como parte de una cirugía de feminización facial para personas transfemeninas. Los hombres y las mujeres cisgénero también pueden someterse a un afeitado traqueal si sienten que su prominencia laríngea es demasiado prominente.
alternative label: Adam's apple reduction
alternative label: Chondrolaryngoplasty
alternative label: TCR
alternative label: Thyroid cartilage reduction
alternative label: Trache shave
alternative label: Trachea shave
broader: Facial feminization surgery
change note: Version 4.2.0
has top concept: Medical care
in scheme: v3
preferred label: Afeitado traqueal
related: Transitioning (Gender)
related: Facial gender affirming surgery

Lesbians with chronic illnesses
type: Concept
issued: 2022-02-17
modified: 2025-02-23
comment: Lesbians who have long-term health conditions that require continued medical attention and/or significantly impact or limit daily life; some but not all people with chronic illnesses consider themselves disabled.
comment: Lesbianas que tienen condiciones de salud a largo plazo que requieren atención médica continua y/o impactan o limitan significativamente la vida diaria; algunas, pero no todas, las personas con enfermedades crónicas se consideran discapacitadas.
alternative label: Chronically ill lesbians
alternative label: Lesbianas enfermas crónicas
alternative label: Enfermas crónicas lesbianas
broader: LGBTQ+ people with chronic illnesses
change note: Version 4.2.0
has top concept: LGBTQ+ people
in scheme: v3
preferred label: Lesbianas con enfermedades crónicas
related: Lesbian disabled people
related: Lesbian wheelchair users

Gay men with chronic illnesses
type: Concept
issued: 2022-02-17
modified: 2025-02-23
comment: Gay men who have long-term health conditions that require continued medical attention and/or significantly impact or limit daily life; some but not all people with chronic illnesses consider themselves disabled.
comment: Hombres gay que no son blancos y que se autoidentifican como personas de color.
alternative label: Chronically ill gay men
broader: LGBTQ+ people with chronic illnesses
change note: Version 4.2.0
has top concept: LGBTQ+ people
in scheme: v3
preferred label: Hombres gay de color
related: Gay disabled men
related: Gay wheelchair users

Bisexual people with chronic illnesses
type: Concept
issued: 2022-02-17
modified: 2025-02-23
comment: Bisexual people who have long-term health conditions that require continued medical attention and/or significantly impact or limit daily life; some but not all people with chronic illnesses consider themselves disabled.
comment: La presencia de personas bisexuales en el lugar de trabajo, incluida la aceptación de los trabajadores bisexuales y los problemas a los que se enfrentan.
alternative label: Chronically ill bisexual people
broader: LGBTQ+ people with chronic illnesses
change note: Version 4.2.0
has top concept: LGBTQ+ people
in scheme: v3
preferred label: Personas bisexuales en el lugar de trabajo
related: Bisexual disabled people
related: Bisexual wheelchair users

Queer people with chronic illnesses
type: Concept
issued: 2022-02-17
modified: 2025-02-23
comment: Queer people who have long-term health conditions that require continued medical attention and/or significantly impact or limit daily life; some but not all people with chronic illnesses consider themselves disabled.
comment: Personas queer que tienen condiciones de salud a largo plazo que requieren atención médica continua y/o impactan o limitan significativamente la vida diaria; algunas, pero no todas, las personas con enfermedades crónicas se consideran discapacitadas.
alternative label: Chronically ill queer people
alternative label: Personas con enfermedades crónicas queer
alternative label: Enfermos crónicos queer
broader: LGBTQ+ people with chronic illnesses
change note: Version 4.2.0
has top concept: LGBTQ+ people
in scheme: v3
preferred label: Personas queer con enfermedades crónicas
related: Queer disabled people
related: Queer wheelchair users

Gender ambiguity
type: Concept
issued: 2022-02-28
modified: 2025-02-23
comment: Gender expression that does not conform to a single, distinct gender identity.
comment: Expresión de género que no se ajusta a una identidad de género única e inconfundible.
broader: Gender expression
change note: Version 4.2.0
has top concept: Gender
in scheme: v3
preferred label: Ambigüedad de género
related: Gender
related: Gender roles

Zaps
type: Concept
issued: 2022-03-29
modified: 2025-02-23
comment: Popularized by the gay liberation group Gays Activists Alliance, zaps are public demonstrations focused on confronting or embarrassing specific politicians or public officials while calling attention to the liberation movement.
comment: Popularizados por el grupo de liberación gay Alianza de Activistas Gay, los zaps son manifestaciones públicas centradas en confrontar o avergonzar a políticos o funcionarios públicos específicos mientras llaman atención sobre el movimiento de liberación.
broader: LGBTQ+ demonstrations
change note: Version 4.2.0
has top concept: LGBTQ+ activism
in scheme: v3
related: LGBTQ+ political activists
related: LGBTQ+ movement

Lesbian witches
type: Concept
issued: 2022-03-29
modified: 2025-02-23
comment: Lesbians who practice Wicca or other Pagan religions and self-identify as witches.
comment: Lesbianas que practican Wicca u otras religiones paganas y se autoidentifican como brujas.
alternative label: Lesbian Wiccans
alternative label: Witches (Lesbians)
alternative label: Brujas (lesbianas)
broader: LGBTQ+ witches
change note: Version 4.2.0
has top concept: LGBTQ+ African religions
in scheme: v3
preferred label: Brujas lesbianas
related: Goddess movement
related: Lesbian Pagans

Gay witches
type: Concept
issued: 2022-03-29
modified: 2025-02-23
comment: Gay men who practice Wicca or other Pagan religions and self-identify as witches.
comment: Hombres gay que practican Wicca u otras religiones paganas y que se autoidentifican como brujos.
alternative label: Gay Wiccans
alternative label: Brujas gay
broader: LGBTQ+ witches
change note: Version 4.2.0
has top concept: LGBTQ+ African religions
in scheme: v3
preferred label: Brujos gay
related: Gay Pagans
related: Goddess movement

Bisexual witches
type: Concept
issued: 2022-03-29
modified: 2025-02-23
comment: Bisexual practitioners of Wicca or other Pagan religions who self-identify as witches.
comment: Practicantes bisexuales de Wicca u otras religiones paganas que se autoidentifican como brujas.
alternative label: Bisexual Wiccans
alternative label: Wiccanos bisexuales
alternative label: Wiccanas bisexuales
broader: LGBTQ+ witches
change note: Version 4.2.0
has top concept: LGBTQ+ African religions
in scheme: v3
preferred label: Bruja/os bisexuales
related: Bisexual Pagans
related: Goddess movement

Transgender witches
type: Concept
issued: 2022-03-29
modified: 2025-02-23
comment: Transgender practitioners of Wicca or other Pagan religions who self-identify as witches.
comment: Practicantes transgénero de Wicca u otras religiones paganas que se autoidentifican como brujas.
alternative label: Transgender Wiccans
broader: LGBTQ+ witches
change note: Version 4.2.0
has top concept: LGBTQ+ African religions
in scheme: v3
preferred label: Brujas transgénero
related: Goddess movement
related: Transgender Pagans

Queer witches
type: Concept
issued: 2022-03-29
modified: 2025-02-23
comment: Queer practitioners of Wicca or other Pagan religions who self-identify as witches.
comment: Practicantes queer de Wicca u otras religiones paganas que se autoidentifican como brujas.
alternative label: Queer Wiccans
alternative label: Wiccanos queer
broader: LGBTQ+ witches
change note: Version 4.2.0
has top concept: LGBTQ+ African religions
in scheme: v3
preferred label: Brujas queer
related: Goddess movement
related: Queer Pagans

Transgenderqueer identity
type: Concept
issued: 2022-03-31
modified: 2025-02-23
comment: Identity term used to describe the intersection of trans identity and genderqueer identity.
comment: Término identitario utilizado para describir la intersección de la identidad trans y la identidad genderqueer.
alternative label: Transgenderqueerness
alternative label: Transgéneroqueer
broader: Gender identity
change note: Version 4.2.0
has top concept: Gender
in scheme: v3
preferred label: Identidad transgenderqueer
related: Transgender people
related: Transgenderqueer people

Cissexuality
type: Concept
issued: 2022-03-31
modified: 2025-02-23
comment: Term used to describe people who identify with the sex they were assigned at birth.
comment: Término utilizado para describir a las personas que se autoidentifican con el sexo que les fue asignado al nacer.
change note: Version 4.2.0
in scheme: v3
preferred label: Cisexualidad
related: Cissexual people
related: Cisgender identity

Lesbian athletes
type: Concept
issued: 2022-05-03
modified: 2026-02-24
comment: Professional or amateur/recreational sports players who self-identify as lesbians.
comment: Jugadoras de deportes profesionales o amateurs/recreativas que se autoidentifican como lesbianas.
alternative label: Lesbian sports players
alternative label: Lesbian sportspeople
alternative label: Lesbian sportspersons
alternative label: Lesbian sportswomen
alternative label: Jugadoras deportivas lesbianas
alternative label: Deportistas lesbianas
broader: LGBTQ+ athletes
change note: Version 4.2.0
has top concept: LGBTQ+ people
in scheme: v3
narrower: Lesbian basketball players
preferred label: Atletas lesbianas
related: Lesbian sports clubs

Gay athletes
type: Concept
issued: 2022-05-03
modified: 2026-02-24
comment: Professional or amateur/recreational sports players who self-identify as gay men.
comment: Jugadores de deportes profesionales o aficionados/recreativos que se autoidentifican como hombres gay.
alternative label: Gay sports players
alternative label: Gay sportsmen
alternative label: Gay sportspeople
alternative label: Gay sportspersons
alternative label: Jugadores deportivos gay
alternative label: Deportistas gay||
broader: LGBTQ+ athletes
change note: Version 4.2.0
has top concept: LGBTQ+ people
in scheme: v3
narrower: Gay basketball players
preferred label: Atletas gay
related: Gay sports clubs

Transgender athletes
type: Concept
issued: 2022-05-03
modified: 2026-02-24
comment: Professional or recreational sports players who self-identify as transgender.
comment: Jugadores de deportes profesionales o recreativos que se autoidentifican como transgénero.
alternative label: Transgender sports players
alternative label: Transgender sportspeople
alternative label: Transgender sportspersons
alternative label: Jugadores de deportes transgénero
alternative label: Deportistas transgénero
broader: LGBTQ+ athletes
change note: Version 4.2.0
has top concept: LGBTQ+ people
in scheme: v3
narrower: Transgender basketball players
preferred label: Atletas transgénero
related: Sports bans

Two-Spirit athletes
type: Concept
issued: 2022-05-03
modified: 2026-02-24
comment: Professional or recreational sports players who self-identify as Two-Spirit.
comment: Jugadores de deportes profesionales o recreativos que se autoidentifican como dos espíritus.
alternative label: 2S athletes
alternative label: Two Spirited athletes
alternative label: Two-Spirit sports players
alternative label: Two-Spirit sportspeople
alternative label: Two-Spirit sportspersons
alternative label: Two-Spirited athletes
alternative label: Jugadores de deportes dos espíritus
alternative label: Deportistas dos espíritus
broader: Two-Spirit people
change note: Version 4.2.0
has top concept: Gender
in scheme: v3
narrower: Two-Spirit basketball players
preferred label: Atletas dos espíritus
related: LGBTQ+ athletes

Pacific Islander American intersex people
type: Concept
issued: 2022-05-10
modified: 2025-02-23
comment: Intersex people who identify as both Pacific Islanders (or of Pacific Islander ancestry) and American.
comment: Personas intersexuales que se identifican a la vez como isleñas del Pacífico (o de ascendencia isleña del Pacífico) y estadounidenses.
alternative label: Intersex Pacific Islander American people
alternative label: Intersex Pacific Islander Americans
alternative label: Personas intersex del Pacífico estadounidenses
broader: Pacific Islander American LGBTQ+ people
broader: Indigenous intersex people
change note: Version 4.2.0
has top concept: LGBTQ+ people
in scheme: v3
preferred label: Personas intersexuales del Pacífico estadounidenses
related: Kānaka Maoli intersex people

Kānaka Maoli intersex people
type: Concept
issued: 2022-05-11
modified: 2025-02-23
comment: Intersex people who are part of the Indigenous people of Mokupuni o Hawai‘i, or the Hawaiian Islands; only use to refer to people who identify as Kanaka Maoli.
comment: Personas intersexuales que pertenecen al pueblo indígena mokupuni o hawai‘i, o a las islas hawaianas. Utilícese únicamente para describir a las personas que se identifiquen como kānaka maoli.
alternative label: Intersex Kānaka ʻŌiwi
alternative label: Indigenous Hawaiian intersex people
alternative label: Intersex Indigenous Hawaiians
alternative label: Intersex Kānaka Maoli
alternative label: Intersex Native Hawaiians
alternative label: Native Hawaiian intersex people
alternative label: Personas intersex kānaka maoli
broader: Kānaka Maoli LGBTQ+ people
broader: Indigenous intersex people
change note: Version 4.2.0
has top concept: LGBTQ+ people
in scheme: v3
preferred label: Personas intersexuales kānaka maoli
related: Pacific Islander American intersex people

GRID (Gay-Related Immune Deficiency)
type: Concept
issued: 2022-05-11
modified: 2025-02-23
comment: The original name for AIDS, proposed after public health scientists noticed clusters of Kaposi's sarcoma and Pneumocystis pneumonia among gay men in California and New York City. Should only be used in historical contexts.
comment: Nombre original del SIDA, propuesto después de que científicos de salud pública observaran grupos de sarcoma de Kaposi y neumonía por Pneumocystis entre hombres gay de California y Nueva York. Utilícese únicamente en contextos históricos.
alternative label: GRID
alternative label: GRIDS
alternative label: Gay Related Immune Deficiency
alternative label: Gay-Related Immune Deficiency
broader: HIV/AIDS
broader: LGBTQ+ historical terms
change note: Version 4.2.0
has top concept: STDs
in scheme: v3
preferred label: GRID (Inmunodeficiencia Asociada a la Homosexualidad)
related: Kaposi's sarcoma

Demiromantic people
type: Concept
issued: 2022-05-11
modified: 2025-02-23
comment: Individuals who experience romantic attraction to other people only after forming emotional bonds.
comment: Personas que experimentan atracción romántica hacia otras personas únicamente después de formar vínculos emocionales.
alternative label: Demi-romantic people
alternative label: Personas demi-románticas
broader: Romantic minorities
change note: Version 4.2.0
has top concept: Romantic minorities
in scheme: v3
preferred label: Personas demirrománticas
related: Demisexual people
related: Demiromanticism

Demiromanticism
type: Concept
issued: 2022-05-11
modified: 2025-02-23
comment: Romantic orientation in which romantic attraction to other people is only experienced after forming emotional bonds.
comment: Orientación romántica en la que la atracción romántica hacia otras personas solo se experimenta después de formar vínculos emocionales.
alternative label: Demi-romantic
alternative label: Demiromantic
alternative label: Demi-romántico
alternative label: Demirrománticos
alternative label: Demi-romántica
alternative label: Demirrománticas
broader: Romantic orientation
change note: Version 4.2.0
has top concept: Romantic orientation
in scheme: v3
preferred label: Demirromanticismo
related: Demisexuality
related: Demiromantic people

Greyromanticism
type: Concept
issued: 2022-05-11
modified: 2025-02-23
comment: An umbrella term for romantic orientations generally characterized by rare, infrequent, or low-intensity romantic attraction.
comment: Término general que engloba las orientaciones románticas generalmente caracterizadas por una atracción romántica rara, infrecuente o de baja intensidad.
alternative label: Gray-romantic
alternative label: Grayromantic
alternative label: Grayromanticism
alternative label: Grey-romantic
alternative label: Greyromantic
broader: Romantic orientation
change note: Version 4.2.0
has top concept: Romantic orientation
in scheme: v3
preferred label: Grisrománticismo
related: Greysexuality
related: Greyromantic people

Two-Spirit survivors of bullying
type: Concept
issued: 2022-05-11
modified: 2025-02-23
comment: Two-Spirit people who have experienced and survived bullying due to their gender or sexual identity; follow the individual's preference for "victims" or "survivors" whenever possible.
comment: Personas dos espíritus que han sufrido y sobrevivido al acoso por su identidad sexual; siga la preferencia de la persona sobre el uso de "víctimas" o "supervivientes" siempre que sea posible.
alternative label: 2S survivors of bullying
alternative label: Two Spirit survivors of bullying
alternative label: Two Spirited survivors of bullying
alternative label: Two-Spirited survivors of bullying
broader: Two-Spirit victims of bullying
change note: Version 4.2.0
has top concept: Gender
in scheme: v3
narrower: Two-Spirit youth survivors of bullying
preferred label: Sobrevivientes dos espíritus de acoso
related: LGBTQ+ survivors of bullying

Lesbians in the workplace
type: Concept
issued: 2022-06-15
modified: 2025-02-23
comment: The presence of lesbians in the workplace, including acceptance of and issues faced by lesbian workers.
comment: La presencia de lesbianas en el lugar de trabajo, incluida la aceptación de las trabajadoras lesbianas y los problemas a los que se enfrentan.
broader: LGBTQ+ people in the workplace
change note: Version 4.2.0
has top concept: LGBTQ+ employment
in scheme: v3
preferred label: Lesbianas en el lugar de trabajo
related: Lesbian-owned businesses
related: Lesbian-focused businesses

Gay men in the workplace
type: Concept
issued: 2022-06-15
modified: 2025-02-23
comment: The presence of gay men in the workplace, including acceptance of and issues faced by gay workers.
comment: Hombres gay que sirven en las fuerzas armadas estatales y nacionales.
alternative label: Hombres gay en las fuerzas armadas
broader: LGBTQ+ people in the workplace
change note: Version 4.2.0
has top concept: LGBTQ+ employment
in scheme: v3
preferred label: Hombres gay en el ejército
related: Gay-owned businesses
related: Gay-focused businesses

Bisexual people in the workplace
type: Concept
issued: 2022-06-15
modified: 2025-02-23
comment: The presence of bisexual people in the workplace, including acceptance of and issues faced by bisexual workers.
comment: La participación e inclusión de personas bisexuales en las comunidades de fans.
alternative label: Bisexuales en fandom
broader: LGBTQ+ people in the workplace
change note: Version 4.2.0
has top concept: LGBTQ+ employment
in scheme: v3
preferred label: Personas bisexuales en fandom
related: Bisexual-owned businesses
related: Bisexual-focused businesses

Queer people in the workplace
type: Concept
issued: 2022-06-15
modified: 2025-02-23
comment: The presence of queer people in the workplace, including acceptance of and issues faced by queer workers.
comment: La presencia de personas queer en el lugar de trabajo, incluida la aceptación de los trabajadores queer y los problemas a los que se enfrentan.
broader: LGBTQ+ people in the workplace
change note: Version 4.2.0
has top concept: LGBTQ+ employment
in scheme: v3
preferred label: Personas queer en el lugar de trabajo
related: Queer-owned businesses
related: Queer-focused businesses

Alternate universe settings (Fanfiction)
type: Concept
issued: 2022-07-04
modified: 2025-02-23
comment: Settings alternative to the canonical universe of a text in which fanfiction might take place.
comment: Escenarios alternativos al universo canónico de un texto en el que podría desarrollarse un fanfiction.
alternative label: AU (Fanfiction)
alternative label: UA (Fanficción)
alternative label: Fanfic
broader: Fanfiction tropes and genres
change note: Version 4.2.0
has top concept: Subcultures
in scheme: v3
narrower: Omegaverse
preferred label: Escenarios de un universo alternativo (fanfiction)
related: Transfic

Bandslash
type: Concept
issued: 2022-07-04
modified: 2025-02-23
comment: Fanfiction that focuses on, incorporates, or details the romantic or sexual relationships between same-gender or same-sex musicians who exist in the real world, usually men.
comment: Fanfiction que se centra, incorpora o detalla las relaciones románticas o sexuales entre músicos del mismo género o del mismo sexo que existen en el mundo real, normalmente hombres.
alternative label: Band slash
broader: Real person fiction
change note: Version 4.2.0
has top concept: Subcultures
in scheme: v3
related: LGBTQ+ musicians
related: Homoeroticism

Fandom terminology
type: Concept
issued: 2022-07-04
modified: 2025-02-23
comment: Jargon or slang commonly used in fan communities, such as "slash" and "shipping."
comment: Jerga o argot comúnmente utilizado en las comunidades de fans, tales como "slash" y "shippeo"
alternative label: Fan terminology
alternative label: Fan terms
alternative label: Fandom terms
alternative label: Terminología fan
alternative label: Términos fan
alternative label: Términos de fandom
broader: Fandom
change note: Version 4.2.0
has top concept: Subcultures
in scheme: v3
narrower: Slash terminology
preferred label: Terminología de fandom
related: LGBTQ+ slang

Furry fandom
type: Concept
issued: 2022-07-04
modified: 2025-02-23
comment: The fan community that focuses on, incorporates, or details anthropomorphized animals.
comment: La comunidad de fans que se centra, incorpora o detalla animales antropomorfizados.
alternative label: Furry community
alternative label: Furry fan community
alternative label: Comunidad furra
alternative label: Comunidades fan de furros
broader: Fandom
change note: Version 4.2.0
has top concept: Subcultures
in scheme: v3
narrower: Furries
narrower: Furry conventions
preferred label: Fandom de furros

Intersex people in fandom
type: Concept
issued: 2022-07-04
modified: 2025-02-23
comment: The participation and inclusion of intersex people in fan communities.
comment: La participación e inclusión de personas intersex en las comunidades de fans.
broader: Gender in fandom
broader: LGBTQ+ people in fandom
change note: Version 4.2.0
has top concept: Subcultures
in scheme: v3
narrower: Intersex fiction
preferred label: Personas intersex en fandom

Kink in fandom
type: Concept
issued: 2022-07-04
modified: 2025-02-23
comment: Representations of non-conventional or marginalized sexual practices in fanfiction.
comment: Representación de prácticas sexuales no convencionales o marginadas en el fanfiction.
alternative label: Kink in fan communities
alternative label: Kink en comunidades de fans
broader: Fanfiction tropes and genres
change note: Version 4.2.0
has top concept: Subcultures
in scheme: v3
preferred label: Kink en el fandom
related: LGBTQ+ people in fandom
related: Omegaverse

LGBTQ+ headcanons
type: Concept
issued: 2022-07-04
modified: 2025-02-23
comment: Fans' personal interpretations of media properties and texts, particularly relating to the personalities and behaviors of characters. Use to describe headcanons that certain characters or relationships are LGBTQ+, as well as headcanons about other LGBTQ+ people and issues in the universe of the text.
comment: Interpretaciones personales de los fanáticos de las propiedades y textos de los medios, particularmente en relación con las personalidades y comportamientos de los personajes. Utilícese para describir cánones principales de que ciertos personajes o relaciones son LGBTQ+, así como cánones principales sobre otras personas y problemas LGBTQ+ en el universo del texto.
alternative label: Headcanons (LGBTQ)
broader: Queer (Verb)
change note: Version 4.2.0
has top concept: Queer (Verb)
in scheme: v3
preferred label: Headcanons LGBTQ+
related: LGBTQ+ fiction
related: Shipping in fandom

Men in fandom
type: Concept
issued: 2022-07-04
modified: 2025-02-23
comment: The participation and inclusion of men in fan communities.
comment: La participación e inclusión de los hombres en las comunidades de fans.
broader: Gender in fandom
change note: Version 4.2.0
has top concept: Subcultures
in scheme: v3
narrower: Gay men in fandom
preferred label: Hombres en fandom
related: Males

Mpreg
type: Concept
issued: 2022-07-04
modified: 2025-02-23
comment: The fandom trope in which cisgender men can become pregnant. This term should not be used to describe pregnant trans men.
comment: El tropo del fandom en el que los hombres cisgénero pueden quedar embarazados. Este término no debe utilizarse para describir a hombres trans embarazados.
alternative label: M-preg
broader: Omegaverse
change note: Version 4.2.0
has top concept: Subcultures
in scheme: v3
related: Gender swapping
related: LGBTQ+ erotic literature

Non-binary people in fandom
type: Concept
issued: 2022-07-04
modified: 2025-02-23
comment: The participation and inclusion of non-binary people in fan communities.
comment: La participación e inclusión de personas no binarias en las comunidades de fans.
alternative label: Nonbinary people in fandom
broader: Gender in fandom
broader: LGBTQ+ people in fandom
change note: Version 4.2.0
has top concept: Subcultures
in scheme: v3
preferred label: Personas no binarias en fandom
related: Non-binary people

Omegaverse
type: Concept
issued: 2022-07-04
modified: 2025-02-23
comment: The alternate universe fanworks trope in which society is divided into three categories of people: alphas, betas, and omegas. Fanworks in the omegaverse often depict characters with genitalia and breeding behaviors (such as heat cycles) similar to wolves. Use to describe fanworks in the omegaverse that focus on LGBTQ+ people and issues.
comment: El tropo de obras de fans del universo alternativo en el que la sociedad se divide en tres categorías de personas: alfas, betas y omegas. Las obras de fans en el omegaverso a menudo representan personajes con genitales y comportamientos reproductivos (como ciclos de celo) similares a los de los lobos. Utilícese para describir obras de fans en el omegaverso que se centran en personas y cuestiones LGBTQ+.
alternative label: A/B/O
alternative label: ABO
alternative label: Alpha/Beta/Omega
alternative label: Omergaverse
broader: Alternate universe settings (Fanfiction)
change note: Version 4.2.0
has top concept: Subcultures
in scheme: v3
narrower: Mpreg
preferred label: Omegaverso
related: Kink in fandom

One true pairing
type: Concept
issued: 2022-07-04
modified: 2025-02-23
comment: Slang term referring to a fan's primary "ship" or preferred relationship within a fandom.
comment: Término de la jerga que se refiere al "ship" principal de un fan o a la relación preferida dentro de un fandom. Siglas en inglés para "una pareja única" o "una pareja veradera."
alternative label: OTP
broader: Pairings in fandom
change note: Version 4.2.0
has top concept: Subcultures
in scheme: v3
related: Fanfiction tropes and genres
related: Kirk/Spock

Pairings in fandom
type: Concept
issued: 2022-07-04
modified: 2025-02-23
comment: The relationships (primarily romantic or sexual) between characters in fanworks, including relationships that are not present within the canon text.
comment: Las relaciones (principalmente románticas o sexuales) entre personajes de obras de fans, incluidas las relaciones que no están presentes en el texto canónico.
alternative label: Fandom pairings
broader: Shipping in fandom
change note: Version 4.2.0
has top concept: Subcultures
in scheme: v3
narrower: One true pairing
preferred label: Emparejamiento en fandom
related: Relationship satisfaction

Queerbaiting
type: Concept
issued: 2022-07-04
modified: 2025-02-23
comment: Marketing tactic in which creators of a piece of media purposefully hint at but do not explicitly depict or follow through with queer relationships or queer representation. Queerbaiting is distinct from queer coding in that queer coding is not typically used as a marketing tactic.
comment: Táctica de marketing en la que los creadores de una pieza mediática insinúan intencionadamente, pero no representan ni dan seguimiento a relaciones o representaciones queer. El queerbaiting se diferencia de la codificación queer en que la codificación queer no suele utilizarse como táctica de marketing.
alternative label: Queer baiting
alternative label: Cebo queer
change note: Version 4.2.0
in scheme: v3
related: LGBTQ+ marketing
related: Queer coding

Real person fiction
type: Concept
issued: 2022-07-04
modified: 2025-02-23
comment: Fanfiction about real people, such as actors or musicians; often but not always used to describe fanfiction focusing on (real or imagined) same-sex or same-gender relationships between celebrities.
comment: Fanfiction sobre personas reales, como actores o músicos; a menudo, pero no siempre, se utiliza para describir fanfiction que se centra en relaciones (reales o imaginarias) entre celebridades del mismo sexo o del mismo género.
alternative label: RPF
alternative label: RPS
alternative label: Real people fiction
alternative label: Real person slash
alternative label: Real person stories
broader: Slash fiction
change note: Version 4.2.0
has top concept: Subcultures
in scheme: v3
narrower: Actorfic
narrower: Bandslash
preferred label: Ficción de personas reales

Seme (Yaoi)
type: Concept
issued: 2022-07-04
modified: 2025-02-23
comment: Term used in yaoi or yaoi fan communities to describe the giving or dominant partner in a fictional male-male relationship.
comment: Término utilizado en las comunidades yaoi o de fans del yaoi para describir a la pareja dadivosa o dominante en una relación ficticia entre dos personas masculinas.
broader: Yaoi
change note: Version 4.2.0
has top concept: Subcultures
in scheme: v3
related: Tops (Sex)
related: Bishounen
related: Boys' Love (Genre)

Slash art
type: Concept
issued: 2022-07-04
modified: 2025-02-23
comment: Artwork depicting same-sex or same-gender couples that is usually erotic or pornographic in nature. Historically used for male-male couples only, but is now used more broadly; includes femslash art.
comment: Obras de arte que representan parejas del mismo sexo o del mismo género y que suelen ser de naturaleza erótica o pornográfica. Históricamente se utilizaba únicamente para parejas de hombres, pero ahora se utiliza de forma más amplia; incluye arte femslash.
broader: Fanart
broader: Slash fanworks
change note: Version 4.2.0
has top concept: Subcultures
in scheme: v3
preferred label: Arte slash
related: LGBTQ+ arts

Slash roleplay
type: Concept
issued: 2022-07-04
modified: 2025-02-23
comment: The act of pretending to be and behaving as a character in a sexual or romantic relationship with another character of the same sex or gender, sometimes to generate ideas for fanworks. Typically erotic or pornographic in nature. Historically used for male-male couples only, but is now used more broadly; includes femslash roleplay.
comment: El acto de pretender ser y comportarse como un personaje en una relación sexual o romántica con otro personaje del mismo sexo o género, a veces para generar ideas para fanworks. Normalmente de naturaleza erótica o pornográfica. Históricamente se utilizaba únicamente para parejas de hombres, pero ahora se utiliza de forma más amplia; incluye juego de rol femslash.
alternative label: Slash role play
alternative label: Roleplay slash
broader: Slash fanworks
change note: Version 4.2.0
has top concept: Subcultures
in scheme: v3
preferred label: Juego de roles slash
related: Role behavior
related: Roleplay

Slash terminology
type: Concept
issued: 2022-07-04
modified: 2025-02-23
comment: Slang relating to fanworks about sexual or romantic relationships between characters of the same sex or gender. Historically used for male-male couples only, but is now used more broadly; includes femslash terminology.
comment: Jerga relacionada con obras de fans sobre relaciones sexuales o románticas entre personajes del mismo sexo o género. Históricamente se utilizaba únicamente para parejas de hombres, pero ahora se utiliza de forma más amplia; incluye terminología femslash.
alternative label: Slash terms
alternative label: Términos slash
broader: Fandom terminology
broader: Slash fandom
change note: Version 4.2.0
has top concept: Subcultures
in scheme: v3
preferred label: Terminología slash
related: LGBTQ+ slang

Underage (Content warning)
type: Concept
issued: 2022-07-04
modified: 2025-02-23
comment: A content warning applied to fanworks to signal the depiction of people under the age of consent in sexual situations, either with other underage people or adults.
comment: Advertencia de contenido aplicada a las obras de fans para señalar la representación de personas menores a la de edad de consentimiento en situaciones sexuales, ya sea con otras personas menores de edad o con personas adultas.
broader: Content warnings
change note: Version 4.2.0
has top concept: Subcultures
in scheme: v3
preferred label: Menor de edad (Advertencia de contenido)
related: Age of consent
related: Consent

Yaoi fandom
type: Concept
issued: 2022-07-04
modified: 2025-02-23
comment: The fan community that focuses on, incorporates, or details the sexual or romantic relationships between male characters from anime and manga.
comment: La comunidad de fans que se centra sobre, incorpora o detalla las relaciones sexuales o románticas entre personajes masculinos del anime y manga.
broader: Boys' Love (Genre)
change note: Version 4.2.0
has top concept: Subcultures
in scheme: v3
narrower: Fujoshi
narrower: Yaoi
preferred label: Fandom yaoi

Non-binary children
type: Concept
issued: 2022-07-19
modified: 2025-02-23
comment: Non-binary people who have not yet reached the age of adolescence.
comment: Niños menores de 18 años que se identifican como no binarios.
alternative label: Non-binary kids
alternative label: Nonbinary children
alternative label: Nonbinary kids
alternative label: Niñxs no binarios
broader: LGBTQ+ children
broader: Non-binary youth
change note: Version 4.2.0
has top concept: Family members
in scheme: v3
preferred label: Niños no binarios
related: Gender creative

Non-binary youth
type: Concept
issued: 2022-07-19
modified: 2025-02-23
comment: Non-binary people who are between the ages of childhood and adulthood.
comment: Publicaciones independientes de pequeña tirada generalmente reproducidas mediante fotocopiadora; utilícese para revistas creadas por personas no binarias y/o que se centran en identidades, cuestiones o culturas no binarias.
alternative label: Non-binary adolescents
alternative label: Non-binary teenagers
alternative label: Non-binary teens
alternative label: Nonbinary youth
preferred label: Zines no binarios
broader: Non-binary people
broader: LGBTQ+ youth
change note: Version 4.2.0
has top concept: LGBTQ+ people
in scheme: v3
narrower: Non-binary children

Anti-racism
type: Concept
issued: 2022-11-08
modified: 2025-02-23
comment: Umbrella term used to describe a range of ideas, policies, and political actions that are intended to actively challenge, reject, or oppose racism and racial oppression (whether personal or systemic), as well as advocate for racial equity.
comment: Término general utilizado para describir una variedad de ideas, políticas y acciones políticas que tienen como objetivo desafiar, rechazar u oponerse activamente al racismo y la opresión racial (ya sea personal o sistémica), así como defender la equidad racial.
alternative label: Antiracism
alternative label: Antirracismo
change note: Version 4.2.0
in scheme: v3
preferred label: Anti-racismo
related: Critical race theory
related: Racism

Sapphics
type: Concept
issued: 2022-11-08
modified: 2025-02-23
comment: Women and, in some definitions, non-binary people of any sexual identity or sexuality who are attracted to women. Some but not all sapphics use the term "sapphic" to describe their sexual identity or sexuality. Only use to describe individuals who self-identify as sapphic.
comment: Mujeres y, en algunas definiciones, personas no binarias de cualquier identidad sexual o sexualidad que se sientan atraídas por mujeres. Algunas pero no todas las personas sáficas utilizan el término "sáfica" para describir su identidad sexual o sexualidad. Utilícese únicamente para describir a personas que se identifican como sáficas.
alternative label: Sapphists
alternative label: Personas sáficas
broader: LGBTQ+ people
broader: Sexual minorities
change note: Version 4.2.0
has top concept: LGBTQ+ people
in scheme: v3
preferred label: Sáficas
related: Sapphic identity

Cisgender boys
type: Concept
issued: 2022-11-10
modified: 2025-02-23
comment: Boys (typically children or youth younger than 18) who are cisgender.
comment: Niños (normalmente menores de 18 años) que son cisgénero.
alternative label: Cis boys
alternative label: Niños cis
broader: Boys
broader: Cisgender youth
broader: Cisgender children
change note: Version 4.2.0
has top concept: Family members
in scheme: v3
preferred label: Niños cisgénero

Cisgender girls
type: Concept
issued: 2022-11-10
modified: 2025-02-23
comment: Girls (typically children or youth younger than 18) who are cisgender.
comment: Niñas (normalmente menores de 18 años) que son cisgénero.
alternative label: Cis girls
alternative label: Niñas cis
broader: Girls
broader: Cisgender youth
broader: Cisgender children
change note: Version 4.2.0
has top concept: Family members
in scheme: v3
preferred label: Niñas cisgénero

Gender equality
type: Concept
issued: 2022-11-10
modified: 2025-02-23
comment: The state of equal ease of access to resources and opportunities regardless of gender, including economic participation and decision-making, as well as the state of valuing different behaviors, aspirations, and needs equally, regardless of gender.
comment: El estado de igualdad en facilidad de acceso a recursos y oportunidades independientemente del género, incluida la participación económica y la toma de decisiones, así como el estado de valorar diferentes comportamientos, aspiraciones y necesidades por igual, independientemente del género.
broader: Human rights
change note: Version 4.2.0
has top concept: Human rights
in scheme: v3
preferred label: Igualdad de género
related: Feminism
related: Women's movement

Asexual youth
type: Concept
issued: 2022-11-10
modified: 2025-02-23
comment: Asexual people who are between the ages of childhood and adulthood.
comment: Personas asexuales que se encuentran entre la infancia y la adultez.
alternative label: Ace youth
alternative label: Asexual adolescents
alternative label: Asexual teenagers
alternative label: Asexual teens
alternative label: Juventud ace
alternative label: Adolescentes asexuales
alternative label: Adolescentes ace
alternative label: Jóvenes ace
broader: Asexual people
broader: LGBTQ+ youth
change note: Version 4.2.0
has top concept: Sexual minorities
in scheme: v3
preferred label: Juventud asexual
related: Asexual youth literature

Lesbian films
type: Concept
issued: 2022-11-15
modified: 2025-02-23
comment: Motion pictures, or movies, created by lesbian directors, depicting lesbians, or that are regarded as important within lesbian culture.
comment: Películas creadas por directoras lesbianas, que representan a lesbianas o a personas consideradas importantes dentro de la cultura lésbica.
alternative label: Lesbian movies
broader: LGBTQ+ films
broader: Lesbian cinema
change note: Version 4.2.0
has top concept: Subcultures
in scheme: v3
narrower: Lesbian porn films
preferred label: Películas lésbicas

Gay films
type: Concept
issued: 2022-11-15
modified: 2025-02-23
comment: Motion pictures, or movies, created by gay directors, depicting gay men, or that are regarded as important within gay culture.
comment: Películas creadas por directores gay, que representan a hombres gay o a personas consideradas importantes dentro de la cultura gay.
alternative label: Gay movies
broader: LGBTQ+ films
broader: Gay cinema
change note: Version 4.2.0
has top concept: Subcultures
in scheme: v3
narrower: Gay porn films
preferred label: Películas gay

LGBTQ+ siblings
type: Concept
issued: 2022-12-13
modified: 2025-02-23
comment: LGBTQ+ people who have siblings.
comment: Personas LGBTQ+ que tienen hermanos.
alternative label: Siblings (LGBTQ)
alternative label: Hermanos (LGBTQ)
broader: LGBTQ+ people
broader: Siblings
change note: Version 4.2.0
has top concept: LGBTQ+ people
in scheme: v3
preferred label: Hermanos LGBTQ+
related: Half-siblings

Daughters
type: Concept
issued: 2022-12-13
modified: 2025-02-23
comment: People who are daughters.
comment: Personas que son hijas.
broader: Family members
change note: Version 4.2.0
has top concept: Family members
in scheme: v3
narrower: LGBTQ+ daughters
narrower: Daughters of LGBTQ+ people
preferred label: Hijas

LGBTQ+ grandparents
type: Concept
issued: 2022-12-13
modified: 2025-02-23
comment: LGBTQ+ people who are grandparents.
comment: Personas LGBTQ+ que son abuelos.
alternative label: Grandparents (LGBTQ)
alternative label: Abuelas LGBTQ+
alternative label: Abuelos LGBTQ+
broader: Grandparents
broader: LGBTQ+ people
change note: Version 4.2.0
has top concept: Family members
in scheme: v3
preferred label: Abuelas y abuelos LGBTQ+
related: LGBTQ+ family generations

Police harassment of Indigenous LGBTQ+ people
type: Concept
issued: 2023-01-13
modified: 2025-02-23
comment: Any of various forms of inappropriate conduct, illegal actions, or abuses of power undertaken by law enforcement agents or agents of the state against Indigenous LGBTQ+ members of the public. This includes but is not limited to racial, ethnic, and other forms of profiling; unwarranted surveillance, searches, and seizure; selective enforcement; excessive use of force; sexual misconduct; intimidation and witness tampering; falsification of evidence; coerced confessions; false arrests and imprisonment; and bribing or lobbying.
comment: Cualquiera de las diversas formas de conducta inapropiada, acciones ilegales o abusos de poder que violentan directa o indirectamente a las personas LGBTQ+ indígenas, incluidas, entre otras, confesiones forzadas, intimidación, arrestos y encarcelamientos falsos, falsificación de pruebas, perjurio policial, manipulación de testigos, brutalidad y corrupción policial, elaboración de caracterizaciones raciales, étnicos y de otro tipo, vigilancia injustificada, registros o incautación de propiedad, soborno o cabildeo para obtener poder o estatus excesivo o para evitar consecuencias, aplicación selectiva de la ley y conducta sexual inapropiada.
broader: Police harassment of LGBTQ+ people
change note: Version 4.2.0
has top concept: Harassment
in scheme: v3
preferred label: Acoso policial a personas LGBTQ+ indígenas
related: Indigenous LGBTQ+ people
related: White supremacy in policing

LGBTQ+ criminalization
type: Concept
issued: 2023-01-13
modified: 2025-02-23
comment: Criminalization of existing or identifying as an LGBTQ+ person, being perceived as LGBTQ+, or engaging in any of various actions considered to be linked to LGBTQ+ status.
comment: La criminalización de una persona LGBTQ+ por existir o identificarse como tal, ser percibida como LGBTQ+ o participar de cualquiera de las diversas acciones consideradas vinculadas al estatus LGBTQ+.
alternative label: Criminalization of LGBTQ+ people
alternative label: Criminalización de personas LGBTQ+
broader: Criminalization
change note: Version 4.2.0
has top concept: Law
in scheme: v3
narrower: Criminalization of homosexuality
preferred label: Criminalización LGBTQ+
related: LGBTQ+ discrimination

Criminalization of homosexuality
type: Concept
issued: 2023-01-13
modified: 2026-02-11
comment: Criminalization of acts considered to be sexual or romantic between individuals perceived as being of the same gender category in a given sociocultural context.
comment: La criminalización de actos considerados sexuales o románticos entre personas percibidas como de la misma categoría de género en un determinado contexto sociocultural.
alternative label: Criminalization of same-gender relations
alternative label: Criminalization of same-sex relations
alternative label: Criminalización de las relación del mismo género
alternative label: Criminalización de las relación del mismo sexo
broader: LGBTQ+ criminalization
change note: Version 4.2.0
has top concept: Law
in scheme: v3
narrower: Paragraph 175
preferred label: Criminalización de la homosexualidad
related: Sodomy laws

Criminalization of gender non-conformity
type: Concept
issued: 2023-01-13
modified: 2025-02-23
comment: Criminalization of any expression of gender considered to be nonconforming in a given sociocultural context.
comment: La criminalización de cualquier expresión de género considerada disconforme en un determinado contexto sociocultural.
broader: Criminalization
change note: Version 4.2.0
has top concept: Law
in scheme: v3
narrower: Criminalization of cross-dressing
preferred label: Criminalización de la disidencia de género
related: Gender non-conforming identity

Defund the police movement
type: Concept
issued: 2023-01-13
modified: 2025-02-23
comment: Primarily a U.S. American and Canadian movement which supports divesting funds from, or abolition of, police departments (and often police structures generally) and reallocating them to non-policing forms of public safety and community support, such as social services, youth services, housing, education, healthcare and other community resources.
comment: Principalmente, un movimiento estadounidense y canadiense que apoya la desinversión de fondos, o la abolición, de los departamentos de policía (y a menudo de las estructuras policiales en general) y su reasignación a formas no policiales de seguridad pública y apoyo comunitario, como los servicios sociales, los servicios para la juventud, la vivienda, la educación, los servicios médicos y otros recursos comunitarios.
alternative label: Defund the Police
alternative label: Movement to defund police
alternative label: Desfinanciación de la policía
alternative label: Movimiento para desfinanciar la policía
broader: Social movements
change note: Version 4.2.0
has top concept: Social movements
in scheme: v3
preferred label: Movimiento para desfinanciar a la policía
related: Police
related: Police abolitionist movement

Police abolitionist movement
type: Concept
issued: 2023-01-13
modified: 2025-02-23
comment: A primarily U.S. American and Canadian political movement that advocates replacing policing with other systems of public safety. Police abolitionists believe that policing, as a system, is inherently flawed and cannot be reformed—a view that rejects the ideology of police reformists. While reformists seek to address the ways in which policing occurs, abolitionists seek to transform policing altogether through a process of disbanding, disempowering, and disarming the police. Abolitionists argue that the institution of policing is deeply rooted in a history of white supremacy and settler colonialism and that it is inseparable from a pre-existing racial capitalist order, and thus believe a reformist approach to policing will always fail.
comment: Un movimiento político principalmente estadounidense y canadiense que aboga por reemplazar la vigilancia policial con otros sistemas de seguridad pública. Los abolicionistas policiales creen que la vigilancia policial, como sistema, es inherentemente defectuosa y no puede reformarse, una visión que rechaza la ideología de los reformistas policiales. Mientras los reformistas buscan abordar las formas en que se realiza la actividad policial, los abolicionistas buscan transformarla por completo a través de un proceso de disolución, desempoderamiento y desarme de la policía. Los abolicionistas argumentan que la institución policial está profundamente arraigada en una historia de supremacía blanca y asentamiento colonial y que es inseparable de un orden capitalista racial preexistente y, por lo tanto, creen que un enfoque reformista de la policía siempre fracasará.
alternative label: Abolishing the police movement
alternative label: Abolición de la policía
broader: Social movements
change note: Version 4.2.0
has top concept: Social movements
in scheme: v3
preferred label: Movimiento por la abolición de la policía
related: Police
related: Defund the police movement

Identification of LGBTQ+ people by police
type: Concept
issued: 2023-01-13
modified: 2025-02-23
comment: Identification of LGBTQ+ people, or people believed to be LGBTQ+, by police using any of various tools and mechanisms, many of which are pseudoscientific in nature. Such data is then used to entrap and prosecute LGBTQ+ persons, especially in areas where being LGBTQ+ is still criminalized.
comment: Identificación de personas LGBTQ+, o personas que se cree que son LGBTQ+, por parte de la policía utilizando cualquiera de diversas herramientas y mecanismos, muchas de los cuales son de naturaleza pseudocientífica. Luego, esos datos se utilizan para atrapar y procesar a personas LGBTQ+, especialmente en áreas donde ser LGBTQ+ todavía está criminalizado.
broader: Police interactions with LGBTQ+ people
change note: Version 4.2.0
has top concept: Police interactions with LGBTQ+ people
in scheme: v3
narrower: Digital identification of LGBTQ+ people by police
preferred label: Identificación de personas LGBTQ+ por la policía
related: Outing (LGBTQ+ culture)

Performative LGBTQ+ activism by police
type: Concept
issued: 2023-01-13
modified: 2026-02-27
comment: LGBTQ+ activism undertaken by police organizations and institutions which intends to increase the social capital of such institutions, rather than to actually serve LGBTQ+ communities.
comment: Activismo LGBTQ+ emprendido por organizaciones e instituciones policiales que pretende aumentar el capital social de dichas instituciones, en lugar de servir realmente a las comunidades LGBTQ+.
alternative label: Gay copaganda
alternative label: LGBTQ+ copaganda
alternative label: Pinkwashing by police officers
alternative label: Pride patches on police uniforms
alternative label: Rainbow colored patrol cars
alternative label: Rainbow hate crime cars
alternative label: Rainbow-hued police cars
alternative label: Rainbow-painted police cars
alternative label: Rainbow-washing by police officers
alternative label: Copaganda gay
alternative label: Copaganda LGBTQ+
broader: Police interactions with LGBTQ+ people
change note: Version 4.2.0
has top concept: Police interactions with LGBTQ+ people
in scheme: v3
preferred label: Activismo performativo LGBTQ+ de la policía
related: LGBTQ+ activism
related: Police

Black Lives Matter movement
type: Concept
issued: 2023-01-13
modified: 2025-02-23
comment: A primarily U.S. American and Canadian decentralized political and social movement advocating for non-violent civil disobedience in protest against incidents of police brutality and all racially motivated violence against Black people. The broader movement and its related organizations typically advocate against police violence towards Black people, as well as for various other policy changes considered to be related to Black liberation.
comment: Un movimiento político y social descentralizado principalmente estadounidense y canadiense que aboga por la desobediencia civil no-violenta como protesta contra incidentes de brutalidad policial y toda violencia por motivos raciales contra las personas negras. El movimiento más amplio y sus respectivas organizaciones suelen abogar contra la violencia policial hacia las personas negras, así como a favor de otros cambios de políticas que se consideran relacionados con la liberación negra.
alternative label: BLM
alternative label: Black Lives Matter
alternative label: BlackLivesMatter
alternative label: Movement for Black Lives
alternative label: Movimiento BLM
alternative label: Movimiento por las vidas negras
alternative label: Movimiento Las Vidas Negras Importan
broader: Social movements
change note: Version 4.2.0
has top concept: Social movements
in scheme: v3
narrower: Black Trans Lives Matter movement
preferred label: Movimiento Black Lives Matter
related: Black LGBTQ+ people

Black Trans Lives Matter movement
type: Concept
issued: 2023-01-13
modified: 2025-02-23
comment: A part of the Black Lives Matter movement which specifically advocates for Black trans people (especially Black trans women) and fights for racial equity and Black liberation.
comment: Una parte del movimiento Black Lives Matter (Las Vidas Negras Importan en inglés) que aboga específicamente por las personas trans negras (especialmente las mujeres trans negras) y lucha por la equidad racial y la liberación negra.
alternative label: BTLM Movement
alternative label: BTLM
alternative label: Movimiento BTLM
broader: Black Lives Matter movement
change note: Version 4.2.0
has top concept: Social movements
in scheme: v3
preferred label: Movimiento Black Trans Lives Matter
related: Black LGBTQ+ people
related: Black transgender people

Aromantic poetry
type: Concept
issued: 2023-01-17
modified: 2025-02-23
comment: Literary work, typically written in verse, that focuses on aromantic characters, themes, or identity.
comment: Obras literarias, normalmente escritas en verso, que se centran en personajes, temas o identidades arrománticas.
broader: LGBTQ+ poetry
change note: Version 4.2.0
has top concept: Subcultures
in scheme: v3
preferred label: Poesía arromántica
related: Aromantic authors
related: Aromantic literature

Asexual poetry
type: Concept
issued: 2023-01-17
modified: 2025-02-23
comment: Literary work, typically written in verse, that focuses on asexual characters, themes, or identity.
comment: Obras literarias, normalmente escritas en verso, que se centran en personajes, temas o en la identidad asexual.
broader: LGBTQ+ poetry
change note: Version 4.2.0
has top concept: Subcultures
in scheme: v3
preferred label: Poesía asexual
related: Asexual authors
related: Asexual literature

Demisexual poetry
type: Concept
issued: 2023-01-17
modified: 2025-02-23
comment: Literary work, typically written in verse, that focuses on demisexual characters, themes, or identity.
comment: Obras literarias, típicamente escritas en verso, que se centran en personajes, temas o identidades demisexuales.
broader: LGBTQ+ poetry
change note: Version 4.2.0
has top concept: Subcultures
in scheme: v3
preferred label: Poesía demisexual
related: Demisexual literature
related: Demisexual authors

Aromantic drama
type: Concept
issued: 2023-03-20
modified: 2025-02-23
comment: Works of fiction written to be performed; use in reference to dramatic works focusing on aromantic characters or themes.
comment: Obras de ficción escritas para ser puestas en escena; utilícese en referencia a obras dramáticas que se centran en personajes o temas arrománticos.
broader: LGBTQ+ drama
change note: Version 4.2.0
has top concept: Subcultures
in scheme: v3
preferred label: Drama aromántico
related: Aromantic literature
related: Aromantic theater

Aromantic youth
type: Concept
issued: 2023-03-20
modified: 2025-02-23
comment: Aromantic people who are between the ages of childhood and adulthood.
comment: Personas arrománticas que se encuentran entre la infancia y la edad adulta.
broader: LGBTQ+ youth
change note: Version 4.2.0
has top concept: Youth
in scheme: v3
preferred label: Juventud arromántica
related: LGBTQ+ unhoused youth
related: Aromantic youth literature

Aromantic autobiographies
type: Concept
issued: 2023-03-23
modified: 2025-02-23
comment: Accounts of aromantic peoples' lives written by those people. For written accounts of aromantic people's lives that were not written by the subject, use "Aromantic biographies."
comment: Relatos de la vida de personas escritos por dichas personas. Utilícese para autobiografías escritas por autores arrománticos.
broader: LGBTQ+ autobiographies
change note: Version 4.2.0
has top concept: LGBTQ+ autobiographies
in scheme: v3
preferred label: Autobiografías arrománticas
related: Aromantic authors
related: Aromantic biographies

Aromantic biographies
type: Concept
issued: 2023-03-23
modified: 2025-02-23
comment: Written accounts of the lives of aromantic people. For written accounts of aromantic people's lives written by the subject, use "Aromantic autobiographies."
comment: Relatos escritos de la vida de personas conocidas por ser arrománticas.
broader: LGBTQ+ biographies
change note: Version 4.2.0
has top concept: LGBTQ+ biographies
in scheme: v3
preferred label: Biografías arrománticas
related: Aromantic authors
related: Aromantic autobiographies

Asexual drama
type: Concept
issued: 2023-03-23
modified: 2025-02-23
comment: Works of fiction written to be performed; use in reference to dramatic works focusing on asexual characters or themes.
comment: Obras de ficción escritas para ser puestas en escena; utilícese en referencia a obras dramáticas que se centran en personajes o temas asexuales.
broader: LGBTQ+ drama
change note: Version 4.2.0
has top concept: Subcultures
in scheme: v3
preferred label: Drama asexual
related: Asexual literature
related: Asexual theater

Asexual autobiographies
type: Concept
issued: 2023-03-24
modified: 2025-02-23
comment: Accounts of asexual peoples' lives written by those people. For written accounts of asexual people's lives that were not written by the subject, use "Asexual biographies."
comment: Relatos de vida de personas escritos por esas mismas personas; utilícese para autobiografías escritas por autores asexuales.
broader: LGBTQ+ autobiographies
change note: Version 4.2.0
has top concept: LGBTQ+ autobiographies
in scheme: v3
preferred label: Autobiografías asexuales
related: Asexual authors
related: Asexual biographies

Asexual biographies
type: Concept
issued: 2023-03-24
modified: 2025-02-23
comment: Written accounts of the lives of asexual people. For written accounts of asexual people's lives written by the subject, use "Asexual autobiographies."
comment: Relatos escritos de la vida de personas conocidas por ser asexuales.
broader: LGBTQ+ biographies
change note: Version 4.2.0
has top concept: LGBTQ+ biographies
in scheme: v3
preferred label: Biografías asexuales
related: Asexual authors
related: Asexual autobiographies

Demisexual drama
type: Concept
issued: 2023-03-26
modified: 2025-02-23
comment: Works of fiction written to be performed; use in reference to dramatic works focusing on demisexual characters or themes.
comment: Obras de ficción escritas para ser puestas en escena; utilícese en referencia a obras dramáticas que se centran en personajes o temas demisexuales.
broader: LGBTQ+ drama
change note: Version 4.2.0
has top concept: Subcultures
in scheme: v3
preferred label: Drama demisexual
related: Demisexual literature
related: Demisexual theater

Demisexual autobiographies
type: Concept
issued: 2023-03-28
modified: 2025-02-23
comment: Accounts of demisexual peoples' lives written by those people. For written accounts of demisexual people's lives that were not written by the subject, use "Demisexual biographies."
comment: Relatos de vida de personas escritos por esas mismas personas; utilícese para autobiografías escritas por autores demisexuales
alternative label: Memorias demisexuales
broader: LGBTQ+ autobiographies
change note: Version 4.2.0
has top concept: LGBTQ+ autobiographies
in scheme: v3
preferred label: Autobiografías demisexuales
related: Demisexual authors
related: Demisexual biographies

Demisexual biographies
type: Concept
issued: 2023-03-28
modified: 2025-02-23
comment: Written accounts of the lives of demisexual people. For written accounts of demisexual people's lives written by the subject, use "Demisexual autobiographies."
comment: Relatos escritos de la vida de personas conocidas por ser demisexuales.
broader: LGBTQ+ biographies
change note: Version 4.2.0
has top concept: LGBTQ+ biographies
in scheme: v3
preferred label: Biografías demisexuales
related: Demisexual authors
related: Demisexual autobiographies

Megasexual drama
type: Concept
issued: 2023-03-29
modified: 2025-02-23
comment: Works of fiction written to be performed; use in reference to dramatic works focusing on megasexual characters or themes.
comment: Obras de ficción escritas para ser puestas en escena; utilícese en referencia a obras dramáticas que se centran en personajes o temas megasexuales.
broader: LGBTQ+ drama
change note: Version 4.2.0
has top concept: Subcultures
in scheme: v3
preferred label: Drama megasexual
related: Megasexual theater
related: Megasexual literature

Megasexual autobiographies
type: Concept
issued: 2023-04-11
modified: 2025-02-23
comment: Accounts of megasexual peoples' lives written by those people. For written accounts of megasexual people's lives that were not written by the subject, use "Megasexual biographies."
comment: Relatos de vida de personas escritos por esas mismas personas; utilícese para autobiografías escritas por autores megasexuales.
alternative label: Memorias megasexuales
broader: LGBTQ+ autobiographies
change note: Version 4.2.0
has top concept: LGBTQ+ autobiographies
in scheme: v3
preferred label: Autobiografías megasexuales
related: Megasexual authors
related: Megasexual biographies

Megasexual biographies
type: Concept
issued: 2023-04-11
modified: 2025-02-23
comment: Written accounts of the lives of megasexual people. For written accounts of megasexual people's lives written by the subject, use "Megasexual autobiographies."
comment: Relatos escritos de la vida de personas conocidas por ser megasexuales.
broader: LGBTQ+ biographies
change note: Version 4.2.0
has top concept: LGBTQ+ biographies
in scheme: v3
preferred label: Biografías megasexual
related: Megasexual authors
related: Megasexual autobiographies

Greyromantic drama
type: Concept
issued: 2023-04-11
modified: 2025-02-23
comment: Works of fiction written to be performed; use in reference to dramatic works focusing on greyromantic characters or themes.
comment: Obras de ficción escritas para ser puestas en escena; utilícese en referencia a obras dramáticas que se centran en personajes o temas grisrománticos.
broader: LGBTQ+ drama
change note: Version 4.2.0
has top concept: Subcultures
in scheme: v3
preferred label: Drama grisromántico
related: Greyromantic theater
related: Greyromantic literature

Greyromantic poetry
type: Concept
issued: 2023-04-11
modified: 2025-02-23
comment: Literary works, typically written in verse, that focus on greyromantic characters, themes, or identity.
comment: Obras literarias, normalmente escritas en verso, que se centran en personajes, temas o identidades grisrománticos.
broader: LGBTQ+ poetry
change note: Version 4.2.0
has top concept: Subcultures
in scheme: v3
preferred label: Poesía grisromántica
related: Greyromantic authors
related: Greyromantic literature

Greyromantic autobiographies
type: Concept
issued: 2023-04-11
modified: 2025-02-23
comment: Accounts of greyromantic peoples' lives written by those people. For written accounts of greyromantic people's lives that were not written by the subject, use "Greyromantic biographies."
comment: Relatos de vida de personas escritos por esas mismas personas; utilícese para autobiografías escritas por autores grisrománticos.
alternative label: Memorias grisrománticas
broader: LGBTQ+ autobiographies
change note: Version 4.2.0
has top concept: LGBTQ+ autobiographies
in scheme: v3
preferred label: Autobiografías grisrománticas
related: Greyromantic authors
related: Greyromantic biographies

Greyromantic biographies
type: Concept
issued: 2023-04-11
modified: 2025-02-23
comment: Written accounts of the lives of greyromantic people. For written accounts of greyromantic people's lives written by the subject, use "Greyromantic autobiographies."
comment: Relatos escritos de la vida de personas conocidas por ser grisrománticas.
broader: LGBTQ+ biographies
change note: Version 4.2.0
has top concept: LGBTQ+ biographies
in scheme: v3
preferred label: Biografías grisrománticas
related: Greyromantic authors
related: Greyromantic autobiographies

Two-Spirit erotic films
type: Concept
issued: 2023-04-12
modified: 2025-02-23
comment: Erotic films or movies, created by Two-Spirit directors, depicting Two-Spirit people, or that are regarded as important within Two-Spirit culture.
comment: Filmes o películas eróticas, creadas por directores dos espíritus, que representan a personas dos espíritus o a personas consideradas importantes dentro de la cultura dos espíritus.
alternative label: 2S erotic films
alternative label: Two Spirit erotic films
alternative label: Two Spirited erotic films
alternative label: Two-Spirited erotic films
broader: Two-Spirit films
change note: Version 4.2.0
has top concept: Two-Spirit films
in scheme: v3
narrower: Two-Spirit porn films
preferred label: Películas eróticas dos espíritus
related: LGBTQ+ erotic films

Lesbian erotic films
type: Concept
issued: 2023-04-12
modified: 2025-02-23
comment: Erotic films or movies, created by lesbian directors, depicting lesbian people, or that are regarded as important within lesbian culture.
comment: Filmes o películas eróticas, creadas por directoras lesbianas, que representan a lesbianas o a personas consideradas importantes dentro de la cultura lésbica.
broader: LGBTQ+ erotic films
broader: Lesbian erotic art
change note: Version 4.2.0
has top concept: Subcultures
in scheme: v3
preferred label: Películas eróticas lésbicas
related: Lesbian porn films

Gay erotic films
type: Concept
issued: 2023-04-12
modified: 2025-02-23
comment: Erotic films or movies, created by gay directors, depicting gay people, or that are regarded as important within gay culture.
comment: Filmes o películas eróticas, creadas por directores gay, que representan a hombres gay o a personas consideradas importantes dentro de la cultura gay.
broader: LGBTQ+ erotic films
broader: Gay erotic art
change note: Version 4.2.0
has top concept: Subcultures
in scheme: v3
preferred label: Películas eróticas gay
related: Gay porn films

Bisexual erotic films
type: Concept
issued: 2023-04-12
modified: 2025-02-23
comment: Erotic films or movies, created by bisexual directors, depicting bisexual people, or that are regarded as important within bisexual culture.
comment: Arte erótico, creado por artistas bisexuales, que representa a personas bisexuales o a personas consideradas importantes dentro de la cultura bisexual.
broader: LGBTQ+ erotic films
broader: Bisexual erotic art
change note: Version 4.2.0
has top concept: Subcultures
in scheme: v3
preferred label: Arte erótico bisexual
related: Bisexual porn films

Transgender erotic films
type: Concept
issued: 2023-04-12
modified: 2025-02-23
comment: Erotic films or movies, created by transgender directors, depicting transgender people, or that are regarded as important within transgender culture.
comment: Filmes o películas eróticas, creadas por directores transgénero, que representan a personas transgénero o a personas consideradas importantes dentro de la cultura transgénero.
broader: LGBTQ+ erotic films
broader: Transgender erotic art
change note: Version 4.2.0
has top concept: Subcultures
in scheme: v3
preferred label: Películas eróticas transgénero
related: Transgender porn films

Queer erotic films
type: Concept
issued: 2023-04-12
modified: 2025-02-23
comment: Erotic films or movies, created by queer directors, depicting queer people, or that are regarded as important within queer culture.
comment: Filmes o películas eróticas, creadas por directores queer, que representan a personas queer o a personas consideradas importantes dentro de la cultura queer.
broader: LGBTQ+ erotic films
broader: Queer erotic art
change note: Version 4.2.0
has top concept: Subcultures
in scheme: v3
preferred label: Películas eróticas queer
related: Queer porn films

Intersex erotic films
type: Concept
issued: 2023-04-12
modified: 2025-02-23
comment: Erotic films or movies, created by intersex directors, depicting intersex people, or that are regarded as important within intersex culture.
comment: Filmes o películas eróticas, creadas por directores intersex, que representan a personas intersex o a personas consideradas importantes dentro de la cultura intersex.
broader: LGBTQ+ erotic films
broader: Intersex erotic art
change note: Version 4.2.0
has top concept: Subcultures
in scheme: v3
preferred label: Películas eróticas intersex
related: Intersex porn films

Aromantic erotic films
type: Concept
issued: 2023-04-12
modified: 2025-02-23
comment: Erotic films or movies, created by aromantic directors, depicting aromantic people, or that are regarded as important within aromantic culture.
comment: Filmes o películas eróticas, creadas por directores arrománticos, que representan a personas arrománticas o a personas consideradas importantes dentro de la cultura arromántica.
broader: LGBTQ+ erotic films
broader: Aromantic erotic art
change note: Version 4.2.0
has top concept: Subcultures
in scheme: v3
preferred label: Películas eróticas arrománticas
related: Aromantic porn films

Asexual erotic films
type: Concept
issued: 2023-04-12
modified: 2025-02-23
comment: Erotic films or movies, created by asexual directors, depicting asexual people, or that are regarded as important within asexual culture.
comment: Filmes o películas eróticas, creadas por directores asexuales, que representan a personas asexuales o a personas consideradas importantes dentro de la cultura asexual.
broader: LGBTQ+ erotic films
broader: Asexual erotic art
change note: Version 4.2.0
has top concept: Subcultures
in scheme: v3
preferred label: Películas eróticas asexuales
related: Asexual porn films

Demisexual erotic films
type: Concept
issued: 2023-04-12
modified: 2025-02-23
comment: Erotic films or movies, created by demisexual directors, depicting demisexual people, or that are regarded as important within demisexual culture.
comment: Filmes o películas eróticas, creadas por directores demisexuales, que representan a personas demisexuales o a personas consideradas importantes dentro de la cultura demisexual.
broader: LGBTQ+ erotic films
broader: Demisexual erotic art
change note: Version 4.2.0
has top concept: Subcultures
in scheme: v3
preferred label: Películas eróticas demisexuales
related: Demisexual porn films

Demisexual porn films
type: Concept
issued: 2023-04-12
modified: 2025-02-23
comment: Erotic or sexually explicit films featuring demisexual people.
comment: Películas eróticas o sexualmente explícitas protagonizadas por personas demisexuales.
broader: LGBTQ+ porn films
broader: Demisexual erotic art
change note: Version 4.2.0
has top concept: Subcultures
in scheme: v3
preferred label: Pornografía demisexual
related: Demisexual erotic films

69ing
type: Concept
issued: 2023-04-12
modified: 2025-02-23
comment: 69ing refers to an act of shared oral sex between two people simultaneously giving and receiving oral sex, said to look similar to the number 69.
comment: 69ing se refiere a un acto de sexo oral compartido entre dos personas, una encima de la otra, que dan y reciben sexo oral simultáneamente. Se dice que la posición se parece al número 69.
alternative label: 69'ing
alternative label: 69-ing
alternative label: 69
alternative label: Sixty-Nining
alternative label: Posición 69
broader: Oral sex
change note: Version 4.2.0
has top concept: Sex (Act)
in scheme: v3
preferred label: Hacer el 69
related: Fellatio
related: Cunnilingus

People with transgender parents
type: Concept
issued: 2023-04-14
modified: 2025-02-23
comment: People who have one or more transgender parent or caregiver.
comment: Personas que tienen uno o más padres o cuidadores transgénero.
alternative label: KOT (Kids of Trans)
alternative label: Kids of Trans
alternative label: PTP
alternative label: People with trans parents
alternative label: Transpawn
alternative label: Hijos de personas transgénero
alternative label: Hijas de personas transgénero
alternative label: Hijxs de personas transgénero
alternative label: Hijos de personas trans
alternative label: Hijas de personas trans
alternative label: Hijxs de personas trans
alternative label: Personas con padres trans
broader: Children of transgender people
change note: Version 4.2.0
has top concept: Family members
in scheme: v3
preferred label: Personas con padres transgénero
related: Transgender families
related: Transgender parents

Internalized lesbophobia
type: Concept
issued: 2023-04-14
modified: 2025-02-23
comment: The phenomenon in which lesbians internalize or adopt lesbophobic beliefs (i.e., negative perceptions of and intolerance toward lesbians and lesbianism) as a result of being raised or socialized within a lesbophobic environment or culture.
comment: El fenómeno a través del cual las lesbianas internalizan o adoptan creencias lesbofóbicas (es decir, percepciones negativas e intolerancia hacia las lesbianas y el lesbianismo) como resultado de haber sido criadas o socializadas dentro de un entorno o una cultura lesbofóbica.
broader: Lesbophobia
broader: Internalized oppression
change note: Version 4.2.0
has top concept: LGBTQ+ phobia
in scheme: v3
narrower: Lateral lesbophobia
preferred label: Lesbofobia internalizada

Internalized biphobia
type: Concept
issued: 2023-04-14
modified: 2025-02-23
comment: The phenomenon in which bisexual people internalize or adopt biphobic beliefs (i.e., negative perceptions of and intolerance toward bisexual people and bisexuality) as a result of being raised or socialized within a biphobic environment or culture.
comment: El fenómeno a través del cual las personas bisexuales internalizan o adoptan creencias bifóbicas (es decir, percepciones negativas e intolerancia hacia las personas bisexuales y la bisexualidad) como resultado de haber sido criadas o socializadas dentro de un entorno o una cultura bifóbica.
broader: Biphobia
broader: Internalized oppression
change note: Version 4.2.0
has top concept: LGBTQ+ phobia
in scheme: v3
narrower: Lateral biphobia
preferred label: Bifobia internalizada

Internalized transphobia
type: Concept
issued: 2023-04-14
modified: 2025-02-23
comment: The phenomenon in which transgender people internalize or adopt transphobic beliefs (i.e., negative perceptions of and intolerance toward transgender people and trans identities) as a result of being raised or socialized within a transphobic environment or culture.
comment: El fenómeno a través del cual las personas transgénero internalizan o adoptan creencias transfóbicas (es decir, percepciones negativas e intolerancia hacia las personas transgénero y las identidades trans) como resultado de haber sido criadas o socializadas dentro de un entorno o una cultura transfóbica.
broader: Transphobia
broader: Internalized oppression
change note: Version 4.2.0
has top concept: LGBTQ+ phobia
in scheme: v3
narrower: Lateral transphobia
preferred label: Transfobia internalizada

Internalized queerphobia
type: Concept
issued: 2023-04-14
modified: 2025-02-23
comment: The phenomenon in which queer people internalize or adopt queerphobic beliefs (i.e., negative perceptions of and intolerance toward queer people and queerness) as a result of being raised or socialized within a queerphobic environment or culture.
comment: El fenómeno a través del cual personas queer internalizan o adoptan creencias queerfóbicas (es decir, percepciones negativas e intolerancia hacia las personas queer y la identidad queer) como resultado de haber sido criadas o socializadas dentro de un entorno o una cultura lesbofóbica.
broader: Queerphobia
broader: Internalized oppression
change note: Version 4.2.0
has top concept: LGBTQ+ phobia
in scheme: v3
narrower: Lateral queerphobia
preferred label: Queerfobia internalizada

Internalized intersexphobia
type: Concept
issued: 2023-04-14
modified: 2025-02-23
comment: The phenomenon in which intersex people internalize or adopt intersexphobic beliefs (i.e., negative perceptions of and intolerance toward intersex people and intersex variations) as a result of being raised or socialized within a intersexphobic environment or culture.
comment: El fenómeno a través del cual las personas intersexuales internalizan o adoptan creencias intersexfóbicas (es decir, percepciones negativas e intolerancia hacia las personas intersex y variaciones intersex) como resultado de haber sido criadas o socializadas dentro de un entorno o una cultura intersexfóbica.
alternative label: Internalized interphobia
alternative label: Interfobia internalizada
broader: Intersexphobia
broader: Internalized oppression
change note: Version 4.2.0
has top concept: LGBTQ+ phobia
in scheme: v3
narrower: Lateral intersexphobia
preferred label: Intersexfobia internalizada

Transgender art
type: Concept
issued: 2023-04-14
modified: 2025-04-23
comment: Term for different forms of creative activity, including visual, material, and performing arts, by transgender artists or about transgender topics and communities.
comment: Término para diferentes formas de actividad creativa, incluidas las artes visuales, materiales y escénicas, realizadas por artistas transgénero o sobre temas y comunidades transgénero.
broader: LGBTQ+ arts
change note: Version 4.2.0
has top concept: Subcultures
in scheme: v3
preferred label: Arte transgénero
related: Transgender erotic art
related: Transgender people in visual art

Gay art
type: Concept
issued: 2023-04-14
modified: 2025-04-23
comment: Umbrella term for different forms of creative activity, including visual, material, and performing arts, by gay artists or about gay topics and communities. Use a more specific term if possible.
comment: Término general para diferentes formas de actividad creativa, incluidas las artes visuales, materiales y escénicas, realizadas por artistas gay o sobre temas y comunidades gay. Utilícese un término más específico si es posible.
broader: LGBTQ+ arts
change note: Version 4.2.0
has top concept: Subcultures
in scheme: v3
preferred label: Arte gay
related: Gay erotic art
related: Gay men in visual art

Lesbian art
type: Concept
issued: 2023-04-14
modified: 2025-04-23
comment: Term for different forms of creative activity, including visual, material, and performing arts, by lesbian artists or about lesbian topics and communities.
comment: Término para diferentes formas de actividad creativa, incluidas las artes visuales, materiales y escénicas, realizadas por artistas lesbianas o sobre temas y comunidades lésbicas.
broader: LGBTQ+ arts
change note: Version 4.2.0
has top concept: Subcultures
in scheme: v3
preferred label: Arte lésbico
related: Lesbian erotic art
related: Lesbians in visual art

Bisexual art
type: Concept
issued: 2023-04-14
modified: 2025-04-23
comment: Term for different forms of creative activity, including visual, material, and performing arts, by bisexual artists or about bisexual topics and communities.
comment: Término para diferentes formas de actividad creativa, incluidas las artes visuales, materiales y escénicas, de artistas bisexuales o sobre temas y comunidades bisexuales.
broader: LGBTQ+ arts
change note: Version 4.2.0
has top concept: Subcultures
in scheme: v3
preferred label: Arte bisexual
related: Bisexual erotic art
related: Bisexual people in visual art

Intersex art
type: Concept
issued: 2023-04-14
modified: 2025-04-23
comment: Term for different forms of creative activity, including visual, material, and performing arts, by intersex artists or about intersex topics and communities.
comment: Término para diferentes formas de actividad creativa, incluidas las artes visuales, materiales y escénicas, realizadas por artistas intersex o sobre temas y comunidades intersex.
broader: LGBTQ+ arts
change note: Version 4.2.0
has top concept: Subcultures
in scheme: v3
preferred label: Arte intersex
related: Intersex erotic art
related: Intersex people in visual art

Sperm donation
type: Concept
issued: 2023-04-14
modified: 2025-02-23
comment: The process by which a person donates their sperm for reproduction.
comment: El proceso mediante el cual una persona dona su esperma para la reproducción.
broader: Assisted reproduction
change note: Version 4.2.0
has top concept: Assisted reproductive technology
in scheme: v3
preferred label: Donación de esperma
related: Sperm donors
related: Donor insemination

Surro babies
type: Concept
issued: 2023-04-14
modified: 2025-02-23
comment: People born through surrogacy.
comment: Personas nacidas mediante la gestación subrogada.
alternative label: Surro baby
alternative label: Surrogate babies
broader: Children
change note: Version 4.2.0
has top concept: Family members
in scheme: v3
preferred label: Bebés de subrogacion
related: Gestational parenthood
related: Gestational surrogacy

Two-Spirit political activists
type: Concept
issued: 2023-06-26
modified: 2025-02-23
comment: Two-Spirit people working to bring about political or social change through public organizing.
comment: Personas dos espíritus que trabajan para lograr cambios políticos o sociales mediante la organización pública.
alternative label: 2S political activists
alternative label: Two Spirit political activists
alternative label: Two Spirited political activists
alternative label: Two-Spirited political activists
change note: Version 4.2.0
in scheme: v3
preferred label: Activistas políticos dos espíritus
related: LGBTQ+ political activists
related: Two-Spirit activism

Asexual neurodivergent people
type: Concept
issued: 2023-06-26
modified: 2026-03-03
comment: Asexual people with neurodevelopmental differences in areas such as cognition, sensory processing, emotionality, and sociality.
comment: Personas asexuales cuyos cerebros procesan, aprenden y/o se comportan de forma diferente a lo que la sociedad considera típico. Algunas de estas diferencias neurológicas pueden presentarse como dificultades de aprendizaje, trastornos médicos y otras condiciones.
alternative label: Ace neurodivergent people
alternative label: Asexual neuroatypical people
alternative label: Ace neuroatypical people
broader: LGBTQ+ neurodivergent people
broader: Asexual disabled people
change note: Version 4.2.0
has top concept: LGBTQ+ people
in scheme: v3
narrower: Asexual autistic people
preferred label: Personas asexuales neurodivergentes

Two-Spirit neurodivergent people
type: Concept
issued: 2023-06-26
modified: 2026-03-03
comment: Two-Spirit people with neurodevelopmental differences in areas such as cognition, sensory processing, emotionality, and sociality.
comment: Personas dos espíritus cuyos cerebros procesan, aprenden y/o se comportan de forma diferente a lo que la sociedad considera típico. Algunas de estas diferencias neurológicas pueden presentarse como dificultades de aprendizaje, trastornos médicos y otras condiciones.
alternative label: Two Spirit neurodivergent people
alternative label: Two-Spirited neurodivergent people
alternative label: Two Spirited neurodivergent people
alternative label: 2S neurodivergent people
alternative label: Two Spirit neuroatypical people
alternative label: Two-Spirited neuroatypical people
alternative label: Two Spirited neuroatypical people
alternative label: 2S neuroatypical people
broader: Two-Spirit people
change note: Version 4.2.0
has top concept: Gender
in scheme: v3
narrower: Two-Spirit autistic people
preferred label: Personas dos espíritus neurodivergentes
related: LGBTQ+ neurodivergent people

Two-Spirit autistic people
type: Concept
issued: 2023-06-26
modified: 2025-02-23
comment: Two-Spirit people who are autistic.
comment: Personas dos espíritus que son autistas.
alternative label: 2S autistic people
alternative label: 2S people with autism
alternative label: Two Spirit autistic people
alternative label: Two Spirit people with autism
alternative label: Two Spirited autistic people
alternative label: Two Spirited people with autism
alternative label: Two-Spirited autistic people
alternative label: Two-Spirited people with autism
alternative label: Personas dos espíritus con autismo
alternative label: Personas autistas dos espíritus
broader: Two-Spirit neurodivergent people
broader: Two-Spirit disabled people
change note: Version 4.2.0
has top concept: Gender
in scheme: v3
preferred label: Personas dos espíritus autistas
related: LGBTQ+ autistic people

Two-Spirit archives
type: Concept
issued: 2023-06-26
modified: 2026-02-23
comment: Collections of records and materials relating to Two-Spirit people or Two-Spirit communities; can include a variety of organizations and institutions from community to government archives.
comment: Colecciones de registros y materiales relacionados con personas dos espíritus o comunidades dos espíritus; pueden incluir una variedad de organizaciones e instituciones, desde archivos comunitarios hasta gubernamentales.
alternative label: 2S archives
alternative label: Two Spirit archives
alternative label: Two Spirited archives
alternative label: Two-Spirited archives
change note: Version 4.2.0
in scheme: v3
preferred label: Archivos dos espíritus
related: LGBTQ+ archives
related: Metadata for trans and gender diverse resources

Two-Spirit libraries
type: Concept
issued: 2023-06-26
modified: 2026-02-23
comment: Libraries that hold materials primarily pertaining to Two-Spirit people or intended for use by Two-Spirit people.
comment: Bibliotecas que contienen materiales principalmente relacionados con personas dos espíritus o destinados a ser utilizados por personas dos espíritus.
alternative label: 2S libraries
alternative label: Two Spirit libraries
alternative label: Two Spirited libraries
alternative label: Two-Spirited libraries
change note: Version 4.2.0
in scheme: v3
preferred label: Bibliotecas dos espíritus
related: LGBTQ+ libraries
related: Metadata for trans and gender diverse resources

Two-Spirit youth literature
type: Concept
issued: 2023-06-27
modified: 2025-02-23
comment: Written literary works for an audience of readers from 12-18 years of age, also known as young adult literature or YA; use in reference to youth literature focusing on Two-Spirit characters or themes.
comment: Obras literarias escritas para una audiencia de lectores de 12 a 18 años de edad, también conocida como literatura para adultos jóvenes o YA; utilícese en referencia a la literatura juvenil que se centra en personajes o temas dos espíritus
alternative label: 2S youth literature
alternative label: Two Spirit youth literature
alternative label: Two Spirited youth literature
alternative label: Two-Spirited youth literature
broader: Two-Spirit literature
change note: Version 4.2.0
has top concept: Two-Spirit literature
in scheme: v3
preferred label: Literatura juvenil dos espíritus
related: LGBTQ+ youth literature
related: Two-Spirit youth

Two-Spirit movement
type: Concept
issued: 2023-06-27
modified: 2025-04-23
comment: Umbrella term for activism focused on the rights of Two-Spirit people and issues faced by Two-Spirit communities.
comment: Término general para el activismo centrado en los derechos de las personas dos espíritus y los problemas a los que se enfrentan las comunidades dos espíritus.
alternative label: 2S movement
alternative label: Two Spirit movement
alternative label: Two Spirited movement
alternative label: Two-Spirited movement
change note: Version 4.2.0
in scheme: v3
preferred label: Movimiento dos espíritus
related: LGBTQ+ movement
related: Two-Spirit demonstrations

Two-Spirit museums
type: Concept
issued: 2023-06-27
modified: 2026-02-23
comment: Institutions dedicated to the storage, exhibition, conservation, and preservation of materials relating to Two-Spirit people and Two-Spirit history.
comment: Instituciones dedicadas al almacenamiento, la exposición, la conservación y la preservación de materiales relacionados con las personas dos espíritus y la historia dos espíritus.
alternative label: 2S museums
alternative label: Two Spirit museums
alternative label: Two Spirited museums
alternative label: Two-Spirited museums
change note: Version 4.2.0
in scheme: v3
preferred label: Museos dos espíritus
related: LGBTQ+ museums
related: Metadata for trans and gender diverse resources

Two-Spirit radio
type: Concept
issued: 2023-06-27
modified: 2026-02-23
comment: Auditory content broadcast on the radio (analog or digital) about Two-Spirit people and Two-Spirit issues.
comment: Contenido auditivo emitido por radio (análoga o digital) sobre personas dos espíritus y asuntos dos espíritus.
alternative label: 2S radio
alternative label: Two Spirit radio
alternative label: Two Spirited radio
alternative label: Two-Spirited radio
change note: Version 4.2.0
in scheme: v3
preferred label: Radio dos espíritus
related: LGBTQ+ radio
related: Two-Spirit podcasts

Two-Spirit victims of sexual abuse
type: Concept
issued: 2023-06-27
modified: 2025-02-23
comment: Two-Spirit people who have experienced sexual abuse and may or may not have survived; follow the individual's preference for "victims" or "survivors" whenever possible.
comment: Personas dos espíritus que han sufrido abuso sexual y pueden haber sobrevivido o no; siga la preferencia de la persona sobre el uso de "víctimas" o "sobrevivientes" siempre que sea posible.
alternative label: 2S victims of sexual abuse
alternative label: Two Spirit victims of sexual abuse
alternative label: Two Spirited victims of sexual abuse
alternative label: Two-Spirited victims of sexual abuse
broader: Two-Spirit people
broader: Two-Spirit victims of crime
change note: Version 4.2.0
has top concept: Gender
in scheme: v3
preferred label: Víctimas dos espiritus de abuso sexual
related: LGBTQ+ victims of sexual abuse

Intersex biographies
type: Concept
issued: 2023-06-27
modified: 2025-02-23
comment: Written accounts of the lives of intersex people. For written accounts of intersex people's lives written by the subject, use "Intersex autobiographies."
comment: Relatos escritos de las vidas de personas conocidas por ser intersex.
broader: LGBTQ+ biographies
change note: Version 4.2.0
has top concept: LGBTQ+ biographies
in scheme: v3
preferred label: Biografías intersex
related: Intersex authors
related: Intersex autobiographies

Asexual Deaf people
type: Concept
issued: 2023-06-28
modified: 2025-02-23
comment: Asexual people with significant or total hearing loss. Some but not all Deaf people prefer to capitalize Deaf in recognition of the cultural and linguistic identity they share with other Deaf people.
comment: Personas asexuales con pérdida auditiva significativa o total. Algunas personas sordas, pero no todas, prefieren escribir “Sorda/o” con mayúscula en reconocimiento de la identidad cultural y lingüística que comparten con otras personas sordas.
alternative label: Deaf asexual people
alternative label: Personas sordas asexuales
broader: LGBTQ+ Deaf people
broader: Asexual disabled people
change note: Version 4.2.0
has top concept: LGBTQ+ people
in scheme: v3
preferred label: Personas asexuales sordas
related: Asexual hard of hearing people

Asexual hard of hearing people
type: Concept
issued: 2023-06-28
modified: 2025-02-23
comment: Asexual people with significant or total hearing loss who may or may not consider themselves d/Deaf.
comment: Personas asexuales con pérdida de audición significativa o total, que pueden o no considerarse S/sordas.
alternative label: Personas asexuales con dificultades de audición
alternative label: Personas ace con dificultades de audición
alternative label: Personas asexuales con dificultades auditivas
alternative label: Personas ace con dificultades auditivas
broader: LGBTQ+ hard of hearing people
broader: Asexual disabled people
change note: Version 4.2.0
has top concept: LGBTQ+ people
in scheme: v3
preferred label: Personas asexuales con problemas de audición
related: Asexual Deaf people

Asexual mothers
type: Concept
issued: 2023-06-28
modified: 2025-02-23
comment: Asexual people who are mothers.
comment: Personas asexuales que son madres.
alternative label: Mamás asexuales
broader: Mothers
broader: Asexual parents
broader: LGBTQ+ mothers
change note: Version 4.2.0
has top concept: Family members
in scheme: v3
preferred label: Madres asexuales

Leydig cell hypoplasia
type: Concept
issued: 2023-06-28
modified: 2025-02-23
comment: People with Leydig cell hypoplasia (LCH) have XY chromosomes and a genetic insensitivity to luteinizing hormone. LCH can be either complete (known as LCH Type 1) or partial (known as LCH Type 2). Luteinizing hormone is typically responsible for the development of Leydig cells in the testicles and for signaling for those cells to produce androgens like testosterone. Someone with LCH will develop few or no Leydig cells and therefore will produce less testosterone than is typical.
comment: Las personas con hipoplasia de células de Leydig (HCL) tienen cromosomas XY y una insensibilidad genética a la hormona luteinizante. La HCL puede ser completa (conocida como HCL tipo 1) o parcial (conocida como HCL tipo 2). La hormona luteinizante suele ser responsable del desarrollo de las células de Leydig en los testículos y de indicarles a esas células que produzcan andrógenos como la testosterona. Alguien con HCL desarrollará pocas o ninguna célula de Leydig y, por lo tanto, producirá menos testosterona de lo normal.
alternative label: LCH
broader: Intersex variations
change note: Version 4.2.0
has top concept: Sex (Body)
in scheme: v3
narrower: Type 1 Leydig cell hypoplasia
narrower: Type 2 Leydig cell hypoplasia
preferred label: Hipoplasia de células de Leydig

Mayer-Rokitansky-Küster-Hauser syndrome
type: Concept
issued: 2023-06-28
modified: 2025-02-23
comment: Mayer-Rokitansky-Küster-Hauser (MRKH) syndrome occurs when a person's Müllerian ducts, which typically become the uterus and upper portion of the vagina during fetal development, do not develop in the typical way. People with MRKH have XX chromosomes and are usually born with a vulva and either a vagina that is shorter than typical or no vagina. They usually do not have a cervix and may have a partial uterus (uterine remnant) or no uterus. They often do not mensturate but may experience cyclic pain if they have a uterine remnant with endometrial lining, and they can develop menstruation-related conditions like endometriosis.
comment: El síndrome de Mayer-Rokitansky-Küster-Hauser (MRKH, por sus siglas en inglés) ocurre cuando los conductos müllerianos de una persona, que normalmente se convierten en el útero y la parte superior de la vagina durante el desarrollo fetal, no se desarrollan de la manera típica. Las personas con MRKH tienen cromosomas XX y generalmente nacen con una vulva y una vagina más corta de lo normal o sin vagina. Por lo general, no tienen cuello uterino y pueden tener un útero parcial (restos uterinos) o ningún útero. A menudo no menstrúan, pero pueden experimentar dolor cíclico si tienen un remanente uterino con tejido endometrial y pueden desarrollar condiciones relacionadas con la menstruación, como la endometriosis.
alternative label: MRKH syndrome
alternative label: Müllerian agenesis
alternative label: Müllerian duct anomalies
alternative label: Müllerian duct variations
broader: Intersex variations
change note: Version 4.2.0
has top concept: Sex (Body)
in scheme: v3
narrower: Type 1 Mayer-Rokitansky-Küster-Hauser syndrome
narrower: Type 2 Mayer-Rokitansky-Küster-Hauser syndrome
preferred label: Síndrome de Mayer-Rokitansky-Küster-Hauser

Afro-Latin American asexual people
type: Concept
issued: 2023-06-29
modified: 2025-02-23
comment: Asexual people of African descent born in Latin American countries or asexual people born in African countries who live in or have a strong connection to Latin America. Only use for individuals who self-identify as Afro-Latin American.
comment: Personas asexuales afrodescendientes nacidas en países latinoamericanos o personas asexuales nacidas en países africanos que viven o tienen una fuerte conexión con América Latina. Utilícese únicamente para personas que se identifiquen como afrolatinoamericanas.
alternative label: Asexual Afro-Latin Americans
alternative label: Personas afrolatinoamericanas asexuales
alternative label: Afrolatinoamericanos asexuales
alternative label: Afrolatinoamericanas asexuales
broader: Afro-Latin American LGBTQ+ people
broader: Black asexual people
broader: Latino/a/x asexual people
change note: Version 4.2.0
has top concept: LGBTQ+ people
in scheme: v3
preferred label: Personas asexuales afrolatinoamericanas

Intersex mothers
type: Concept
issued: 2023-06-30
modified: 2025-02-23
comment: Intersex people who are mothers. Only use to describe individuals who identify as mothers.
comment: Personas intersex que son madres. Utilícese únicamente para describir a personas que se autoidentifiquen como madres.
broader: Mothers
broader: Intersex parents
broader: LGBTQ+ mothers
change note: Version 4.2.0
has top concept: Family members
in scheme: v3
preferred label: Madres intersex

Intersex studies
type: Concept
issued: 2023-06-30
modified: 2026-02-24
comment: Academic field of research and study about intersex people, intersex identity, and intersex communities.
comment: Campo académico de investigación y estudio sobre personas intersex, la identidad intersex y comunidades intersex.
broader: LGBTQ+ studies
change note: Version 4.2.0
has top concept: LGBTQ+ studies
in scheme: v3
preferred label: Estudios intersex
related: Gender studies
related: Queer studies

Afro-Latin American intersex people
type: Concept
issued: 2023-09-29
modified: 2025-02-23
comment: Intersex people of African descent born in Latin American countries or intersex people born in African countries who live in or have a strong connection to Latin America. Only use for individuals who self-identify as Afro-Latin American.
comment: Personas intersexuales de ascendencia africana nacidas en países latinoamericanos o personas intersexuales nacidas en países africanos que viven o tienen una conexión fuerte con América Latina. Utilícese únicamente para personas que se identifiquen como afrolatinoamericanas.
alternative label: Afro-Latina intersex people
alternative label: Afro-Latine intersex people
alternative label: Afro-Latino intersex people
alternative label: Afro-Latino/a/x intersex people
alternative label: Afro-Latinx intersex people
alternative label: Intersex Afro-Latin Americans
alternative label: Intersex Afro-Latinas
alternative label: Intersex Afro-Latine people
alternative label: Intersex Afro-Latinos
alternative label: Intersex Afro-Latinx people
alternative label: Intersex afrolatinoamericanos
alternative label: Personas afrolatinoamericanas intersex
alternative label: Personas intersex afrolatinoamericanas
alternative label: Personas afrolatinas intersex
alternative label: Personas intersex afrolatinas
alternative label: Intersex afrolatinos
alternative label: Afrolatinos intersex
alternative label: Intersex afrolatinxs
alternative label: Afrolatinxs intersex
alternative label: Intersex afrolatinas
alternative label: Afrolatinas intersex||
broader: Afro-Latin American LGBTQ+ people
broader: Black intersex people
broader: Latino/a/x intersex people
change note: Version 4.2.0
has top concept: LGBTQ+ people
in scheme: v3
preferred label: Personas intersexuales afrolatinoamericanas

Asexual college students
type: Concept
issued: 2023-12-05
modified: 2025-02-23
comment: Asexual people who are attending college.
comment: Personas asexuales que asisten a la universidad.
alternative label: Asexuales universitarios
alternative label: Universitarios asexuales
alternative label: Asexuales universitarias
alternative label: Universitarias asexuales
broader: Asexual people
broader: LGBTQ+ college students
change note: Version 4.2.0
has top concept: Sexual minorities
in scheme: v3
preferred label: Estudiantes universitarios asexuales
related: LGBTQ+ alumni groups

Bisexual college students
type: Concept
issued: 2023-12-05
modified: 2025-02-23
comment: Bisexual people who are attending college.
comment: Personas bisexuales que asisten a la universidad.
broader: Bisexual people
broader: LGBTQ+ college students
change note: Version 4.2.0
has top concept: LGBTQ+ people
in scheme: v3
preferred label: Estudiantes universitarios bisexuales
related: LGBTQ+ alumni groups

Demisexual college students
type: Concept
issued: 2023-12-05
modified: 2025-02-23
comment: Demisexual people who are attending college.
comment: Personas demisexuales que asisten a la universidad.
broader: Demisexual people
broader: LGBTQ+ college students
change note: Version 4.2.0
has top concept: Sexual identity
in scheme: v3
preferred label: Estudiantes universitarios demisexuales
related: LGBTQ+ alumni groups

Gay college students
type: Concept
issued: 2023-12-05
modified: 2025-02-23
comment: Gay men who are attending college.
comment: Hombres gay que asisten a la universidad.
broader: Gay men
broader: LGBTQ+ college students
change note: Version 4.2.0
has top concept: LGBTQ+ people
in scheme: v3
preferred label: Estudiantes universitarios gay
related: LGBTQ+ alumni groups

Greyromantic college students
type: Concept
issued: 2023-12-05
modified: 2025-02-23
comment: Greyromantic people who are attending college.
comment: Personas grisrománticas que asisten a la universidad.
broader: Greyromantic people
broader: LGBTQ+ college students
change note: Version 4.2.0
has top concept: Romantic minorities
in scheme: v3
preferred label: Estudiantes universitarios grisrománticos
related: LGBTQ+ alumni groups

Intersex college students
type: Concept
issued: 2023-12-05
modified: 2025-02-23
comment: Intersex people who are attending college.
comment: Personas intersex que asisten a la universidad.
broader: Intersex people
broader: LGBTQ+ college students
change note: Version 4.2.0
has top concept: LGBTQ+ people
in scheme: v3
preferred label: Estudiantes universitarios intersex
related: LGBTQ+ alumni groups

Lesbian college students
type: Concept
issued: 2023-12-05
modified: 2025-02-23
comment: Lesbians who are attending college.
comment: Lesbianas que asisten a la universidad.
broader: Lesbians
broader: LGBTQ+ college students
change note: Version 4.2.0
has top concept: LGBTQ+ people
in scheme: v3
preferred label: Estudiantes universitarias lesbianas
related: LGBTQ+ alumni groups

Megasexual college students
type: Concept
issued: 2023-12-05
modified: 2025-02-23
comment: Megasexual people who are attending college.
comment: Personas megasexuales que asisten a la universidad.
broader: Megasexual people
broader: LGBTQ+ college students
change note: Version 4.2.0
has top concept: Sexual minorities
in scheme: v3
preferred label: Estudiantes universitarios megasexuales
related: LGBTQ+ alumni groups

Non-binary college students
type: Concept
issued: 2023-12-05
modified: 2025-02-23
comment: Non-binary people who are attending college.
comment: Personas no binarias que asisten a la universidad.
alternative label: Nonbinary college students
broader: Non-binary people
broader: LGBTQ+ college students
change note: Version 4.2.0
has top concept: LGBTQ+ people
in scheme: v3
preferred label: Estudiantes universitarios no binarios
related: LGBTQ+ alumni groups

Queer college students
type: Concept
issued: 2023-12-05
modified: 2025-02-23
comment: Queer people who are attending college.
comment: Personas queer que asisten a la universidad.
broader: Queer people
broader: LGBTQ+ college students
change note: Version 4.2.0
has top concept: LGBTQ+ people
in scheme: v3
preferred label: Estudiantes universitarios queer
related: LGBTQ+ alumni groups

Transgender college students
type: Concept
issued: 2023-12-05
modified: 2025-02-23
comment: Transgender people who are attending college.
comment: Personas transgénero que asisten a la universidad.
broader: Transgender people
broader: LGBTQ+ college students
change note: Version 4.2.0
has top concept: LGBTQ+ people
in scheme: v3
preferred label: Estudiantes universitarios transgénero
related: LGBTQ+ alumni groups

Two-Spirit college students
type: Concept
issued: 2023-12-05
modified: 2025-02-23
comment: Two-Spirit people who are attending college.
comment: Personas dos espíritus que asisten a la universidad.
alternative label: 2S college students
alternative label: Two Spirit college students
alternative label: Two Spirited college students
alternative label: Two-Spirited college students
alternative label: Universitarios dos espíritus
alternative label: Personas universitarias dos espíritus
broader: Two-Spirit people
change note: Version 4.2.0
has top concept: Gender
in scheme: v3
preferred label: Estudiantes universitarios dos espíritus
related: LGBTQ+ alumni groups
related: LGBTQ+ college students

Ice play
type: Concept
issued: 2023-12-15
modified: 2025-02-23
comment: A type of sensual or sexual play in which ice or similar cold substances are applied to the body.
comment: Un tipo de juego sensual o sexual en el que se aplica sobre el cuerpo hielo o sustancias frías similares.
alternative label: Juego con hielo
broader: Temperature play
change note: Version 4.2.0
has top concept: Eroticism
in scheme: v3
preferred label: Juego de hielo
related: Wax play
related: Fire play

Diapers (Erotic)
type: Concept
issued: 2023-12-18
modified: 2025-02-23
comment: Absorbent material wrapped around a person’s butt and between their legs to absorb urine and feces; typically used in ageplay.
comment: Material absorbente envuelto alrededor del trasero de una persona y entre sus piernas para absorber la orina y las heces; usualmente utilizado en juegos de edad.
broader: Kink accessories
change note: Version 4.2.0
has top concept: Eroticism
in scheme: v3
preferred label: Pañales (erotico)
related: Age play
related: Urine play

Medical play
type: Concept
issued: 2023-12-18
modified: 2025-02-23
comment: Erotic roleplay and kink activities involving medical tools, settings, uniforms, and procedures.
comment: Juegos de roles eróticos y actividades kink que involucran herramientas, entornos, uniformes y procedimientos médicos.
broader: BDSM
broader: Roleplay
change note: Version 4.2.0
has top concept: Eroticism
in scheme: v3
preferred label: Juego médico
related: Uniform fetish

Mummification (Erotic)
type: Concept
issued: 2023-12-18
modified: 2025-02-23
comment: A form of bondage that involves wrapping the body with bandages, plastic wrap, or other materials.
comment: Una forma de bondage que consiste en envolver el cuerpo con vendas, plástico u otros materiales.
broader: Bondage
change note: Version 4.2.0
has top concept: Eroticism
in scheme: v3
preferred label: Momificación (erótica)
related: Restraints
related: Sensory deprivation (Erotic)

Body worship
type: Concept
issued: 2023-12-18
modified: 2025-02-23
comment: Any practice of revering another’s physical body, usually in a sexual context.
comment: Cualquier práctica de reverenciar el cuerpo físico de otra persona, generalmente en un contexto sexual.
broader: Sexual practices
change note: Version 4.2.0
has top concept: Sexual practices
in scheme: v3
narrower: Muscle worship
preferred label: Adoración corporal
related: Gym subculture

Orgasm control
type: Concept
issued: 2023-12-18
modified: 2025-03-20
comment: The physical or psychological control of one's own or a partner’s orgasm.
comment: El control físico o psicológico del orgasmo propio o de la pareja.
alternative label: Edging
alternative label: Forced orgasm
alternative label: Orgasm denial
alternative label: Orgasmo forzado
broader: BDSM
broader: Sex (Act)
change note: Version 4.2.0
has top concept: Eroticism
in scheme: v3
preferred label: Control del orgasmo
related: Chastity play

Chastity play
type: Concept
issued: 2023-12-18
modified: 2025-02-23
comment: Refraining from sexual arousal, orgasm, or sex as an act of submission, method of erotic discipline, or for personal satisfaction.
comment: Abstenerse de la excitación sexual, el orgasmo o el sexo como acto de sumisión, método de disciplina erótica o para la satisfacción personal.
broader: BDSM
change note: Version 4.2.0
has top concept: Eroticism
in scheme: v3
preferred label: Juego de castidad
related: Orgasm control
related: Chastity devices

Paddling
type: Concept
issued: 2023-12-18
modified: 2025-02-23
comment: Striking a body with a paddle as a form of impact play.
broader: Impact play
change note: Version 4.2.0
has top concept: Eroticism
in scheme: v3
related: Anal play
related: Spanking paddles

Piercing play
type: Concept
issued: 2023-12-18
modified: 2025-02-23
comment: Temporary piercing of a body, usually for aesthetic, erotic, or sexual purposes.
comment: Perforación temporal de un cuerpo, generalmente con fines estéticos, eróticos o sexuales.
alternative label: Needle play
alternative label: Play piercing
alternative label: Juego con piercings
alternative label: Juego de perforación
alternative label: Juego con perforaciones
broader: BDSM
broader: Piercings
change note: Version 4.2.0
has top concept: Eroticism
in scheme: v3
preferred label: Juego de piercing
related: Blood play

Blood play
type: Concept
issued: 2023-12-18
modified: 2025-02-23
comment: Use of blood for erotic or sensual pleasure.
comment: Uso de sangre para placer erótico o sensual.
broader: BDSM
change note: Version 4.2.0
has top concept: Eroticism
in scheme: v3
preferred label: Juegos con sangre
related: Piercing play
related: Knife play

Rope bondage
type: Concept
issued: 2023-12-18
modified: 2025-02-23
comment: Use of rope to tie and restrain the body for sensual or erotic play.
comment: Uso de cuerda para atar y sujetar el cuerpo para juegos sensuales o eróticos.
alternative label: Japanese rope bondage
alternative label: Kinbaku
alternative label: Shibari
alternative label: Atadura con cuerda
broader: Bondage
change note: Version 4.2.0
has top concept: Eroticism
in scheme: v3
preferred label: Bondage de cuerda
related: Restraints
related: Roleplay

Balloon kink
type: Concept
issued: 2023-12-18
modified: 2025-02-23
comment: The use of balloons for fashion, sexual arousal or erotic play.
comment: El uso de globos para vestir, para la excitación sexual o para el juego erótico.
alternative label: Looner
alternative label: Kink de globos
broader: BDSM
change note: Version 4.2.0
has top concept: Eroticism
in scheme: v3
preferred label: Fetish de globos
related: Rubber and latex community
related: Inflation (Erotic)

Jockstraps
type: Concept
issued: 2023-12-18
modified: 2025-02-23
comment: An article of clothing with a pouch to support the genitalia, typically worn by athletes, or for aesthetic or sexual gratification.
comment: Artículo de vestir con una bolsa para sostener los genitales, que suele utilizarse por atletas, o para la gratificación estética o sexual.
alternative label: Suspensores
broader: Sex accessories
broader: LGBTQ+ fashion
change note: Version 4.2.0
has top concept: Sex accessories
in scheme: v3
preferred label: Suspensorio
related: Kink accessories

Foot fetish
type: Concept
issued: 2023-12-20
modified: 2025-02-23
comment: Eroticization of the feet.
comment: Erotización de los pies.
alternative label: Aretifism
alternative label: Foot fetishism
alternative label: Foot kink
alternative label: Foot partialism
alternative label: Podophilia
alternative label: Retifitism
alternative label: Aretifismo
alternative label: Fetichismo de pies
alternative label: Kink de pies
alternative label: Parcialismo de pies
alternative label: Podofilia
alternative label: Retifismo
broader: BDSM
change note: Version 4.2.0
has top concept: Eroticism
in scheme: v3
preferred label: Fetiche de pies
related: Bootblacking
related: Shoe fetish

Furry culture
type: Concept
issued: 2023-12-20
modified: 2025-02-23
comment: Use to describe cultural experiences shared by members of furry communities or products of furry culture (e.g., art and media created by and for furries, activism focused on furry issues, slang commonly used in furry communities, etc.).
comment: Utilícese para describir experiencias culturales compartidas por miembros de comunidades furras o productos de la cultura furra (p. ej., arte y medios creados por y para furros, activismo centrado en temas furros, jerga comúnmente utilizada en comunidades furras, etc.).
broader: Subcultures
change note: Version 4.2.0
has top concept: Subcultures
in scheme: v3
preferred label: Cultura furra
related: Furries
related: Animal roleplay

Abduction play
type: Concept
issued: 2023-12-20
modified: 2025-02-23
comment: A type of consensual BDSM play involving the mock capture, bondage, struggle, and intimidation of one or more sexual partners.
comment: Un juego de BDSM consensuado que implica la simulación de la captura, la esclavitud, la lucha y la intimidación de una o más parejas sexuales.
alternative label: Consensual kidnapping
alternative label: Secuestro consensuado
alternative label: Juego de abducción
broader: BDSM
change note: Version 4.2.0
has top concept: Eroticism
in scheme: v3
preferred label: Juego de secuestro
related: Roleplay
related: Consent play

Clamps (Erotic)
type: Concept
issued: 2023-12-20
modified: 2025-02-23
comment: A device designed to hold something firmly together or to otherwise fasten down on something (such as the nipples) for the purposes of gratification.
comment: Un dispositivo diseñado para mantener algo firmemente unido o para sujetar algo (como los pezones) con fines de gratificación.
alternative label: Clamp devices
alternative label: Pinzas
broader: Sex accessories
change note: Version 4.2.0
has top concept: Sex accessories
in scheme: v3
narrower: Nipple clamps
narrower: Clothespins (Erotic)
preferred label: Pinzas (Erótico)

Hogtie
type: Concept
issued: 2024-01-02
modified: 2025-02-23
comment: The position or activity of tying a person’s wrists and ankles together behind their back.
comment: La posición o actividad de atar las muñecas y los tobillos de una persona detrás de su espalda.
alternative label: Hogtie restraining
broader: Bondage
change note: Version 4.2.0
has top concept: Eroticism
in scheme: v3
preferred label: Atar de manos y pies
related: Restraints
related: Cuffs

Trans-exclusionary radical feminists
type: Concept
issued: 2024-01-02
modified: 2025-02-23
comment: A person who subscribes to a transphobic and transantagonistic ideology that rejects trans and gender diverse identities and rights, and believes that recognition of these identities and rights constitutes discrimination and oppression towards cisgender women. Though originally considered a fringe offshoot of feminism, trans-exclusionary radical feminist groups have formed alliances with right-wing, far-right extremists, and anti-feminist organizations in order to spread misinformation and further anti-trans sentiment and legislation. Use when resources are about trans-exclusionary radical feminists or when an individual identifies as such.
comment: Una persona que se suscribe a una ideología transfóbica y transantagonista que rechaza las identidades y los derechos trans y de género diverso, y cree que el reconocimiento de estas identidades y estos derechos constituye discriminación y opresión hacia las mujeres cisgénero. Aunque originalmente se les consideró una rama marginal del feminismo, los grupos feministas radicales trans-excluyentes han formado alianzas con organizaciones antifeministas, de derecha y de extrema derecha para difundir información errónea y promover el sentimiento y la legislación anti-trans. Utilícese cuando los recursos traten sobre feministas radicales trans-excluyentes o cuando una persona se identifique como tal.
alternative label: Gender critical feminists
alternative label: TERFs
alternative label: Trans-exclusionary feminist
alternative label: Terfas
alternative label: Feministas críticas de género
alternative label: Feministas trans-excluyentes
change note: Version 4.2.0
in scheme: v3
preferred label: Feministas radicales trans-excluyentes
related: Feminism
related: Trans-exclusionary radical feminism

Lesbian feminists
type: Concept
issued: 2024-01-11
modified: 2025-02-23
comment: A person who subscribes to lesbian feminism, an ideology that encourages women to focus their efforts, activities, and relationships toward other women rather than men, often advocating for lesbianism as the logical result of feminism. Use when resources are about lesbian feminists or when an individual identifies as such.
comment: Persona que se suscribe el feminismo lésbico, una ideología que anima a las mujeres a centrar sus esfuerzos, actividades y relaciones en otras mujeres en lugar de en los hombres, a menudo, defendiendo el lesbianismo como el resultado lógico del feminismo. Utilícese cuando los recursos sean sobre feministas lesbianas o cuando una persona se identifique como tal.
alternative label: Lesbianas feministas
broader: Feminists
change note: Version 4.2.0
has top concept: Feminists
in scheme: v3
preferred label: Feministas lesbianas
related: Lesbian feminism
related: Lesbian movement

Black feminists
type: Concept
issued: 2024-01-11
modified: 2025-02-23
comment: A person who subscribes to a form of feminism that developed in response to the failures of mainstream feminist and civil rights efforts to acknowledge the ways white supremacy and the patriarchy interact to inform the particular experiences of Black women. Use when resources are about Black feminists or when an individual identifies as such.
comment: Una persona que se suscribe a una forma de feminismo que se desarrolló en respuesta a los fracasos de los esfuerzos feministas y de derechos civiles dominantes para reconocer las formas en que la supremacía blanca y el patriarcado interactúan para informar las experiencias particulares de las mujeres negras. Utilícese cuando los recursos sean sobre feministas negras o cuando una persona se autoidentifique como tal.
alternative label: Afro feminists
alternative label: Afro-feminists
alternative label: Afro feministas
alternative label: Afro-feministas
broader: Feminists
change note: Version 4.2.0
has top concept: Feminists
in scheme: v3
preferred label: Feministas negras
related: Black feminism
related: Womanists

Womanists
type: Concept
issued: 2024-01-11
modified: 2025-02-23
comment: A person who subscribes to womanism, an ideology that grew out of the perceived indifference of the feminist movement towards the needs of Black women, who are often excluded from the categories of "female" and "femininity" as understood by white feminists. At the core of womanism is the idea that mainstream feminism is a movement led by white women to serve white women's goals, which can be indifferent or even oppositional to the needs of Black women. Use for resources about womanists or when an individual identifies as such.
comment: Una persona que se suscribe el mujerismo, una ideología que surgió de la indiferencia percibida del movimiento feminista hacia las necesidades de las mujeres negras, que a menudo son excluidas de las categorías de "femenino" y "feminidad" tal como las entienden las feministas blancas. Al centro del mujerismo está la idea de que el feminismo dominante es un movimiento liderado por mujeres blancas para servir a los objetivos de las mujeres blancas, que pueden ser indiferentes o incluso opuestos a las necesidades de las mujeres negras. Utilícese para recursos sobre mujeristas o cuando una persona se identifica como tal.
change note: Version 4.2.0
in scheme: v3
preferred label: Mujeristas
related: Womanism
related: Black feminists

Radical feminists
type: Concept
issued: 2024-01-11
modified: 2025-02-23
comment: A person who subscribes to a perspective within feminism that calls for a radical reordering of society in which male supremacy is eliminated in all social and economic contexts. Distinct from and not to be confused with trans-exclusionary radical feminists. Use for resources about radical feminists or for individuals who identify as such, unless trans-exclusionary radical feminists is a more appropriate term.
comment: Una persona que se suscribe a una perspectiva dentro del feminismo que exige un reordenamiento radical de la sociedad en el que se elimine la supremacía masculina en todos los contextos sociales y económicos. Es distinto a y no debe confundirse con feministas radicales transexcluyentes. Utilícese para recursos sobre feministas radicales o para personas que se autoidentifican como tales, a menos que "feministas radicales transexcluyentes" sea un término más apropiado.
broader: Feminists
change note: Version 4.2.0
has top concept: Feminists
in scheme: v3
narrower: SWERFs
preferred label: Feministas radicales
related: Radical feminism

Two-Spirit daughters
type: Concept
issued: 2024-05-24
modified: 2025-02-23
comment: Two-Spirit people who are daughters. Only use to describe individuals who identify as daughters.
alternative label: Two Spirit daughters
alternative label: Two Spirited daughters
alternative label: Two-Spirited daughters
change note: Version 4.2.0
in scheme: v3
related: LGBTQ+ daughters

Two-Spirit fathers
type: Concept
issued: 2024-05-24
modified: 2025-02-23
comment: Two-Spirit people who are fathers. Only use to describe individuals who identify as fathers.
alternative label: 2S fathers
alternative label: Two Spirit fathers
alternative label: Two Spirited fathers
alternative label: Two-Spirited fathers
broader: Fathers
broader: Two-Spirit parents
change note: Version 4.2.0
has top concept: Family members
in scheme: v3
related: Two-Spirit families

Two-Spirit mothers
type: Concept
issued: 2024-05-24
modified: 2025-02-23
comment: Two-Spirit people who are mothers. Only use to describe individuals who identify as mothers.
alternative label: 2S mothers
alternative label: Two Spirit mothers
alternative label: Two Spirited mothers
alternative label: Two-Spirited mothers
broader: Mothers
broader: Two-Spirit parents
change note: Version 4.2.0
has top concept: Family members
in scheme: v3
related: Two-Spirit families

Two-Spirit sons
type: Concept
issued: 2024-05-24
modified: 2025-02-23
comment: Two-Spirit people who are sons. Only use to describe individuals who identify as sons.
alternative label: 2S sons
alternative label: Two Spirit sons
alternative label: Two Spirited sons
alternative label: Two-Spirited sons
broader: Two-Spirit people
broader: Sons
change note: Version 4.2.0
has top concept: Gender
in scheme: v3

LGBTQ+ pride flags
type: Concept
issued: 2024-05-24
modified: 2025-02-23
comment: Flags that represent sexual identities, gender identities, and romantic orientations that fall under the LGBTQ+ umbrella, as well as flags representing LGBTQ+ subcultures and communities.
alternative label: Pride flags
broader: LGBTQ+ symbols
change note: Version 4.2.0
has top concept: LGBTQ+ symbols
in scheme: v3
narrower: Rainbow flags
related: LGBTQ+ pride

LGBTQ+ sex tourism
type: Concept
issued: 2024-05-24
modified: 2025-02-23
comment: The practice of traveling with the intention of soliciting sex work, typically to allow LGBTQ+ or curious people to explore sexual encounters that are illegal or stigmatized in their home countries. Sex tourism often presents ethical concerns, such as the economic gap between tourists and residents, differences in age of consent laws globally, and the selective enforcement of anti-sex work laws by police.
alternative label: Sex tourism (LGBTQ)
broader: LGBTQ+ tourism
broader: Sex tourism
change note: Version 4.2.0
has top concept: LGBTQ+ tourism
in scheme: v3
related: LGBTQ+ sex workers

Two-Spirit youth survivors of bullying
type: Concept
issued: 2024-07-31
modified: 2025-02-23
comment: Two Spirit youth between the ages of 12-18 who have experienced and survived bullying due to their gender or sexual identity; follow the individual's preference for "victims" or "survivors" whenever possible.
alternative label: 2S youth survivors of bullying
alternative label: Two Spirited youth survivors of bullying
alternative label: Two-Spirited youth survivors of bullying
broader: Two-Spirit survivors of bullying
broader: Two-Spirit youth
change note: Version 4.2.0
has top concept: Gender
in scheme: v3
related: LGBTQ+ youth survivors of bullying

Gender marker change bans
type: Concept
issued: 2024-07-31
modified: 2025-03-20
comment: Laws or policies instituted to prevent trans and non-binary people from changing the gender marker on their birth certificate, driver's license, passport, or other legal documents.
alternative label: Legal documents change ban
broader: Anti-transgender legislation
change note: Version 4.2.0
has top concept: Law
in scheme: v3
related: Legal name change
related: Gender markers

Kiki (Social Gathering)
type: Concept
issued: 2024-07-31
modified: 2025-02-23
comment: A slang term to describe a gathering of friends for the purpose of chatting and gossiping. The term evolved out of the 1990s ballroom scene in New York City and was further popularized by the 2012 song "Let's Have a Kiki" by the Scissor Sisters. Do not conflate with the term "Ky-ky (Gender role)," sometimes also spelled "Kiki," which refers to lesbians who do not identify as either butches or femmes.
alternative label: Kikiing (Social gathering)
alternative label: Kiking (Social gathering)
broader: LGBTQ+ slang
change note: Version 4.2.0
has top concept: LGBTQ+ slang
in scheme: v3
related: Ball culture
related: Friendships

Ky-ky (Gender role)
type: Concept
issued: 2024-07-31
modified: 2025-02-23
comment: A slang term that emerged in the 1940s to describe lesbians who do not identify as butch or femme. Do not conflate with the term "Kiki (Social gathering), which refers to a gathering of friends.
alternative label: Kiki (Gender role)
alternative label: Kyky (Gender role)
broader: Gender roles
broader: Sexual identity
broader: Sexual roles
change note: Version 4.2.0
has top concept: Role behavior
in scheme: v3

Questioning
type: Concept
issued: 2024-07-31
modified: 2025-02-23
comment: A term used to describe individuals who are in the process of determining their sexual orientation and/or gender identity.
change note: Version 4.2.0
in scheme: v3
related: Coming out
related: Bicuriosity

Two-Spirit political groups
type: Concept
issued: 2024-09-19
modified: 2025-02-23
comment: Organized groups centered on political change and action for Two-Spirit people's rights.
alternative label: Two-Spirited political groups
alternative label: 2S political groups
alternative label: Two Spirit political groups
alternative label: Two Spirited political groups
change note: Version 4.2.0
in scheme: v3
related: Two-Spirit activism
related: LGBTQ+ political groups

Women's sexuality
type: Concept
issued: 2024-10-22
modified: 2025-02-23
comment: Term used to describe the ways in which women experience and express themselves sexually, including the types of people and practices they are sexually interested in.
alternative label: Female sexuality
broader: Sexuality
change note: Version 4.2.0
has top concept: Sexuality
in scheme: v3
related: WLW (Women Loving Women)
related: Women who have sex with women

Queer architecture
type: Concept
issued: 2024-10-22
modified: 2026-03-03
comment: A school of architecture that seeks to create spaces that critique normative conceptions of gender and sexuality.
alternative label: Queer design
broader: Queer art
broader: Queer theory
change note: Version 4.2.0
has top concept: Subcultures
in scheme: v3
related: LGBTQ+ architects

LGBTQ+ History Month
type: Concept
issued: 2024-10-22
modified: 2025-02-23
comment: An annual, month-long observance of LGBTQ+ history and related civil rights movements. The month in which LGBTQ+ History Month is observed differs depending on the country.
alternative label: Gay History Month
broader: Europride
change note: Version 4.2.0
has top concept: Europride
in scheme: v3
related: LGBTQ+ history
related: Pride Month

Two-Spirit television personalities
type: Concept
issued: 2024-10-22
modified: 2025-03-20
comment: Two-Spirit people who are well-known to the public through their appearances on television shows, typically as themselves rather than in scripted roles.
alternative label: Two-Spirited television personalities
alternative label: Two Spirit television personalities
alternative label: Two Spirited television personalities
alternative label: 2S television personalities
alternative label: Two-Spirited TV personalities
alternative label: Two Spirit TV personalities
alternative label: Two Spirited TV personalities
alternative label: 2S TV personalities
broader: Two-Spirit people
broader: Two-Spirit celebrities
change note: Version 4.2.0
has top concept: Gender
in scheme: v3
related: LGBTQ+ television personalities

Impact of COVID-19 pandemic on LGBTQ+ people
type: Concept
issued: 2024-10-23
modified: 2025-02-23
comment: The particular impact of the COVID-19 pandemic on LGBTQ+ people and communities, including changes in access to health care, intimate relationship dynamics and safer sex practices, financial stability, social connectedness, and mental health.
alternative label: COVID-19 pandemic impact on LGBTQ+ people
alternative label: Impact of pandemic on LGBTQ+ people
alternative label: Pandemic impact on LGBTQ+ people
alternative label: COVID-19 pandemic and LGBTQ+ people
alternative label: COVID-19 and LGBTQ+ people
change note: Version 4.2.0
in scheme: v3
related: Health care for LGBTQ+ people
related: LGBTQ+ social processes

LGBTQ+ punk community
type: Concept
issued: 2024-10-23
modified: 2025-02-23
comment: A subset of the punk community to which LGBTQ+ punks and allies belong. The punk community originated in the 1970s with punk rock music and is now associated with various music subgrenes, fashions, and ideologies.
alternative label: Punk community (LGBTQ)
alternative label: Punk scene (LGBTQ)
alternative label: Punk culture (LGBTQ)
alternative label: LGBTQ+ punk scene
alternative label: LGBTQ+ punk culture
broader: LGBTQ+ communities
change note: Version 4.2.0
has top concept: LGBTQ+ communities
in scheme: v3
related: LGBTQ+ culture
related: LGBTQ+ punks

LGBTQ+ spaces
type: Concept
issued: 2024-10-23
modified: 2025-02-23
comment: Spaces maintained and intended for use by LGBTQ+ people. Includes physical spaces as well as online spaces.
alternative label: Spaces (LGBTQ)
broader: LGBTQ+ meeting places
change note: Version 4.2.0
has top concept: LGBTQ+ meeting places
in scheme: v3
narrower: LGBTQ+ safe spaces
related: LGBTQ+ communities

LGBTQ+ victims of sex trafficking
type: Concept
issued: 2024-10-30
modified: 2025-02-23
comment: LGBTQ+ people who have experienced and may or may not have survived sex trafficking. Follow the individual's preference for "victims" or "survivors" whenever possible.
alternative label: Victims of sex trafficking (LGBTQ)
alternative label: LGBTQ+ sex trafficking victims
alternative label: Sex trafficking victims (LGBTQ)
broader: LGBTQ+ victims of human trafficking
change note: Version 4.2.0
has top concept: LGBTQ+ people
in scheme: v3
narrower: LGBTQ+ survivors of sex trafficking
related: Two-Spirit victims of sex trafficking

Two-Spirit victims of sex trafficking
type: Concept
issued: 2024-10-30
modified: 2025-02-23
comment: Two-Spirit people who have experienced and may or may not have survived sex trafficking. Follow the individual's preference for "victims" or "survivors" whenever possible.
alternative label: Two Spirit victims of sex trafficking
alternative label: Two-Spirited victims of sex trafficking
alternative label: Two Spirited victims of sex trafficking
alternative label: 2S victims of sex trafficking
alternative label: Two-Spirit sex trafficking victims
broader: Two-Spirit victims of human trafficking
change note: Version 4.2.0
has top concept: Gender
in scheme: v3
narrower: Two-Spirit survivors of sex trafficking
related: LGBTQ+ victims of sex trafficking

LGBTQ+ victims of labor trafficking
type: Concept
issued: 2024-10-30
modified: 2025-02-23
comment: LGBTQ+ people who have experienced and may or may not have survived labor trafficking. Follow the individual's preference for "victims" or "survivors" whenever possible.
alternative label: Victims of labor trafficking (LGBTQ)
alternative label: LGBTQ+ labor trafficking victims
alternative label: Labor trafficking victims (LGBTQ)
broader: LGBTQ+ victims of human trafficking
change note: Version 4.2.0
has top concept: LGBTQ+ people
in scheme: v3
narrower: LGBTQ+ survivors of labor trafficking
preferred label: LGBTQ+ victims of labour trafficking
related: Two-Spirit victims of labor trafficking

Two-Spirit victims of labor trafficking
type: Concept
issued: 2024-10-30
modified: 2025-02-23
comment: Two-Spirit people who have experienced and may or may not have survived labor trafficking. Follow the individual's preference for "victims" or "survivors" whenever possible.
alternative label: Two Spirit victims of labor trafficking
alternative label: Two-Spirited victims of labor trafficking
alternative label: Two Spirited victims of labor trafficking
alternative label: 2S victims of labor trafficking
alternative label: Two-Spirit labor trafficking victims
broader: Two-Spirit victims of human trafficking
change note: Version 4.2.0
has top concept: Gender
in scheme: v3
narrower: Two-Spirit survivors of labor trafficking
preferred label: Two-Spirit victims of labour trafficking
related: LGBTQ+ victims of labor trafficking

Two-Spirit sex workers
type: Concept
issued: 2024-10-30
modified: 2025-02-23
comment: Two-Spirit people who receive money or goods in exchange for sexual services, performances, or companionship. Use to describe Two-Spirit people working across the broad spectrum of sex work.
alternative label: Two Spirit sex workers
alternative label: Two-Spirited sex workers
alternative label: Two Spirited sex workers
alternative label: 2S sex workers
alternative label: Two-Spirit prostitutes
alternative label: Two Spirit prostitutes
alternative label: Two-Spirited prostitutes
alternative label: Two Spirited prostitutes
alternative label: 2S prostitutes
alternative label: Two-Spirit prostitution
broader: Two-Spirit people
broader: Sex workers
change note: Version 4.2.0
has top concept: Gender
in scheme: v3
related: LGBTQ+ sex workers

Māhū sex workers
type: Concept
issued: 2024-10-30
modified: 2025-02-23
comment: Māhū who receive money or goods in exchange for sexual services, performances, or companionship. Use to describe Māhū working across the broad spectrum of sex work.
alternative label: Mahu sex workers
alternative label: Māhū prostitutes
alternative label: Mahu prostitutes
alternative label: Māhū prostitution
alternative label: Mahu prostitution
alternative label: Māhū sex work
alternative label: Mahu sex work
broader: Māhū
broader: Sex workers
change note: Version 4.2.0
has top concept: Gender
in scheme: v3
related: LGBTQ+ sex workers

Anti-sex work feminism
type: Concept
issued: 2024-10-30
modified: 2025-02-23
comment: A form of feminism that alleges that sex work is inherently coercive and exploitative. Although not all sex workers are women and not all clients are men, anti-sex work feminism largely centers this gender dynamic, viewing sex work as a result and reinforcement of the patriarchy.
alternative label: Anti sex work feminism
alternative label: Anti-sex-work feminism
broader: Feminism
change note: Version 4.2.0
has top concept: Feminism
in scheme: v3
related: SWERFs
related: Sex work abolition

Anti-sex worker discrimination
type: Concept
issued: 2024-10-30
modified: 2025-02-23
comment: The unjust or prejudicial treatment of sex workers due to their work or identity as a sex worker; may include the denial of legal rights, employment, and housing.
alternative label: Discrimination against sex workers
alternative label: Anti sex worker discrimination
alternative label: Anti-prostitute discrimination
alternative label: Anti prostitute discrimination
alternative label: Discrimination against prostitutes
change note: Version 4.2.0
in scheme: v3
related: Anti-sex worker violence
related: Murder of sex workers

Murder of sex workers
type: Concept
issued: 2024-10-30
modified: 2025-02-23
comment: Intentional killing of sex workers on the basis of their work or identity as a sex worker.
alternative label: Murder of prostitutes
broader: Anti-sex worker violence
change note: Version 4.2.0
has top concept: Anti-sex worker violence
in scheme: v3
related: Hate crimes
related: Anti-sex worker discrimination

Harm reduction (Sex work)
type: Concept
issued: 2024-10-30
modified: 2025-02-23
comment: A set of practical strategies and ideas aimed at reducing the negative impacts of sex work on sex workers, as well as a social justice movement advocating for the rights of sex workers.
change note: Version 4.2.0
in scheme: v3
related: Sex worker rights
related: Sex work activism

Sex worker rights
type: Concept
issued: 2024-10-30
modified: 2025-02-23
comment: Legal, social, or ethical principles of freedom or entitlement held by or pursued by sex workers. This includes, but is not limited to, human rights, health rights, freedom from discrimination and prejudice, and labor rights.
alternative label: Sex workers' rights
alternative label: Rights of sex workers
alternative label: Prostitute rights
alternative label: Prostitutes' rights
alternative label: Rights of prostitutes
change note: Version 4.2.0
in scheme: v3
related: Harm reduction (Sex work)
related: Sex work activism

Sex work activism
type: Concept
issued: 2024-10-30
modified: 2025-02-23
comment: Direct action and organizing to achieve political or social change and acceptance for sex workers.
alternative label: Prostitution activism
change note: Version 4.2.0
in scheme: v3
related: Sex worker rights
related: Harm reduction (Sex work)

Sugar daddies
type: Concept
issued: 2024-10-30
modified: 2025-02-23
comment: People who provide money, gifts, and other material benefits to sugar babies in exchange for companionship and sexual services. Follow the individual's preference for "Sugar daddies" or "Sugar mamas" whenever possible.
broader: Sex workers' clients
change note: Version 4.2.0
has top concept: Sex workers' clients
in scheme: v3
related: Sugar babies
related: Sugaring

Sugar mamas
type: Concept
issued: 2024-10-30
modified: 2025-02-23
comment: People who provide money, gifts, and other material benefits to sugar babies in exchange for companionship and sexual services. Follow the individual's preference for "Sugar mamas" or "Sugar daddies" whenever possible.
alternative label: Sugar mommas
alternative label: Sugar mommies
broader: Sex workers' clients
change note: Version 4.2.0
has top concept: Sex workers' clients
in scheme: v3
related: Sugar babies
related: Sugaring

Female impersonation shows
type: Concept
issued: 2024-11-27
modified: 2025-02-23
comment: Theater or stage shows featuring female impersonators, a historical term used to describe performers, often male-identified people, who enact female personas for the purpose of entertainment, typically for straight audiences. Only use in historical contexts.
alternative label: Female impersonator shows
alternative label: Female impersonators' shows
broader: LGBTQ+ historical terms
change note: Version 4.2.0
has top concept: LGBTQ+ historical terms
in scheme: v3
related: Female impersonators
related: Drag shows

Male impersonation shows
type: Concept
issued: 2024-11-27
modified: 2025-02-23
comment: Theater or stage shows featuring male impersonators, a historical term used to describe performers, often female-identified people, who enact male personas for the purpose of entertainment, typically for straight audiences. Only use in historical contexts.
alternative label: Male impersonator shows
alternative label: Male impersonators' shows
broader: LGBTQ+ historical terms
change note: Version 4.2.0
has top concept: LGBTQ+ historical terms
in scheme: v3
related: Male impersonators
related: Drag shows

Autigender
type: Concept
issued: 2024-12-12
modified: 2026-02-23
comment: Term used to describe the identity of autistic people whose autism greatly affects and cannot be unlinked from their gender. Only use to describe autistic people who describe themselves as autigender.
broader: Neurogender
change note: Version 4.2.0
has top concept: Gender
in scheme: v3
related: LGBTQ+ autistic people
related: Neurotrans

Queer desire
type: Concept
issued: 2024-12-12
modified: 2025-02-23
comment: Desire that resists definition by defying social norms such as heteronormativity, cisnormativity, and other forms of essentialism, regardless of the individual's identity.
broader: Queer theory
change note: Version 4.2.0
has top concept: Theories
in scheme: v3
related: Queer relationships
related: Being in love

Two-Spirit people's writings
type: Concept
issued: 2025-03-13
modified: 2025-03-13
comment: Written works created by Two-Spirit people.
alternative label: Two Spirit people's writings
alternative label: Two-Spirited people's writings
alternative label: Two Spirited people's writings
alternative label: 2S people's writings
alternative label: Writings of Two-Spirit people
alternative label: Writings of Two Spirit people
alternative label: Writings of Two-Spirited people
alternative label: Writings of Two Spirited people
alternative label: Writings of 2S people
broader: Two-Spirit literature
change note: Version 4.2.0
has top concept: Two-Spirit literature
in scheme: v4
related: Two-Spirit authors
related: LGBTQ+ people's writings

Transmedicalism
type: Concept
issued: 2025-03-20
modified: 2025-04-23
comment: The belief that being transgender is primarily a medical issue and that gender dysphoria and the desire to medically transition are both necessary to be considered "truly" transgender.
alternative label: Transmedicalization
broader: Medicalization
change note: Version 4.2.0
has top concept: Medical care
in scheme: v4
related: Gender dysphoria
related: Transmedicalists

Lesbian demonstrations
type: Concept
issued: 2025-04-17
modified: 2025-04-23
comment: Marches, rallies, and other large, public gatherings organized to protest discrimination against lesbians and advocate for lesbian visibility, rights, and issues.
alternative label: Lesbian marches
alternative label: Lesbian rallies
alternative label: Lesbian protests
broader: LGBTQ+ demonstrations
change note: Version 4.2.0
has top concept: LGBTQ+ activism
in scheme: v4
narrower: Dyke demonstrations
related: Lesbian movement

Two-Spirit demonstrations
type: Concept
issued: 2025-04-23
modified: 2025-04-23
comment: Marches, rallies, and other large, public gatherings organized to protest discrimination against Two-Spirit people and advocate for Two-Spirit visibility, rights, and issues.
alternative label: Two-Spirit marches
alternative label: Two-Spirit rallies
alternative label: Two-Spirit protests
alternative label: Two-Spirited demonstrations
alternative label: Two Spirit demonstrations
alternative label: Two Spirited demonstrations
alternative label: 2S demonstrations
broader: Two-Spirit activism
change note: Version 4.2.0
has top concept: Two-Spirit activism
in scheme: v4
related: Two-Spirit movement
related: LGBTQ+ demonstrations

Makeup and LGBTQ+ communities
type: Concept
issued: 2025-04-23
modified: 2025-04-23
comment: The relationship between LGBTQ+ communities and makeup artistry, brands, and industry. Includes discussions of makeup techniques that emerged in LGBTQ+ subcultures, the role of makeup in gender and sexual expression, and the inclusion and representation of LGBTQ+ people in the cosmetics industry.
alternative label: Cosmetics and LGBTQ+ communities
alternative label: LGBTQ+ makeup
alternative label: LGBTQ+ cosmetics
alternative label: Makeup (LGBTQ)
alternative label: Cosmetics (LGBTQ)
change note: Version 4.2.0
in scheme: v4
related: LGBTQ+ makeup artists
related: LGBTQ+ fashion

Transmedicalists
type: Concept
issued: 2025-04-23
modified: 2025-04-23
comment: Individuals who believe that being transgender is primarily a medical issue and that gender dysphoria and the desire to medically transition are both necessary to be considered "truly" transgender.
alternative label: Truscum
change note: Version 4.2.0
in scheme: v4
related: Transmedicalism
related: Gender dysphoria

LGBTQ+ psychology
type: Concept
issued: 2025-04-23
modified: 2025-04-23
comment: A subfield of psychology that focuses on the study of and care for the experiences, well-being, and mental health of LGBTQ+ people.
alternative label: Psychology (LGBTQ)
change note: Version 4.2.0
in scheme: v4
related: Mental health care for LGBTQ+ people
related: Therapies

Two-Spirit people in visual art
type: Concept
issued: 2025-04-23
modified: 2025-04-23
comment: The depiction of Two-Spirit people and communities in visual art, including painting, performance art, sculpture, photography, cinema, etc.
alternative label: Two Spirit people in visual art
alternative label: Two-Spirited people in visual art
alternative label: Two Spirited people in visual art
alternative label: 2S people in visual art
alternative label: Two-Spirit people in art
broader: Two-Spirit people in arts and media
change note: Version 4.2.0
has top concept: Gender
in scheme: v4
related: Two-Spirit art
related: LGBTQ+ people in visual art

Two-Spirit people in mass media
type: Concept
issued: 2025-04-23
modified: 2025-04-23
comment: The depiction of Two-Spirit people in various means of communication that reach large audiences simultaneously, including newspapers, television, radio, advertisements, and the internet.
alternative label: Two Spirit people in mass media
alternative label: Two-Spirited people in mass media
alternative label: Two Spirited people in mass media
alternative label: 2S people in mass media
alternative label: Two-Spirit people in media
change note: Version 4.2.0
in scheme: v4
related: Two-Spirit celebrities
related: LGBTQ+ people in mass media

Two-Spirit people in literature
type: Concept
issued: 2025-04-23
modified: 2025-04-23
comment: The depiction of Two-Spirit people in literature.
alternative label: Two Spirit people in literature
alternative label: Two-Spirited people in literature
alternative label: Two Spirited people in literature
alternative label: 2S people in literature
broader: Two-Spirit people in arts and media
change note: Version 4.2.0
has top concept: Gender
in scheme: v4
related: LGBTQ+ people in literature
related: Two-Spirit literature

Two-Spirit people who use substances for recreational purposes
type: Concept
issued: 2025-04-24
modified: 2025-04-24
comment: Two-Spirit people who use substances (that are typically deemed harmful or are subject to legal restriction, such as drugs and alcohol) for recreational or social purposes.
alternative label: Two Spirit people who use substances for recreational purposes
alternative label: Two-Spirited people who use substances for recreational purposes
alternative label: Two Spirited people who use substances for recreational purposes
alternative label: 2S people who use substances for recreational purposes
broader: Two-Spirit people who use substances
change note: Version 4.2.0
has top concept: Gender
in scheme: v4
related: Chemsex
related: Party drugs

Two-Spirit people with alcohol use disorders
type: Concept
issued: 2025-04-24
modified: 2025-04-24
comment: Two-Spirit people who have been diagnosed with or regard themselves as having an alcohol use disorder, a medical condition that involves a pattern of alcohol use that is difficult to control, negatively impacts the individual's life, and results in withdrawal symptoms upon cessation. Only use to refer to individuals who describe themselves as having an alcohol use disorder. Follow the individual's preference for "use disorder" or "addiction" whenever possible.
alternative label: Two-Spirit alcoholics
alternative label: Two-Spirit people with alcoholism
alternative label: Two Spirit people with alcohol use disorders
alternative label: Two-Spirited people with alcohol use disorders
alternative label: Two Spirited people with alcohol use disorders
alternative label: 2S people with alcohol use disorders
broader: Two-Spirit people who use substances
broader: Two-Spirit people with addictions
change note: Version 4.2.0
has top concept: Gender
in scheme: v4
related: Alcoholics

Two-Spirit people with substance use disorders
type: Concept
issued: 2025-04-24
modified: 2025-04-24
comment: Two-Spirit people who have been diagnosed with or regard themselves as having a substance use disorder, a medical condition that involves a pattern of substance use that is difficult to control, negatively impacts the individual's life, and results in withdrawal symptoms upon cessation. Only use to refer to individuals who describe themselves as having a substance use disorder. Follow the individual's preference for "use disorder" or "addiction" whenever possible.
alternative label: Two-Spirit people with substance issues
alternative label: Two Spirit people with substance use disorders
alternative label: Two-Spirited people with substance use disorders
alternative label: Two Spirited people with substance use disorders
alternative label: 2S people with alcohol substance disorders
broader: Two-Spirit people who use substances
broader: Two-Spirit people with addictions
change note: Version 4.2.0
has top concept: Gender
in scheme: v4
related: Substance abuse

LGBTQ+ bar signs
type: Concept
issued: 2026-02-23
modified: 2026-02-23
comment: Visual displays such as signs, banners, and other graphics advertising drinking establishments that primarily cater to LGBTQ+ people. Signs may be exterior and/or interior to the business.
alternative label: LGBTQ+ club signs
change note: Version 4.2.0
in scheme: v4
related: LGBTQ+ bars
related: LGBTQ+ night life

Two-Spirit podcasts
type: Concept
issued: 2026-02-23
modified: 2026-02-23
comment: A recorded series (primarily in audio, but sometimes with a video component) with recurring hosts that feature content about Two-Spirit people and/or Two-Spirit issues and that are available digitally for streaming or download. Podcasts are typically episodic and may feature different guests.
alternative label: Two Spirit podcasts
alternative label: Two Spirited podcasts
alternative label: Two-Spirited podcasts
alternative label: 2S podcasts
change note: Version 4.2.0
in scheme: v4
related: Two-Spirit radio
related: LGBTQ+ podcasts

Lavender marriages
type: Concept
issued: 2026-02-23
modified: 2026-02-23
comment: Mixed-orientation marriages of convenience between men and women to provide safety and deniability around their homosexuality for one or both members of the marriage. This term was commonly used in the early 20th century to describe celebrity marriages, though it has been used more broadly since.
broader: Mixed-orientation marriage
change note: Version 4.2.0
has top concept: Living arrangements
in scheme: v4
related: Boston marriages
related: LGBTQ+ discrimination

Transgender weddings
type: Concept
issued: 2026-02-23
modified: 2026-02-23
comment: Marriage ceremonies and the accompanying festivities; use to describe weddings in which both partners are transgender.
alternative label: Trans weddings
broader: LGBTQ+ weddings
change note: Version 4.2.0
has top concept: LGBTQ+ weddings
in scheme: v4
related: Transgender grooms
related: Transgender brides

Lesbian weddings
type: Concept
issued: 2026-02-23
modified: 2026-02-23
comment: Marriage ceremonies and the accompanying festivities; use to describe weddings in which both partners are lesbians.
broader: LGBTQ+ weddings
change note: Version 4.2.0
has top concept: LGBTQ+ weddings
in scheme: v4
related: Lesbian grooms
related: Lesbian brides

Gay weddings
type: Concept
issued: 2026-02-23
modified: 2026-02-23
comment: Marriage ceremonies and the accompanying festivities; use to describe weddings in which both partners are gay men.
broader: LGBTQ+ weddings
change note: Version 4.2.0
has top concept: LGBTQ+ weddings
in scheme: v4
related: Gay grooms
related: Gay brides

Bisexual weddings
type: Concept
issued: 2026-02-23
modified: 2026-02-23
comment: Marriage ceremonies and the accompanying festivities; use to describe weddings in which both partners are bisexual.
alternative label: Bi weddings
broader: LGBTQ+ weddings
change note: Version 4.2.0
has top concept: LGBTQ+ weddings
in scheme: v4
related: Bisexual grooms
related: Bisexual brides

Non-binary weddings
type: Concept
issued: 2026-02-23
modified: 2026-02-23
comment: Marriage ceremonies and the accompanying festivities; use to describe weddings in which both partners are non-binary.
alternative label: Nonbinary weddings
broader: LGBTQ+ weddings
change note: Version 4.2.0
has top concept: LGBTQ+ weddings
in scheme: v4
related: Non-binary grooms
related: Non-binary brides

Queer weddings
type: Concept
issued: 2026-02-23
modified: 2026-02-23
comment: Marriage ceremonies and the accompanying festivities; use to describe weddings in which both partners are queer.
broader: LGBTQ+ weddings
change note: Version 4.2.0
has top concept: LGBTQ+ weddings
in scheme: v4
related: Queer grooms
related: Queer brides

Intersex weddings
type: Concept
issued: 2026-02-23
modified: 2026-02-23
comment: Marriage ceremonies and the accompanying festivities; use to describe weddings in which both partners are intersex.
broader: LGBTQ+ weddings
change note: Version 4.2.0
has top concept: LGBTQ+ weddings
in scheme: v4
related: Intersex grooms
related: Intersex brides

Mutual aid funds
type: Concept
issued: 2026-02-23
modified: 2026-03-03
comment: Funds that distribute goods and money collected and raised using the mutual aid organizational model. This model utilizes voluntary, collaborative exchanges of resources and services for common benefit and take place amongst community members to overcome social, economic, and political barriers to meet common needs. This can include funds which distribute resources like food, clothing, or medicine, as well as those that provide financial support for medical services, rent payments, and other financial needs.
alternative label: Mutual aid
change note: Version 4.2.0
in scheme: v4
narrower: Abortion funds

Barriers to gender-affirming care
type: Concept
issued: 2026-02-23
modified: 2026-02-26
comment: Institutional and personal issues that prevent a person from seeking and/or receiving gender-affirming care, which may include finances, legislative prohibitions, and family, social, and/or religious pressures.
broader: Health care for LGBTQ+ people
change note: Version 4.2.0
has top concept: Health care for LGBTQ+ people
in scheme: v4
related: Gender-affirming care
related: Transgender health care bans

Religious views on LGBTQ+ people
type: Concept
issued: 2026-02-23
modified: 2026-02-23
comment: Beliefs, practices, and values held by individuals or groups regarding LGBTQ+ people, originating from people united by a religion or religious practices. This can include large-scale organized groups, such as denominations or sects, as well as small-scale groups, such as specific churches, mosques, temples, or congregations.
change note: Version 4.2.0
in scheme: v4
related: LGBTQ+-affirming religious groups
related: LGBTQ+-affirming religious services

Transgender grooms
type: Concept
issued: 2026-02-23
modified: 2026-02-23
comment: Transgender people who are getting married and identify as a groom.
alternative label: Trans grooms
broader: LGBTQ+ grooms
change note: Version 4.2.0
has top concept: LGBTQ+ people
in scheme: v4
related: Transgender weddings
related: Transgender brides

Transgender brides
type: Concept
issued: 2026-02-23
modified: 2026-02-23
comment: Transgender people who are getting married and identify as a bride.
alternative label: Trans brides
broader: LGBTQ+ brides
change note: Version 4.2.0
has top concept: LGBTQ+ people
in scheme: v4
related: Transgender weddings
related: Transgender grooms

Lesbian grooms
type: Concept
issued: 2026-02-23
modified: 2026-02-23
comment: Lesbians who are getting married and identify as a groom.
broader: LGBTQ+ grooms
change note: Version 4.2.0
has top concept: LGBTQ+ people
in scheme: v4
related: Lesbian weddings
related: Lesbian brides

Lesbian brides
type: Concept
issued: 2026-02-23
modified: 2026-02-23
comment: Lesbians who are getting married and identify as a bride.
broader: LGBTQ+ brides
change note: Version 4.2.0
has top concept: LGBTQ+ people
in scheme: v4
related: Lesbian weddings
related: Lesbian grooms

Gay grooms
type: Concept
issued: 2026-02-23
modified: 2026-02-23
comment: Gay men who are getting married and identify as a groom.
broader: LGBTQ+ grooms
change note: Version 4.2.0
has top concept: LGBTQ+ people
in scheme: v4
related: Gay weddings
related: Gay brides

Gay brides
type: Concept
issued: 2026-02-23
modified: 2026-02-23
comment: Gay men who are getting married and identify as a bride.
broader: LGBTQ+ brides
change note: Version 4.2.0
has top concept: LGBTQ+ people
in scheme: v4
related: Gay weddings
related: Gay grooms

Bisexual grooms
type: Concept
issued: 2026-02-23
modified: 2026-02-23
comment: Bisexual people who are getting married and identify as a groom.
alternative label: Bi grooms
broader: LGBTQ+ grooms
change note: Version 4.2.0
has top concept: LGBTQ+ people
in scheme: v4
related: Bisexual weddings
related: Bisexual brides

Bisexual brides
type: Concept
issued: 2026-02-23
modified: 2026-02-23
comment: Bisexual people who are getting married and identify as a bride.
alternative label: Bi brides
broader: LGBTQ+ brides
change note: Version 4.2.0
has top concept: LGBTQ+ people
in scheme: v4
related: Bisexual weddings
related: Bisexual grooms

Asexual grooms
type: Concept
issued: 2026-02-23
modified: 2026-02-24
comment: Asexual people who are getting married and identify as a groom.
alternative label: Ace grooms
broader: LGBTQ+ grooms
change note: Version 4.2.0
has top concept: LGBTQ+ people
in scheme: v4
related: Asexual brides
related: Asexual weddings

Asexual brides
type: Concept
issued: 2026-02-23
modified: 2026-02-24
comment: Asexual people who are getting married and identify as a bride.
alternative label: Ace brides
broader: LGBTQ+ brides
change note: Version 4.2.0
has top concept: LGBTQ+ people
in scheme: v4
related: Asexual grooms
related: Asexual weddings

Non-binary grooms
type: Concept
issued: 2026-02-23
modified: 2026-02-23
comment: Non-binary people who are getting married and identify as a groom.
alternative label: Nonbinary grooms
broader: LGBTQ+ grooms
change note: Version 4.2.0
has top concept: LGBTQ+ people
in scheme: v4
related: Non-binary weddings
related: Non-binary brides

Non-binary brides
type: Concept
issued: 2026-02-23
modified: 2026-02-23
comment: Non-binary people who are getting married and identify as a bride.
alternative label: Nonbinary brides
broader: LGBTQ+ brides
change note: Version 4.2.0
has top concept: LGBTQ+ people
in scheme: v4
related: Non-binary weddings
related: Non-binary grooms

Queer grooms
type: Concept
issued: 2026-02-23
modified: 2026-02-23
comment: Queer people who are getting married and identify as a groom.
broader: LGBTQ+ grooms
change note: Version 4.2.0
has top concept: LGBTQ+ people
in scheme: v4
related: Queer weddings
related: Queer brides

Queer brides
type: Concept
issued: 2026-02-23
modified: 2026-02-23
comment: Queer people who are getting married and identify as a bride.
broader: LGBTQ+ brides
change note: Version 4.2.0
has top concept: LGBTQ+ people
in scheme: v4
related: Queer weddings
related: Queer grooms

Intersex grooms
type: Concept
issued: 2026-02-23
modified: 2026-02-23
comment: Intersex people who are getting married and identify as a groom.
broader: LGBTQ+ grooms
change note: Version 4.2.0
has top concept: LGBTQ+ people
in scheme: v4
related: Intersex weddings
related: Intersex brides

Intersex brides
type: Concept
issued: 2026-02-23
modified: 2026-02-23
comment: Intersex people who are getting married and identify as a bride.
broader: LGBTQ+ brides
change note: Version 4.2.0
has top concept: LGBTQ+ people
in scheme: v4
related: Intersex weddings
related: Intersex grooms

Two-Spirit law students
type: Concept
issued: 2026-02-24
modified: 2026-02-27
comment: Two-Spirit people who are studying law at an institution of higher education in preparation to become lawyers.
alternative label: Two Spirit law students
alternative label: Two-Spirited law students
alternative label: Two Spirited law students
alternative label: 2S law students
broader: Two-Spirit people
change note: Version 4.2.0
has top concept: Gender
in scheme: v4
related: LGBTQ+ law students
related: Two-Spirit lawyers

Asexual weddings
type: Concept
issued: 2026-02-24
modified: 2026-02-24
comment: Marriage ceremonies and the accompanying festivities; use to describe weddings in which both partners are asexual.
alternative label: Ace weddings
broader: LGBTQ+ weddings
change note: Version 4.2.0
has top concept: LGBTQ+ weddings
in scheme: v4
related: Asexual brides
related: Asexual grooms

Abortion counseling for LGBTQ+ people
type: Concept
issued: 2026-02-24
modified: 2026-03-03
comment: Various forms of counseling that provides information and support regarding abortion procedures to LGBTQ+ people.
broader: Reproductive health care for LGBTQ+ people
change note: Version 4.2.0
has top concept: Health care for LGBTQ+ people
in scheme: v4
related: Reproductive health care for Two-Spirit people
related: Abortion funds

Two-Spirit lawyers
type: Concept
issued: 2026-02-24
modified: 2026-02-27
comment: Two-Spirit people who are licensed to provide legal advice, draft legal documents, and represent others in legal matters.
alternative label: Two Spirit lawyers
alternative label: Two-Spirited lawyers
alternative label: Two Spirited lawyers
alternative label: 2S lawyers
broader: Two-Spirit people
change note: Version 4.2.0
has top concept: Gender
in scheme: v4
related: LGBTQ+ lawyers
related: Two-Spirit law students

Abortion services for LGBTQ+ people
type: Concept
issued: 2026-02-24
modified: 2026-03-03
comment: Various forms of abortion services for LGBTQ+ people, including both in-clinic abortion (also known as a surgical abortion) and medication abortion (also referred to as the abortion pill).
broader: Reproductive health care for LGBTQ+ people
change note: Version 4.2.0
has top concept: Health care for LGBTQ+ people
in scheme: v4
related: Reproductive health care for Two-Spirit people
related: Abortion funds

Gay medical professionals
type: Concept
issued: 2026-02-24
modified: 2026-03-04
comment: Gay men who are trained and licensed to provide healthcare services, such as diagnosing, treating, and preventing physical or mental illness.
broader: LGBTQ+ medical professionals
change note: Version 4.2.0
has top concept: LGBTQ+ people
in scheme: v4
narrower: Gay medical doctors
narrower: Gay nurses

Lesbian medical professionals
type: Concept
issued: 2026-02-24
modified: 2026-03-04
comment: Lesbians who are trained and licensed to provide healthcare services, such as diagnosing, treating, and preventing physical or mental illness.
broader: LGBTQ+ medical professionals
change note: Version 4.2.0
has top concept: LGBTQ+ people
in scheme: v4
narrower: Lesbian medical doctors
narrower: Lesbian nurses

Bisexual medical professionals
type: Concept
issued: 2026-02-24
modified: 2026-03-04
comment: Bisexual people who are trained and licensed to provide healthcare services, such as diagnosing, treating, and preventing physical or mental illness.
alternative label: Bi medical professionals
broader: LGBTQ+ medical professionals
change note: Version 4.2.0
has top concept: LGBTQ+ people
in scheme: v4
narrower: Bisexual medical doctors
narrower: Bisexual nurses

Asexual medical professionals
type: Concept
issued: 2026-02-24
modified: 2026-03-04
comment: Asexual people who are trained and licensed to provide healthcare services, such as diagnosing, treating, and preventing physical or mental illness.
alternative label: Ace medical professionals
broader: LGBTQ+ medical professionals
change note: Version 4.2.0
has top concept: LGBTQ+ people
in scheme: v4
narrower: Asexual medical doctors
narrower: Asexual nurses

Intersex medical professionals
type: Concept
issued: 2026-02-24
modified: 2026-03-04
comment: Intersex people who are trained and licensed to provide healthcare services, such as diagnosing, treating, and preventing physical or mental illness.
broader: LGBTQ+ medical professionals
change note: Version 4.2.0
has top concept: LGBTQ+ people
in scheme: v4
narrower: Intersex medical doctors
narrower: Intersex nurses

Non-binary medical professionals
type: Concept
issued: 2026-02-24
modified: 2026-03-04
comment: Non-binary people who are trained and licensed to provide healthcare services, such as diagnosing, treating, and preventing physical or mental illness.
alternative label: Nonbinary medical professionals
broader: LGBTQ+ medical professionals
change note: Version 4.2.0
has top concept: LGBTQ+ people
in scheme: v4
narrower: Non-binary medical doctors
narrower: Non-binary nurses

Transgender medical professionals
type: Concept
issued: 2026-02-24
modified: 2026-03-04
comment: Transgender people who are trained and licensed to provide healthcare services, such as diagnosing, treating, and preventing physical or mental illness.
alternative label: Trans medical professionals
broader: LGBTQ+ medical professionals
change note: Version 4.2.0
has top concept: LGBTQ+ people
in scheme: v4
narrower: Transgender medical doctors
narrower: Transgender nurses

Queer medical professionals
type: Concept
issued: 2026-02-24
modified: 2026-03-04
comment: Queer people who are trained and licensed to provide healthcare services, such as diagnosing, treating, and preventing physical or mental illness.
broader: LGBTQ+ medical professionals
change note: Version 4.2.0
has top concept: LGBTQ+ people
in scheme: v4
narrower: Queer medical doctors
narrower: Queer nurses

Bisexual erasure
type: Concept
issued: 2026-02-24
modified: 2026-02-27
comment: Denying, dismissing, and/or questioning the existence of bisexuality as a legitimate sexual orientation. Bisexual erasure also includes the pervasive mislabeling of bisexual people as either straight or gay based on the identity of their past and present partner(s) and/or claiming bisexual people are confused, straight and going through a phase, or in denial about being gay. This stigma occurs within and outside of LGBTQ+ communities, contributing to adverse mental health outcomes.
alternative label: Bi erasure
alternative label: Bisexual invisibility
alternative label: Bi invisibility
change note: Version 4.2.0
in scheme: v4
related: Bisexual identity
related: Persecution of bisexual people

Two-Spirit medical doctors
type: Concept
issued: 2026-02-25
modified: 2026-02-25
comment: Two-Spirit people who are licensed, qualified practitioners of medicine.
alternative label: Two Spirit medical doctors
alternative label: Two-Spirited medical doctors
alternative label: Two Spirited medical doctors
alternative label: 2S medical doctors
alternative label: Two Spirit physicians
alternative label: Two-Spirited physicians
alternative label: Two Spirited physicians
alternative label: 2S physicians
alternative label: Two Spirit doctors
alternative label: Two-Spirited doctors
alternative label: Two Spirited doctors
alternative label: 2S doctors
broader: Two-Spirit people
broader: Two-Spirit medical professionals
change note: Version 4.2.0
has top concept: Gender
in scheme: v4
preferred label: Two-Spirit medical practitioners
related: LGBTQ+ medical doctors

Two-Spirit nurses
type: Concept
issued: 2026-03-04
modified: 2026-03-04
comment: Two-Spirit people who are licensed nurses and practice independently or in collaboration with a multidisciplinary team.
alternative label: Two Spirit nurses
alternative label: Two-Spirited nurses
alternative label: Two Spirited nurses
alternative label: 2S nurses
broader: Two-Spirit people
broader: Two-Spirit medical professionals
change note: Version 4.2.0
has top concept: Gender
in scheme: v4
related: LGBTQ+ nurses

LGBTQ+ actors
type: Concept
issued: 2019-05-14
modified: 2025-02-23
replaces: LGBTQActors
comment: LGBTQ+ people who act in stage plays, movies, television shows, broadcasts, or other productions.
comment: Personas LGBTQ+ que actúan en obras de teatro, películas, programas de televisión, transmisiones u otras producciones.
alternative label: Actors (LGBTQ)
alternative label: Actresses (LGBTQ)
alternative label: LGBTQ actors
alternative label: Actores LGBTQ
alternative label: Actores (LGBTQ)
broader: LGBTQ+ people
change note: Version 4.2.0
has top concept: LGBTQ+ people
in scheme: v3
narrower: LGBTQ+ porn stars
preferred label: Actores LGBTQ+
related: LGBTQ+ arts
related: Actorfic

Age of consent
type: Concept
issued: 2019-05-14
modified: 2025-02-23
replaces: ageOfConsent
comment: The age at which a person is considered legally competent to consent to sexual acts. The age of consent varies depending on the country, state, or culture.
comment: La edad en la que una persona es considerada legalmente competente para consentir a actos sexuales. La edad de consentimiento varía según el país, el estado o la cultura.
broader: Consent
change note: Version 4.2.0
has top concept: Consent
in scheme: v3
preferred label: Edad de consentimiento
related: Intergenerational relationships
related: Sexual offenses laws
related: Underage (Content warning)

Age play
type: Concept
issued: 2019-05-14
modified: 2025-02-23
replaces: ageplay
comment: The act of roleplaying as people of different ages, usually as children, for fun or erotic enjoyment.
comment: Una forma de juego de roles, típicamente sexual, que se da entre personas adultas que consienten en el que uno o más participantes representan una edad diferente a su edad biológica.
alternative label: ABDL
alternative label: Ageplay
alternative label: Infantilism
alternative label: Juegos con la edad
broader: Roleplay
change note: Version 4.2.0
has top concept: Sex (Act)
in scheme: v3
preferred label: Juego de edades
related: BDSM
related: Power exchange
related: Diapers (Erotic)

AIDS activists
type: Concept
issued: 2019-05-14
modified: 2025-02-23
replaces: AIDSActivists
comment: People who campaign for social and political change for people affected by HIV/AIDS.
comment: Personas que hacen campaña por el cambio social y político para las personas afectadas por el VIH/SIDA.
alternative label: Activistas del SIDA
broader: LGBTQ+ political activists
change note: Version 4.2.0
has top concept: LGBTQ+ people
in scheme: v3
preferred label: Activistas contra el SIDA
related: HIV/AIDS
related: AIDS organizations
related: LGBTQ+ movement

AIDS memorials
type: Concept
issued: 2019-05-14
modified: 2025-02-23
replaces: AIDSMemorials
comment: Projects and events celebrating the lives of people who have died of AIDS-related causes.
comment: Proyectos y eventos que celebran las vidas de personas que han muerto por causas relacionadas al SIDA.
broader: Medical care
change note: Version 4.2.0
has top concept: Medical care
in scheme: v3
narrower: AIDS memorial quilts
preferred label: Conmemoraciones del SIDA
related: HIV/AIDS
related: LGBTQ+ memorials

AIDS periodicals
type: Concept
issued: 2019-05-14
modified: 2025-02-23
replaces: AIDSPeriodicals
comment: Print or digital publications published periodically and created by or for people with AIDS.
comment: Publicaciones impresas o digitales publicadas periódicamente y creadas por o para personas con SIDA.
alternative label: Publicaciones periódicas contra el SIDA
alternative label: Publicaciones periódicas sobre el SIDA ||
broader: LGBTQ+ periodicals
change note: Version 4.2.0
has top concept: LGBTQ+ periodicals
in scheme: v3
preferred label: Revistas sobre SIDA
related: HIV/AIDS
related: AIDS organizations
related: LGBTQ+ press

Androgen insensitivity syndrome
type: Concept
issued: 2019-05-14
modified: 2025-02-23
replaces: androgenInsensitivitySyndrome
comment: People born with AIS have XY chromosomes and testes, and their bodies have varying levels of insensitivity to androgens (including testosterone). This means that their cells do not respond typically to the testosterone that they produce. Like other variations in sex characteristics, AIS is a spectrum, with the subcategories of complete (CAIS), partial (PAIS), and mild androgen insensitivity (MAIS). The term "male androgen insensitivity syndrome" should not be used to describe this variation because many people with AIS are women.
comment: Las personas que nacen con AIS (por sus siglas en inglés) [or use the Spanish acronym, SIA. This applies to its usage throughout the definition.] tienen cromosomas XY y testículos, y sus cuerpos tienen distintos niveles de insensibilidad a los andrógenos (incluida la testosterona). Esto significa que sus células no responden de forma regular a la testosterona que producen. Al igual que otras variaciones en las características sexuales, la AIS es un espectro, con las subcategorías de insensibilidad completa (CAIS), parcial (PAIS) y leve a los andrógenos (MAIS). El término "síndrome de insensibilidad masculina a los andrógenos" no debe utilizarse para describir esta variación ya que muchas personas con AIS son mujeres.
alternative label: AIS
alternative label: Goldberg-Maxwell syndrome
alternative label: Male androgen insensitivity syndrome
alternative label: SIA
alternative label: Síndrome Goldberg-Maxwell
alternative label: Síndrome de insensibilidad a los andrógenos masculinos
broader: Intersex variations
change note: Version 4.2.0
has top concept: Sex (Body)
in scheme: v3
narrower: Partial androgen insensitivity syndrome
narrower: Complete gonadal dysgenesis
narrower: Mild androgen insensitivity syndrome
preferred label: Síndrome de insensibilidad a los andrógenos

Androgynous people
type: Concept
issued: 2019-05-14
modified: 2025-02-23
replaces: androgynousPeople
comment: People who have a non-binary gender that includes masculine and feminine traits.
comment: Personas que tienen un género no binario que incluye rasgos masculinos y femeninos.
broader: Transgender people
broader: Gender minorities
change note: Version 4.2.0
has top concept: LGBTQ+ people
in scheme: v3
preferred label: Personas andróginas
related: Androgyny
related: Non-binary people

Anti-gay violence
type: Concept
issued: 2019-05-14
modified: 2025-02-23
replaces: anti-gayViolence
comment: Behavior involving physical force intended to harm or kill gay men on the basis of their identity.
comment: Comportamiento que involucra fuerza física destinada a hacer daño o a matar a hombres gay en base a su identidad.
alternative label: Gay bashing
broader: Anti-LGBTQ+ violence
change note: Version 4.2.0
has top concept: Anti-LGBTQ+ violence
in scheme: v3
narrower: Forced castration
preferred label: Violencia anti-gay
related: Hate crimes
related: Homophobia

Anti-lesbian violence
type: Concept
issued: 2019-05-14
modified: 2025-02-23
replaces: anti-lesbianViolence
comment: Behavior involving physical force intended to harm or kill lesbians on the basis of their identity.
comment: Comportamiento que involucra fuerza física destinada a hacer daño o a matar a lesbianas por su identidad.
alternative label: Lesbian bashing
broader: Anti-LGBTQ+ violence
change note: Version 4.2.0
has top concept: Anti-LGBTQ+ violence
in scheme: v3
preferred label: Violencia anti-lesbiana
related: Hate crimes
related: Lesbians
related: Lesbophobia

Autoerotic asphyxiation
type: Concept
issued: 2019-05-14
modified: 2025-02-23
replaces: autoeroticAsphyxiation
comment: Intentional restriction of one's own oxygen for the purposes of sexual arousal.
comment: Restricción intencionada del oxígeno propio con fines de excitación sexual.
alternative label: Asphyxiophilia
alternative label: Autoerotic asphyxia
alternative label: Hypoxyphilia
alternative label: Strangulation sex
alternative label: Asfixiofilia
alternative label: Hipoxifilia
alternative label: Sexo por estrangulación
broader: Sex (Act)
broader: Sexual practices
broader: Breath control
change note: Version 4.2.0
has top concept: Sex (Act)
in scheme: v3
preferred label: Asfixia autoerótica
related: BDSM

Assigned female at birth
type: Concept
issued: 2019-05-14
modified: 2025-02-23
replaces: assignedFemaleAtBirth
comment: The assignment of a female gender marker or a female sex designation shortly after birth.
comment: Asignación de un marcador de sexo femenino o una designación de sexo femenino poco después del nacimiento.
alternative label: AFAB
alternative label: Assigned F at birth
alternative label: Designated female at birth
alternative label: DFAB
alternative label: Female assigned at birth
alternative label: FAAB
alternative label: Asignadx mujer al nacer
alternative label: AMAN
broader: Assigned gender
broader: Sex assigned at birth
change note: Version 4.2.0
has top concept: Gender
in scheme: v3
preferred label: Asignada sexo femenino al nacer
related: Cisgender women
related: Trans men

Assigned male at birth
type: Concept
issued: 2019-05-14
modified: 2025-02-23
replaces: assignedMaleAtBirth
comment: The assignment of a male gender marker or a male sex designation shortly after birth.
comment: Asignación de un marcador de género masculino o una designación de sexo masculino poco después del nacimiento.
alternative label: AMAB
alternative label: Assigned M at birth
alternative label: Designated male at birth
alternative label: DMAB
alternative label: Male assigned at birth
alternative label: MAAB
alternative label: Asignadx hombre al nacer
alternative label: AHAN
broader: Assigned gender
broader: Sex assigned at birth
change note: Version 4.2.0
has top concept: Gender
in scheme: v3
preferred label: Asignado sexo masculino al nacer
related: Cisgender men
related: Trans women

Baby dykes
type: Concept
issued: 2019-05-14
modified: 2025-02-23
replaces: babyDyke
comment: Newly out lesbians; only use for lesbians who self-identify as dykes.
comment: Lesbianas recién salidas del armario; utilícese únicamente para lesbianas que se autoidentifican como dykes.
broader: Lesbians
change note: Version 4.2.0
has top concept: LGBTQ+ people
in scheme: v3
related: Baby gays
related: Coming out
related: Outing (LGBTQ+ culture)

Baby gays
type: Concept
issued: 2019-05-14
modified: 2025-02-23
replaces: babyGay
comment: Newly out people, particularly newly out gay men.
comment: Una persona recién salida del armario, particularmente un hombre gay recién salido del armario.
broader: Gay men
change note: Version 4.2.0
has top concept: LGBTQ+ people
in scheme: v3
preferred label: Baby gay
related: Baby dykes
related: Coming out
related: Outing (LGBTQ+ culture)

Bakla
type: Concept
issued: 2019-05-14
modified: 2025-02-23
replaces: bakla
comment: Filipino word for people who are assigned male at birth who adopt feminine mannerisms; often considered a third gender.
comment: Palabra filipina para personas asignadas al sexo masculino al nacer que adoptan gestos femeninos; a menudo consideradas un tercer género.
broader: Non-Euro-American gender and sexual identities
broader: Slurs
change note: Version 4.2.0
has top concept: Gender
in scheme: v3
related: Agî
related: Bayot

Birth certificate amendments
type: Concept
issued: 2019-05-14
modified: 2025-02-23
replaces: birthCertificateAmendments
comment: Formal changes to an individual's birth certificate, typically to reflect a change to the individual's legal name or gender or sex marker.
comment: Cambios formales al certificado de nacimiento de una persona, normalmente para reflejar un cambio en su nombre legal, o de su marca de género o sexo.
broader: Birth certificates
change note: Version 4.2.0
has top concept: Legal status
in scheme: v3
preferred label: Enmiendas al certificado de nacimiento
related: Assigned gender
related: Gender assigned at birth
related: LGBTQ+ personal and family law

Bisexual dominatrices
type: Concept
issued: 2019-05-14
modified: 2025-02-23
replaces: bisexualDominatrices
comment: Women who take a dominant role in BDSM activities; use for dominatrices who identify as bisexual.
comment: Personas bisexuales que forman parte de la escena BDSM y asumen el rol dominante en las relaciones sexuales con una dinámica dominante/sumisa.
alternative label: Amos bisexuales
broader: LGBTQ+ dominatrices
change note: Version 4.2.0
has top concept: Relationship minorities
in scheme: v3
preferred label: Dominantes bisexuales
related: Lesbian dominatrices
related: Queer dominatrices
related: Transgender dominatrices

Bisexual families
type: Concept
issued: 2019-05-14
modified: 2025-02-23
replaces: bisexualFamilies
comment: Families, whether biological, adoptive, or chosen, in which one or more individuals identify as bisexual.
comment: Obras literarias que tengan elementos eróticos o sexuales; utilícese en referencia a la literatura erótica que se centra en personajes o temas bisexuales.
broader: LGBTQ+ families
change note: Version 4.2.0
has top concept: LGBTQ+ families
in scheme: v3
preferred label: Literatura erótica bisexual
related: Bisexual parents
related: Bisexual people
related: Children of bisexual people

Bisexual identity
type: Concept
issued: 2019-05-14
modified: 2026-02-24
replaces: bisexualIdentity
comment: Term used to describe the sexual identity of individuals who are romantically and/or sexually attracted to people of more than one gender and who prefer the term bisexual over alternatives such as pansexual, polysexual, etc.
comment: Obras de ficción escritas con la intención de asustar, atemorizar o provocar disgusto; utilícese en referencia a la ficción de horror centrada en personajes o temas bisexuales.
broader: Sexual identity
change note: Version 4.2.0
has top concept: Sexual identity
in scheme: v3
preferred label: Ficción de horror bisexual
related: Bisexual children
related: Bisexual people
related: Bisexual erasure

Bisexual men
type: Concept
issued: 2019-05-14
modified: 2025-02-23
replaces: bisexualMen
comment: Men who identify as bisexual.
comment: Personas bisexuales (típicamente hombres) que forman parte de la escena BDSM y asumen el rol de amo en las relaciones sexuales con una dinámica amo/esclavo.
alternative label: Male bisexuals
broader: Bisexual people
broader: Males
change note: Version 4.2.0
has top concept: LGBTQ+ people
in scheme: v3
preferred label: Amos bisexuales
related: Men who have sex with men
related: Queer men

Bisexual mistresses (BDSM culture)
type: Concept
issued: 2019-05-14
modified: 2026-02-24
replaces: bisexualMistresses
comment: Bisexual women who are part of the BDSM scene and assume the mistress role in sexual relationships with a mistress/submissive dynamic.
comment: Hombres que se autoidentifican como bisexuales.
broader: LGBTQ+ mistresses (BDSM culture)
change note: Version 4.2.0
has top concept: Sexual identity
in scheme: v3
preferred label: Hombres bisexuales
related: Lesbian mistresses (BDSM culture)
related: Queer mistresses (BDSM culture)
related: Transgender mistresses (BDSM culture)

Bisexual parents
type: Concept
issued: 2019-05-14
modified: 2025-02-23
replaces: bisexualParents
comment: Parents who are bisexual.
comment: Óperas creadas por directores bisexuales, que representan a personas bisexuales o a personas consideradas importantes dentro de la cultura bisexual.
broader: Bisexual people
broader: LGBTQ+ parents
change note: Version 4.2.0
has top concept: LGBTQ+ people
in scheme: v3
preferred label: Óperas bisexuales
related: Bisexual families
related: Children of bisexual people

Bisexual women
type: Concept
issued: 2019-05-14
modified: 2025-02-23
replaces: bisexualWomen
comment: Bisexual individuals who self-identity as women and understand their gender in terms of Western conceptions of womanness, femaleness, and/or femininity.
comment: Personas bisexuales que seautoidentificancomo mujeres y que entienden su género en términos de las concepciones occidentales del ser mujer, la feminidad, y/o la femineidad.
broader: Bisexual people
broader: Females
change note: Version 4.2.0
has top concept: LGBTQ+ people
in scheme: v3
narrower: Mati
preferred label: Mujeres bisexuales
related: Women who have sex with women

Blindfolds
type: Concept
issued: 2019-05-14
modified: 2025-02-23
replaces: blindfolds
comment: An accessory used to cover the eyes, traditionally a piece of cloth tied around one’s head to eliminate or limit vision.
comment: Trozos de tela o material similar utilizados para cubrir los ojos de una persona y perjudicar su visión, a menudo para estimulación sexual.
broader: Sex accessories
broader: Kink accessories
change note: Version 4.2.0
has top concept: Sex accessories
in scheme: v3
preferred label: Vendas
related: Hoods (Erotic)
related: Sensory deprivation (Erotic)

Boston marriages
type: Concept
issued: 2019-05-14
modified: 2026-02-23
replaces: bostonMarriages
comment: The cohabitation of two women (often in a romantic relationship) without the financial support of a man. Originated in New England (USA) in the late 19th century.
comment: La convivencia de dos mujeres (a menudo en una relación romántica) sin el apoyo económico de un hombre. Se originó en Nueva Inglaterra (EE.UU.) a finales del siglo XIX.
alternative label: Matrimonios bostonianos
broader: LGBTQ+ couples
broader: LGBTQ+ historical terms
change note: Version 4.2.0
has top concept: Relationship satisfaction
in scheme: v3
preferred label: Matrimonios de Boston
related: Lesbian couples
related: Lavender marriages

LGBTQ+ peer support
type: Concept
issued: 2019-05-14
modified: 2026-03-03
replaces: buddyCareForLGBTQPeople
comment: A peer-to-peer form of healthcare support for LGBTQ+ people in which volunteers (sometimes called buddies) attend clinical visits with patients to provide emotional and logistical support.
comment: Una forma de apoyo entre pares para cuidados de salud para personas LGBTQ+ en la que voluntarios (amigos) asisten a visitas clínicas con pacientes para brindarles apoyo emocional y logístico.
alternative label: Buddy care for LGBTQ+ people
alternative label: LGBTQ+ buddy care
alternative label: Peer support for LGBTQ+ people
alternative label: Pares
alternative label: Cuidado entre pares LGBTQ+
broader: Health care for LGBTQ+ people
change note: Version 4.2.0
has top concept: Health care for LGBTQ+ people
in scheme: v3
preferred label: Cuidado de pares LGBTQ+
related: HIV/AIDS
related: HIV-positive people
related: Abortion funds

Children of bisexual people
type: Concept
issued: 2019-05-14
modified: 2025-02-23
replaces: childrenOfBisexualPeople
comment: Children who have one or more bisexual parent.
comment: Hijos o hijas que tienen uno o más madres o padres bisexuales.
alternative label: Hijas de personas bisexuales
broader: Children of LGBTQ+ people
change note: Version 4.2.0
has top concept: Family members
in scheme: v3
narrower: Sons of bisexual people
preferred label: Hijos de personas bisexuales
related: Bisexual families
related: Bisexual parents

Children of gay men
type: Concept
issued: 2019-05-14
modified: 2025-02-23
replaces: childrenOfGayMen
comment: Children who have one or more gay father.
comment: Hijos o hijas que tienen uno o más padres gay.
alternative label: Hijas de hombres gay
broader: Children of LGBTQ+ people
change note: Version 4.2.0
has top concept: Family members
in scheme: v3
narrower: Sons of gay men
preferred label: Hijos de hombres gay
related: Gay families
related: Gay parents

Children of lesbians
type: Concept
issued: 2019-05-14
modified: 2025-02-23
replaces: childrenOfLesbians
comment: Children who have one or more lesbian parent.
comment: Hijos o hijas que tienen una o más madres lesbianas.
alternative label: Hijas de lesbianas
broader: Children of LGBTQ+ people
change note: Version 4.2.0
has top concept: Family members
in scheme: v3
narrower: Sons of lesbians
preferred label: Hijos de lesbianas
related: Lesbian families
related: Lesbian parents

Cisgender men
type: Concept
issued: 2019-05-14
modified: 2025-02-23
replaces: cisgenderMen
comment: Men whose gender identity matches the sex or gender they were assigned at birth.
comment: Hombres cuya identidad de género coincide con el sexo o género que les fue asignado al nacer.
alternative label: Hombre cis
broader: Cisgender people
broader: Males
change note: Version 4.2.0
has top concept: Cisgender people
in scheme: v3
preferred label: Hombres cisgénero
related: Assigned male at birth
related: Cisgender identity

Cisgender women
type: Concept
issued: 2019-05-14
modified: 2025-02-23
replaces: cisgenderWomen
comment: Women whose gender identity matches the sex or gender they were assigned at birth.
comment: Mujeres cuya identidad de género coincide con el género o sexo que les fue asignado al nacer.
alternative label: Mujeres cis
broader: Cisgender people
broader: Females
change note: Version 4.2.0
has top concept: Cisgender people
in scheme: v3
preferred label: Mujeres cisgénero
related: Assigned female at birth
related: Cisgender identity

Corrective rape
type: Concept
issued: 2019-05-14
modified: 2025-02-23
replaces: correctiveRape
comment: Criminal practice in which men rape lesbians, sometimes under the supervision of members of the women's families or local communities, with the purported purpose of "curing" them of homosexuality.
comment: Práctica criminal en la que hombres violan a lesbianas, a veces bajo la supervisión de miembros de las familias de las mujeres o de las comunidades locales, con el supuesto propósito de "curarlas" de la homosexualidad.
broader: Sexual violence
change note: Version 4.2.0
has top concept: Sexual violence
in scheme: v3
preferred label: Violación correctiva
related: Lesbian survivors of rape
related: Lesbian victims of rape
related: Rape culture

Corsets
type: Concept
issued: 2019-05-14
modified: 2025-02-23
replaces: corsets
comment: A garment worn to hold and train the torso into a desired shape, traditionally a smaller waist or larger bottom, for aesthetic purposes (either for the duration of wearing it or with a more lasting effect), or to support the breasts.
comment: Vestiduras ajustadas que se utilizan sobre el pecho y/o el estómago, generalmente con fines estéticos o médicos.
alternative label: Bondage corsets
alternative label: Tightlacing
alternative label: Fajas
broader: Kink accessories
broader: LGBTQ+ fashion
change note: Version 4.2.0
has top concept: Eroticism
in scheme: v3
preferred label: Corsés
related: Body modification
related: Breath control

Criminal law
type: Concept
issued: 2019-05-14
modified: 2025-02-23
replaces: criminalLaw
comment: Body of law relating to crime that prescribes the legality and consequences of conduct perceived as threatening, harmful, or endangering to the property, health, safety, and/or moral welfare of oneself and others.
comment: Conjunto de leyes relativas al delito que prescribe la legalidad y las consecuencias de conductas percibidas como amenazantes, dañinas o que ponen en peligro la propiedad, la salud, la seguridad y/o el bienestar moral de uno mismo y de los demás.
broader: Law
change note: Version 4.2.0
has top concept: Law
in scheme: v3
narrower: Criminalization
narrower: Decriminalization
narrower: Sexual offenses laws
preferred label: Derecho penal

Deadnaming
type: Concept
issued: 2019-05-14
modified: 2025-03-20
replaces: deadnaming
comment: The act of using or referring to a person’s assigned name rather than their chosen name, commonly with malicious intent.
comment: El acto de usar o hacer referencia al nombre asignado de una persona en lugar de utilizar su nombre elegido, comúnmente con intenciones maliciosas.
alternative label: Uso del nombre muerto
alternative label: Uso del nombre pasado
alternative label: Necrónimo
alternative label: Necronombre
broader: Anti-transgender discrimination
change note: Version 4.2.0
has top concept: LGBTQ+ discrimination
in scheme: v3
related: Misgendering
related: Outing (LGBTQ+ culture)
related: Slurs

LGBTQ+ deaf people
type: Concept
is replaced by: homoit0001866
issued: 2019-05-14
modified: 2023-06-30
replaces: LGBTQDeafPeople
alternative label: Deaf people (LGBTQ)
alternative label: LGBTQ auditive disabled people
alternative label: LGBTQ deaf
alternative label: LGBTQ deaf-mutes
alternative label: LGBTQ deaf people
change note: Version 4.2.0
in scheme: v3
narrower: Intersex Deaf people

Decriminalization
type: Concept
issued: 2019-05-14
modified: 2025-02-23
replaces: decriminalisation
comment: The process of lessening or removing criminal penalties for certain acts.
comment: El proceso de reducir o eliminar las sanciones penales por determinados actos.
broader: Criminal law
change note: Version 4.2.0
has top concept: Law
in scheme: v3
narrower: Decriminalization of sex work
preferred label: Despenalización
preferred label: Decriminalisation
related: LGBTQ+ civil rights
related: Criminalization

Hate speech
type: Concept
issued: 2019-05-14
modified: 2025-02-23
replaces: hateSpeech
comment: Any form of expression (written or verbal) with the intention to vilify, humiliate, or incite hatred against a individual or group of people on the basis of their actual or perceived race, religion, nationality, sexual identity, gender identity, or ability status.
comment: Cualquier forma de expresión (escrita o verbal) con la intención de vilipendiar, humillar o incitar al odio contra una persona o grupo de personas por su raza, religión, nacionalidad, identidad sexual, identidad de género o estado de capacidad real o percibido.
alternative label: Defamation against groups
alternative label: Group defamation
alternative label: Group libel
change note: Version 4.2.0
in scheme: v3
preferred label: Discurso de odio
related: Hate crimes
related: Intolerance towards LGBTQ+ people
related: LGBTQ+ defamation campaigns

Drag fathers
type: Concept
issued: 2019-05-14
modified: 2025-02-23
replaces: dragFathers
comment: More experienced drag kings who support less experienced drag kings as they enter the drag scene as performers.
comment: Drag kings con más experiencia que apoyan a drag kings con menos experiencia cuando ingresan a la escena drag como artistas.
broader: Drag families
change note: Version 4.2.0
has top concept: LGBTQ+ communities
in scheme: v3
preferred label: Padres drag
related: Drag kings
related: Drag mothers
related: Drag queens

Drag mothers
type: Concept
issued: 2019-05-14
modified: 2025-02-23
replaces: dragMothers
comment: More experienced drag queens who support less experienced drag queens as they enter the drag scene as performers.
comment: Drag queens con más experiencia que apoyan a drag queens con menos experiencia cuando ingresan a la escena drag como artistas.
broader: Drag families
change note: Version 4.2.0
has top concept: LGBTQ+ communities
in scheme: v3
preferred label: Madres drag
related: Drag fathers
related: Drag kings
related: Drag queens

Eonist people
type: Concept
issued: 2019-05-14
modified: 2025-02-23
replaces: eonistPeople
comment: Historical term for people assigned male at birth who adopt feminine behaviors.
comment: Término histórico para personas asignadas al sexo masculino al nacer que adoptan comportamientos femeninos.
alternative label: Eonistas
broader: LGBTQ+ historical terms
change note: Version 4.2.0
has top concept: LGBTQ+ historical terms
in scheme: v3
preferred label: Personas eonistas
related: Crossdressers
related: Eonism
related: Transgender people

Erectile dysfunction
type: Concept
issued: 2019-05-14
modified: 2025-02-23
replaces: erectileDysfunction
comment: Persistent difficulties in achieving or maintaining erections, typically for sexual activities.
comment: Dificultades persistentes para lograr o mantener erecciones, típicamente para actividades sexuales.
alternative label: Impotence
alternative label: Impotencia
broader: Sexual dysfunction
change note: Version 4.2.0
has top concept: Sexual dysfunction
in scheme: v3
preferred label: Disfunción eréctil
related: Erection pills
related: Erections
related: Vacuum pumps

Erection pills
type: Concept
issued: 2019-05-14
modified: 2025-02-23
replaces: erectionPills
comment: Medications used to relax muscles in the penis, increasing blood flow to allow for an erection in response to sexual stimuli.
comment: Medicamentos utilizados para relajar los músculos del pene, aumentando el flujo sanguíneo para permitir una erección en respuesta a los estímulos sexuales.
broader: Medication
change note: Version 4.2.0
has top concept: Medical care
in scheme: v3
preferred label: Pastillas para la erección
related: Erectile dysfunction
related: Erections
related: Chemsex

Erections
type: Concept
issued: 2019-05-14
modified: 2025-02-23
replaces: erections
comment: Enlargement of the erectile tissue of the penis or clitoris due to increased blood flow; typically associated with sexual arousal.
comment: Agrandamiento del tejido eréctil del pene o del clítoris debido al aumento del flujo sanguíneo; típicamente asociado con la excitación sexual.
change note: Version 4.2.0
in scheme: v3
preferred label: Erecciones
related: Erectile dysfunction
related: Erection pills
related: Penis

Estrogen
type: Concept
issued: 2019-05-14
modified: 2025-02-23
replaces: estrogen
comment: A category of steroid hormones including estrone, estradiol, estriol, and estetrol. Estrogens are commonly utilized in feminizing hormone therapy regimens. Estrogens are produced mainly in the ovaries, in addition to the adrenal glands and fat cells. Responsible for certain secondary sexual characteristics, including breast growth, thickening of the endometrium, menstrual cycle regulation, and sperm maturation.
comment: Una categoría de hormonas esteroides que incluye la estrona, estradiol, estriol y estetrol. Los estrógenos se utilizan comúnmente en regímenes de terapia hormonal feminizante. Los estrógenos se producen principalmente en los ovarios, además de las glándulas suprarrenales y las células grasas. Son responsables de ciertas características sexuales secundarias, incluido el crecimiento de los senos, el engrosamiento del endometrio, la regulación del ciclo menstrual y la maduración de los espermatozoides.
broader: Hormone therapy (Gender)
broader: Hormones
change note: Version 4.2.0
has top concept: Medical care
in scheme: v3
preferred label: Estrógeno
related: MtFs
related: Trans women

Faggots
type: Concept
issued: 2019-05-14
modified: 2025-02-23
replaces: faggots
comment: Slur used chiefly in North America to refer to gay men (or, in some cases, LGBTQ+ people in general). Some gay men have reclaimed this term and use it to describe themselves.
comment: Insulto utilizado principalmente en Norteamérica para referirse a hombres gay (o, en algunos casos, a personas LGBTQ+ en general). Algunos hombres gay han recuperado este término y lo utilizan para describirse a sí mismos.
alternative label: Fags
alternative label: Maricas
broader: LGBTQ+ historical terms
broader: Reclaimed terms
broader: Slurs
change note: Version 4.2.0
has top concept: LGBTQ+ historical terms
in scheme: v3
preferred label: Maricones
related: Gay men

Female genital mutilation
type: Concept
issued: 2019-05-14
modified: 2025-02-23
replaces: femaleGenitalMutilation
comment: The practice of cutting or removing the female genitals, sometimes to control sexual drive or punish lesbianism.
comment: Práctica que consiste en cortar o extirpar los genitales femeninos, a veces, para controlar el impulso sexual o castigar el lesbianismo.
change note: Version 4.2.0
in scheme: v3
narrower: Clitoridectomy
preferred label: Mutilación genital femenina
related: Sexual sterilization

Women's movement
type: Concept
issued: 2019-05-14
modified: 2025-02-23
replaces: womensMovement
comment: Social and political movement originating in the 1800s for reforms on women’s issues stemming from social, cultural, political, and economic inequality between men and women. Feminist issues include reproductive rights, women’s liberation, and equal pay. This term encompasses the women’s movement in its entirety, including different waves of feminist thought and activism.
comment: Movimiento social y político que se originó en el siglo XIX para reformar asuntos de las mujeres derivados de la desigualdad social, cultural, política y económica entre hombres y mujeres. Los asuntos feministas incluyen los derechos reproductivos, la liberación de la mujer y la igualdad salarial. Este término abarca el movimiento de mujeres en su totalidad, incluidas diferentes olas de pensamiento y activismo feminista.
alternative label: Feminist movement
alternative label: Movimiento feminista
broader: Social movements
change note: Version 4.2.0
has top concept: Social movements
in scheme: v3
preferred label: Movimiento de mujeres
related: Feminism
related: Lesbian movement
related: Gender equality

Fuck buddies
type: Concept
issued: 2019-05-14
modified: 2025-02-23
replaces: fuckBuddies
comment: Two friends who regularly have sex with one another but are not committed to a romantic relationship.
comment: Dos amigos que tienen relaciones sexuales regularmente pero que no están comprometidos en una relación romántica.
alternative label: Compañeros de sexo
alternative label: Compañeras de sexo
change note: Version 4.2.0
in scheme: v3
preferred label: Follamigos
related: LGBTQ+ lovers
related: Sexual identity
related: Sexual relationships

Gay characters
type: Concept
issued: 2019-05-14
modified: 2025-02-23
replaces: gayCharacters
comment: Characters in creative works who are gay men.
comment: Personajes de obras creativas que son hombres gay.
broader: LGBTQ+ characters
change note: Version 4.2.0
has top concept: LGBTQ+ characters
in scheme: v3
preferred label: Personajes gay
related: Gay boys
related: Gay men
related: Gay and lesbian youth

Gay parents
type: Concept
issued: 2019-05-14
modified: 2025-02-23
replaces: gayParents
comment: Gay men who are parents.
comment: Hombres gay que son miembros de religiones politeístas u otras religiones fuera de la cultura dominante que típicamente incorporan el culto a la naturaleza y/o lo sagrado femenino, como la Wicca, el druidismo, el paganismo, etc. Utilícese para describir a los hombres gay que se autoidentifiquen como paganos.
alternative label: Gay fathers
broader: Gay men
broader: LGBTQ+ parents
change note: Version 4.2.0
has top concept: LGBTQ+ people
in scheme: v3
preferred label: Paganos gay
related: Children of gay men
related: Gay families

Gay identity
type: Concept
issued: 2019-05-14
modified: 2025-02-23
replaces: gayIdentity
comment: Term used to describe the sexual identity of men and mascs who are sexually and/or romantically attracted to other men and mascs. Do not use as a broader term for LGBTQ+ people.
comment: Término utilizado para describir la identidad sexual de hombres y personas masc que se sienten atraídos sexual y/o románticamente a otros hombres y personas masc. No debe utilizarse como un término más amplio para las personas LGBTQ+.
broader: Sexual identity
change note: Version 4.2.0
has top concept: Sexual identity
in scheme: v3
preferred label: Identidad gay
related: Gay boys
related: Gay men
related: Gay and lesbian youth

Gay porn films
type: Concept
issued: 2019-05-14
modified: 2025-02-23
replaces: gayPornFilms
comment: Erotic or sexually explicit films featuring gay men.
comment: Películas eróticas o sexualmente explícitas protagonizadas por hombres gay.
broader: LGBTQ+ porn films
broader: Gay films
broader: Gay erotic art
change note: Version 4.2.0
has top concept: Subcultures
in scheme: v3
preferred label: Películas pornográficas gay
related: Gay erotic films

Gay relationships
type: Concept
issued: 2019-05-14
modified: 2025-02-23
replaces: gayRelationships
comment: Ongoing connections (romantic, sexual, or platonic) between two or more gay men.
comment: Conexiones continuas (románticas, sexuales o platónicas) entre dos o más hombres gay.
broader: Relationship satisfaction
change note: Version 4.2.0
has top concept: Relationship satisfaction
in scheme: v3
preferred label: Relaciones gay
related: Bisexual relationships
related: Queer relationships
related: Transgender relationships

LGBTQ+-affirming religious groups
type: Concept
is replaced by: homoit0000530
issued: 2019-05-14
modified: 2026-02-23
modified: 2022-08-22
modified: 2022-08-15
replaces: gayReligiousGroups
replaces: lesbianReligiousGroups
replaces: metropolitanCommunityChurch
comment: Groups of people united by a religion or religious practices that are accepting and supportive of LGBTQ+ people and their identities. Includes large-scale organized groups, such as denominations or sects, as well as small-scale groups, such as specific churches, mosques, temples, or congregations.
comment: Grupos de personas unidas por una religión o prácticas religiosas que aceptan y apoyan a las personas LGBTQ+ y sus identidades. Incluye a grupos organizados a gran escala, como denominaciones o sectas, así como grupos de pequeña escala, como iglesias, mezquitas, templos o congregaciones específicas.
comment: Christian church founded in 1968 by Troy Perry as a welcoming spiritual gathering place for LGBT Christians; MCC is now an international denomination
alternative label: Gay religious groups
preferred label: Lesbian religious groups
alternative label: LGBTQ+ affirming religious groups
alternative label: LGBTQ+ inclusive religious groups
alternative label: LGBTQ+-inclusive religious groups
alternative label: MCC
broader: Lesbian movement
change note: Version 4.2.0
has top concept: Social movements
in scheme: v3
preferred label: Grupos religiosos que afirman las identidades LGBTQ+
preferred label: Metropolitan Community Church
related: LGBTQ+-affirming religious services
related: Religious views on LGBTQ+ people
related: LGBTQ+ Protestants

Gay theater
type: Concept
issued: 2019-05-14
modified: 2025-02-23
replaces: gayTheatre
comment: Works in the performance arts that focus on gay characters, communities, or issues.
comment: Trabajos en las artes escénicas que se centran en personajes, comunidades o temas gay.
broader: LGBTQ+ theater
change note: Version 4.2.0
has top concept: LGBTQ+ theater
in scheme: v3
preferred label: Teatro gay
preferred label: Gay theatre
related: Gay theater groups
related: Lesbian theater
related: LGBTQ+ plays

Gay theater groups
type: Concept
issued: 2019-05-14
modified: 2025-02-23
replaces: gayTheatreGroups
comment: Groups of theatrical performers comprised of gay men; may focus on performing works written by gay men or about gay issues.
comment: Grupos de artistas teatrales compuestos por hombres gay; pueden centrarse en la interpretación de obras escritas por hombres gay o sobre temas gay.
change note: Version 4.2.0
in scheme: v3
preferred label: Grupos de teatro gay
preferred label: Gay theatre groups
related: Gay theater
related: Lesbian theater groups
related: LGBTQ+ musicals

Gender identity disorder
type: Concept
issued: 2019-05-14
modified: 2025-02-23
replaces: genderIdentityDisorder
comment: An obsolete psychological diagnosis that medicalizes trans identities and practices; only use in historical contexts.
comment: Un diagnóstico psicológico obsoleto que medicaliza las identidades y prácticas trans; utilícese únicamente en contextos históricos.
broader: Medicalization
change note: Version 4.2.0
has top concept: Medical care
in scheme: v3
preferred label: Trastorno de identidad de género
related: Gender dysphoria
related: Transgender people
related: Transsexual people

Gender non-conforming people
type: Concept
issued: 2019-05-14
modified: 2025-02-23
replaces: genderNonConformingPeople
comment: People who identify outside, transgress, or do not conform to a given culture's gender roles or expectations. Only use in reference to people who self-identity as gender non-conforming. Do not use to describe cisgender people whose dress or behaviors do not conform to gender roles or expectations.
comment: Personas que se autoidentifican fuera de, transgreden o no se conforman con los roles o expectativas de género de una determinada cultura. Utilícese únicamente en referencia a personas que se autoidentifiquen como no conformes con su género. No se debe utilizar para describir a personas cisgénero cuya vestimenta o comportamiento no se conforma a los roles o expectativas de género.
alternative label: Personas de género no conforme
broader: Gender minorities
change note: Version 4.2.0
has top concept: Gender minorities
in scheme: v3
preferred label: Personas de género no conformistas
related: Transgender people
related: Gender creative
related: Gender non-conforming identity

Gender segregation
type: Concept
issued: 2019-05-14
modified: 2025-02-23
replaces: genderSegregation
comment: Physical, legal, cultural, or rhetorical separation of people according to their gender.
comment: Separación física, jurídica, cultural o retórica de las personas según su género.
change note: Version 4.2.0
in scheme: v3
preferred label: Segregación por género
related: Gender
related: Gender binaries
related: Gender relations

Gendercide
type: Concept
issued: 2019-05-14
modified: 2025-02-23
replaces: gendercide
comment: The systematic killing of members of a specific gender for their gender.
comment: El asesinato sistemático de miembros de un género específico debido a su género.
change note: Version 4.2.0
in scheme: v3
preferred label: Generocidio
related: Gender
related: Gender identity
related: LGBTQ+ persecutions

Genderfuck
type: Concept
issued: 2019-05-14
modified: 2025-02-23
replaces: genderfuck
comment: A form of gender expression that seeks to subvert the gender binary or gender roles by mixing and messing with (or "fucking with") traditionally masculine and feminine components. Typically used to describe gender practices and presentation, though some people identify as "genderfuck" or as "genderfuckers." Only use to describe people and the practices of people who self-identify with genderfuck.
comment: Una forma de expresión de género que busca subvertir el binario de género o los roles de género mezclando y jugando (o "jodiendo") con componentes tradicionalmente masculinos y femeninos. Normalmente se utiliza para describir prácticas y presentaciones de género, aunque algunas personas se identifican como "genderfuck" o "genderfuckers". Utilícese únicamente para describir a las personas y las prácticas de las personas que se autoidentifiquen con genderfuck.
change note: Version 4.2.0
in scheme: v3
related: Gender expression
related: Gender transgression
related: Gender minorities

Getting laid
type: Concept
issued: 2019-05-14
modified: 2025-02-23
replaces: gettingLaid
comment: Slang term for the act of having sex, typically with another person.
comment: Término de la jerga para referirse al acto de tener relaciones sexuales, normalmente con otra persona.
alternative label: Echar un polvo
alternative label: follar
alternative label: chingar
alternative label: chichar
alternative label: coger
alternative label: singar
alternative label: cachar
broader: Sex (Act)
broader: Sexual practices
change note: Version 4.2.0
has top concept: Sex (Act)
in scheme: v3
preferred label: Acostarse (con alguien)
related: Fucking
related: Sexual intercourse

Gonads
type: Concept
issued: 2019-05-14
modified: 2025-02-23
replaces: gonads
comment: A general term used to describe testes, ovaries, or ovotestes.
comment: Término general utilizado para describir los testículos, los ovarios o los ovotestículos.
broader: Sex (Body)
change note: Version 4.2.0
has top concept: Sex (Body)
in scheme: v3
narrower: Testicle
narrower: Streak gonads
preferred label: Gónadas
related: Sex assigned at birth

Heterosexual men
type: Concept
issued: 2019-05-14
modified: 2025-02-23
replaces: heterosexualMen
comment: Men who identify as heterosexual, or straight.
comment: Hombres que se autoidentifican como heterosexuales.
alternative label: Straight men
alternative label: Hombres hétero
broader: Heterosexuals
broader: Males
change note: Version 4.2.0
has top concept: Heterosexuals
in scheme: v3
narrower: Dutch boys
narrower: Fag stags
preferred label: Hombres heterosexuales

Heterosexual women
type: Concept
issued: 2019-05-14
modified: 2025-02-23
replaces: heterosexualWomen
comment: Women who identify as heterosexual, or straight.
comment: Mujeres que se autoidentifican como heterosexuales.
alternative label: Straight women
alternative label: Mujeres hétero
broader: Heterosexuals
broader: Females
change note: Version 4.2.0
has top concept: Heterosexuals
in scheme: v3
narrower: Fag hags
narrower: Goldilocks (Gay culture)
preferred label: Mujeres heterosexuales

HIV-undetectable people
type: Concept
issued: 2019-05-14
modified: 2025-02-23
replaces: HIVUndetectablePeople
comment: People who have contracted HIV and received treatment to reduce their HIV antibodies to an amount that can no longer be detected by standard HIV tests.
comment: Personas que contrajeron el VIH y recibieron tratamiento para reducir sus anticuerpos contra el VIH a una cantidad que no se puede detectar mediante pruebas estándar de VIH.
broader: HIV-positive people
change note: Version 4.2.0
has top concept: HIV-positive people
in scheme: v3
preferred label: Personas con VIH indetectable
related: HIV/AIDS
related: HIV-negative people
related: Serostatus

Homonationalism
type: Concept
issued: 2019-05-14
modified: 2025-02-23
replaces: homonationalism
comment: Favorable association between a nationalist ideology and LGBTQ+ people or their rights.
comment: Asociación favorable entre una ideología nacionalista y las personas LGBTQ+ o sus derechos.
change note: Version 4.2.0
in scheme: v3
preferred label: Homonacionalismo
related: Intolerance towards LGBTQ+ people
related: Pinkwashing
related: Social norms

Homosexuals
type: Concept
issued: 2019-05-14
modified: 2025-02-23
replaces: homosexuals
comment: Outdated term for lesbians and gay men.
comment: Término obsoleto para lesbianas y hombres gay.
broader: LGBTQ+ historical terms
change note: Version 4.2.0
has top concept: LGBTQ+ historical terms
in scheme: v3
preferred label: Homosexuales
related: Sexual minorities
related: Allosexuality
related: Monosexual people

Machismo
type: Concept
issued: 2019-05-14
modified: 2025-02-23
replaces: machismo
comment: Term originating in the early 1930s and 40s to describe a man's responsibility and pride in providing for, protecting, and defending his family. It is unclear whether the term originates in Spain or Portugal. Though there are positive sides of machismo and it remains an important part of Iberian and Latin American cultures, the concept has also been criticized for its perceived role in perpetuating misogyny, harmful gender roles, and domestic and sexual violence.
comment: Término que se originó a principios de los años 1930 y 1940 para describir la responsabilidad y el orgullo de un hombre por mantener, proteger y defender a su familia. No está claro si el término se origina en España o Portugal. Aunque el machismo tiene aspectos positivos y sigue siendo una parte importante de las culturas ibéricas y latinoamericanas, el concepto también ha sido criticado por su papel percibido en la perpetuación de la misoginia, los roles de género dañinos y la violencia doméstica y sexual.
broader: Gender roles
change note: Version 4.2.0
has top concept: Role behavior
in scheme: v3
related: Macho men
related: Masculinities
related: Toxic masculinity

In vitro fertilization
type: Concept
issued: 2019-05-14
modified: 2025-02-23
replaces: inVitroFertilisation
comment: Medical practice of achieving fertilization by combining sperm and eggs in laboratory settings to induce pregnancy.
comment: Práctica médica para lograr la fertilización mediante la combinación de espermatozoides y óvulos en entornos de laboratorio para inducir el embarazo.
alternative label: IVF
alternative label: IVF ||
broader: Conception by LGBTQ+ people
broader: Assisted reproduction
change note: Version 4.2.0
has top concept: LGBTQ+ family planning
in scheme: v3
narrower: Reciprocal in vitro fertilization
preferred label: Fertilización in vitro
preferred label: In vitro fertilisation
related: Test tube babies

LGBTQ+ online dating
type: Concept
issued: 2019-05-14
modified: 2025-04-01
replaces: onlineDating
comment: Term used to describe the practice of LGBTQ+ people utilizing online websites, applications, or forums to meet romantic or sexual partners.
comment: Utilizar sitios web, aplicaciones o foros en línea para conocer parejas románticas o sexuales.
alternative label: Online dating (LGBTQ)
alternative label: LGBTQ+ internet dating
alternative label: Internet dating (LGBTQ)
alternative label: Ligar por internet
alternative label: Salir en citas online
alternative label: Salir en citas por interner
alternative label: Citas en línea
alternative label: Citas por internet
alternative label: Salir por interent
broader: LGBTQ+ dating
change note: Version 4.2.0
has top concept: Relationship satisfaction
in scheme: v3
preferred label: Citas online
related: Dating applications
related: LGBTQ+ dating websites

Intersex children
type: Concept
issued: 2019-05-14
modified: 2025-02-23
replaces: intersexChildren
comment: Children younger than 18 years who describe themselves as intersex.
comment: Niños menores de 18 años que se autoidentifican como intersex.
broader: LGBTQ+ children
broader: Intersex people
broader: Intersex youth
change note: Version 4.2.0
has top concept: Family members
in scheme: v3
preferred label: Niños intersex
related: Sex assigned at birth

Intersex rights
type: Concept
issued: 2019-05-14
modified: 2025-02-23
replaces: intersexRights
comment: Legal, social, or ethical principles of freedom or entitlement held by intersex people. Often used to refer to intersex people's right to bodily autonomy and, specifically, their right to delay or decline unnecessary medical interventions.
comment: Principios legales, sociales o éticos de libertad o derechos que tienen las personas intersex. A menudo, se utiliza para referirse al derecho de las personas intersex a la autonomía corporal y, específicamente, a su derecho a retrasar o rechazar intervenciones médicas innecesarias.
broader: Human rights
change note: Version 4.2.0
has top concept: Human rights
in scheme: v3
preferred label: Derechos intersex
related: LGBTQ+ civil rights
related: Intersex people
related: Intersex genital mutilation

Intersex youth
type: Concept
issued: 2019-05-14
modified: 2025-02-23
replaces: intersexYouth
comment: Intersex people between the age of childhood and adulthood.
comment: Personas intersex entre la edad de la niñez y la edad adulta.
alternative label: Intersex adolescents
alternative label: Intersex teenagers
alternative label: Intersex teens
alternative label: Adolescentes intersex
alternative label: Jóvenes intersex
broader: Intersex people
broader: Youth
change note: Version 4.2.0
has top concept: LGBTQ+ people
in scheme: v3
narrower: Intersex children
preferred label: Juventud intersex
related: LGBTQ+ youth

Inverts
type: Concept
issued: 2019-05-14
modified: 2025-02-23
replaces: inverts
comment: Outdated, historical term used for LGBTQ+ people.
comment: Término anticuado e histórico utilizado para las personas LGBTQ+.
alternative label: Sexual inverts
alternative label: Invertida
alternative label: Invertido sexual
broader: LGBTQ+ historical terms
change note: Version 4.2.0
has top concept: LGBTQ+ historical terms
in scheme: v3
preferred label: Invertidos
related: Sexual inversion
related: Sexual minorities
related: Uranism

Kaposi's sarcoma
type: Concept
issued: 2019-05-14
modified: 2025-02-23
replaces: kaposisSarcoma
comment: A type of cancer that causes lesions to grow in the skin, lymph nodes, internal organs, and mucous membranes; often affects people with immune deficiencies, such as AIDS.
comment: Tipo de cáncer que provoca lesiones en la piel, los ganglios linfáticos, los órganos internos y las mucosas; suele afectar a personas con deficiencias inmunitarias, como el SIDA.
change note: Version 4.2.0
in scheme: v3
preferred label: Sarcoma de Kaposi
related: HIV/AIDS
related: ARC (AIDS-Related Complex)
related: GRID (Gay-Related Immune Deficiency)

Katoey
type: Concept
issued: 2019-05-14
modified: 2025-02-23
replaces: katoey
comment: In Thailand, this term refers to a range of people of non-normative gender expressions, including intersex people, transgender women, and effeminate gay men. Some regard this term as outdated and offensive, while others self-identify with it. Only use to describe people who self-identify as katoey.
comment: En Tailandia, este término se refiere a un espectro de personas con expresiones de género no normativas, incluyendo a personas intersex, mujeres transgénero y hombres gay afeminados. Algunas personas consideran este término como anticuado y ofensivo, mientras que otras se autoidentifican con él. Utilícese únicamente para describir a las personas que se autoidentifiquen como katoey.
alternative label: Ladyboy
alternative label: Kathoey
broader: Non-Euro-American gender and sexual identities
broader: Sexual minorities
change note: Version 4.2.0
has top concept: Gender
in scheme: v3
related: Dee
related: Tom

Kissing
type: Concept
issued: 2019-05-14
modified: 2025-02-23
replaces: kissing
comment: Touching or pressing one's lips to another person or an object to communicate a greeting, affection, reverence, love, or sexual desire.
comment: Tocar o presionar los labios contra otra persona o un objeto para comunicar un saludo, afecto, reverencia, amor o deseo sexual.
alternative label: Besarse
broader: Oral sex
broader: Physical affection
broader: Sex (Act)
broader: Sexual practices
change note: Version 4.2.0
has top concept: Sex (Act)
in scheme: v3
preferred label: Besar

Khteuy
type: Concept
issued: 2019-05-14
modified: 2025-02-23
replaces: kteuy
comment: Khmer term for third sex people. Can be considered outdated and offensive.
comment: Término del khmer para personas del tercer sexo. Puede ser considerado anticuado y ofensivo.
alternative label: Kteuy
broader: Non-Euro-American gender and sexual identities
broader: Slurs
change note: Version 4.2.0
has top concept: Gender
in scheme: v3
related: Sak veng
related: Srey sros

Lesbian bars
type: Concept
issued: 2019-05-14
modified: 2025-02-23
replaces: lesbianBars
comment: Drinking establishments that primarily cater to lesbians.
comment: Establecimientos de bebidas que atienden principalmente a lesbianas.
broader: LGBTQ+ bars
change note: Version 4.2.0
has top concept: LGBTQ+ meeting places
in scheme: v3
narrower: Dyke bars
preferred label: Bares lésbicos
related: Lesbian community
related: LGBTQ+ pubs

Lesbian dominatrices
type: Concept
issued: 2019-05-14
modified: 2025-02-23
replaces: lesbianDominatrices
comment: Women who take a dominant role in BDSM activities; use for dominatrices who identify as lesbians.
comment: Mujeres que desempeñan un papel dominante en las actividades de BDSM; utilícese para dominatrices que se autoidentifiquen como lesbianas.
broader: LGBTQ+ dominatrices
change note: Version 4.2.0
has top concept: Relationship minorities
in scheme: v3
preferred label: Dominatrices lesbianas
related: Bisexual dominatrices
related: Queer dominatrices
related: Transgender dominatrices

Lesbian feminism
type: Concept
issued: 2019-05-14
modified: 2025-02-23
replaces: lesbianFeminism
comment: A cultural movement and critical perspective that arose in the 1970s and 1980s primarily in North America and Western Europe as a result of dissatisfaction with the women's liberation movement and the gay liberation movement. Lesbian feminism encourages women to focus their efforts, activities, and relationships toward other women rather than men, often advocating for lesbianism as the logical result of feminism.
comment: Un movimiento cultural y una perspectiva crítica que surgió en las décadas de 1970 y 1980, principalmente en Norteamérica y Europa Occidental, como resultado de la insatisfacción con el movimiento de liberación de la mujer y el movimiento de liberación gay. El feminismo lésbico anima a las mujeres a centrar sus esfuerzos, actividades y relaciones en otras mujeres en lugar de en los hombres, a menudo, defendiendo el lesbianismo como el resultado lógico del feminismo.
broader: Feminism
change note: Version 4.2.0
has top concept: Feminism
in scheme: v3
preferred label: Feminismo lésbico
related: Heterosexual feminism
related: Lesbian movement
related: Lesbian feminists

Lesbian girls
type: Concept
issued: 2019-05-14
modified: 2025-02-23
replaces: lesbianGirls
comment: Girls (typically children younger than 18) who are lesbians.
comment: Niñas (normalmente menores de 18 años) que son lesbianas.
broader: Girls
broader: Lesbian youth
change note: Version 4.2.0
has top concept: Family members
in scheme: v3
preferred label: Niñas lesbianas
related: Lesbian children

Lesbian mistresses (BDSM culture)
type: Concept
issued: 2019-05-14
modified: 2026-02-24
replaces: lesbianMistresses
comment: Lesbians who are part of the BDSM scene and assume the mistress role in sexual relationships with a mistress/submissive dynamic.
comment: Lesbianas que forman parte de la escena BDSM y asumen el rol de ama en las relaciones sexuales con una dinámica ama/esclava.
alternative label: Lesbianas amas
broader: LGBTQ+ mistresses (BDSM culture)
change note: Version 4.2.0
has top concept: Sexual identity
in scheme: v3
preferred label: Amas lesbianas
related: Bisexual mistresses (BDSM culture)
related: Queer mistresses (BDSM culture)
related: Transgender mistresses (BDSM culture)

Lesbian parents
type: Concept
issued: 2019-05-14
modified: 2025-02-23
replaces: lesbianParents
comment: Lesbians who are parents.
comment: Lesbianas que son padres.
broader: LGBTQ+ parents
change note: Version 4.2.0
has top concept: LGBTQ+ families
in scheme: v3
preferred label: Padres lesbianos
related: Children of lesbians
related: Mothers
related: LGBTQ+ children of LGBTQ+ parents

Lesbian porn films
type: Concept
issued: 2019-05-14
modified: 2025-02-23
replaces: lesbianPornFilms
comment: Erotic or sexually explicit films featuring lesbians.
comment: Películas eróticas o sexualmente explícitas protagonizadas por lesbianas.
alternative label: Películas pornografícas lésbicas
broader: LGBTQ+ porn films
broader: Lesbian films
broader: Lesbian erotic art
change note: Version 4.2.0
has top concept: Subcultures
in scheme: v3
preferred label: Películas porno lésbicas
related: Lesbian erotic films

Lesbian relationships
type: Concept
issued: 2019-05-14
modified: 2025-02-23
replaces: lesbianRelationships
comment: Ongoing connections (romantic, sexual, or platonic) between two or more lesbians.
comment: Conexiones continuas (románticas, sexuales o platónicas) entre dos o más lesbianas.
broader: Relationship satisfaction
change note: Version 4.2.0
has top concept: Relationship satisfaction
in scheme: v3
preferred label: Relaciones lésbicas
related: Bisexual relationships
related: Queer relationships
related: Transgender relationships

Lesbian slang
type: Concept
issued: 2019-05-14
modified: 2025-02-23
replaces: lesbianSlang
comment: Colloquial or informal language related to lesbians or used by lesbians.
comment: Lenguaje coloquial o informal relacionado con lesbianas o utilizado por lesbianas.
broader: Lesbian culture
broader: LGBTQ+ slang
change note: Version 4.2.0
has top concept: Subcultures
in scheme: v3
preferred label: Jerga lésbica
related: Bois
related: Cookie dusters

Lesbian theater
type: Concept
issued: 2019-05-14
modified: 2025-02-23
replaces: lesbianTheatre
comment: Works in the performance arts that focus on lesbian characters, lesbian communities, or lesbian issues.
comment: Obras en las artes escénicas que se centran en personajes lésbicos, comunidades lésbicas o cuestiones lésbicas.
broader: LGBTQ+ theater
change note: Version 4.2.0
has top concept: LGBTQ+ theater
in scheme: v3
preferred label: Teatro lésbico
preferred label: Lesbian theatre
related: Gay theater
related: Lesbian theater groups
related: LGBTQ+ plays

Lesbian theater groups
type: Concept
issued: 2019-05-14
modified: 2025-02-23
replaces: lesbianTheatreGroups
comment: Groups of theatrical performers comprised of lesbians; may focus on performing works by lesbians or about lesbian issues.
comment: Grupos de artistas teatrales compuestos por lesbianas; pueden centrarse en la interpretación de obras de lesbianas o sobre cuestiones lésbicas.
change note: Version 4.2.0
in scheme: v3
preferred label: Grupos de teatro lésbicos
preferred label: Lesbian theatre groups
related: Gay theater groups
related: Lesbian theater
related: LGBTQ+ musicals

Blogs
type: Concept
issued: 2019-05-14
modified: 2025-07-16
modified: 2025-03-20
replaces: blogs
replaces: LGBTQBlogs
comment: Websites or webpages, typically run by individuals or small groups, that are written in an informal or conversational style.
comment: Sitios web o páginas web, generalmente administradas por individuos o grupos pequeños, escritas en un estilo informal o conversacional.
comment: Websites featuring informal, often personal writing and reflections created by LGBTQ+ people or about LGBTQ+ communities and issues.
comment: Sitios web que presentan escritos y reflexiones informales, a menudo personales, creados por personas LGBTQ+ o sobre comunidades y cuestiones LGBTQ+.
alternative label: LGBTQ blogs
alternative label: Blogs LGBTQ
broader: Social media
broader: LGBTQ+ social media
change note: Version 4.2.0
has top concept: Social media
has top concept: LGBTQ+ social media
in scheme: v3
narrower: LGBTQ+ vlogs
preferred label: LGBTQ+ blogs
preferred label: Blogs LGBTQ+

LGBTQ+ book censorship
type: Concept
issued: 2019-05-14
modified: 2025-02-23
replaces: LGBTQBookCensorship
comment: The suppression or prohibition of written texts by LGBTQ+ authors and/or about LGBTQ+ issues due to religious, moral, political, and/or social objections.
comment: La supresión o prohibición de textos escritos de autores LGBTQ+ y/o sobre temas LGBTQ+ por objeciones religiosas, morales, políticas y/o sociales.
alternative label: LGBTQ book censorship
alternative label: Censura de libros LGBTQ
broader: LGBTQ+ censorship
change note: Version 4.2.0
has top concept: Censorship
in scheme: v3
preferred label: Censura de libros LGBTQ+
related: LGBTQ+ books
related: LGBTQ+ challenged books
related: LGBTQ+ information professionals

LGBTQ+ cartoons
type: Concept
issued: 2019-05-14
modified: 2025-03-13
replaces: LGBTQCartoons
comment: Satirical drawings created by LGBTQ+ cartoonists or that depict someone or something relating to LGBTQ+ culture.
comment: Dibujos satíricos creados por caricaturistas LGBTQ+ o que representan a alguien o algo relacionado con la cultura LGBTQ+.
alternative label: LGBTQ cartoons
alternative label: Caricaturas LGBTQ
broader: LGBTQ+ comics
change note: Version 4.2.0
has top concept: Subcultures
in scheme: v3
preferred label: Caricaturas LGBTQ+
related: Anime and manga fandom
related: Hentai
related: LGBTQ+ cartoonists

LGBTQ+ censorship
type: Concept
issued: 2019-05-14
modified: 2025-02-23
replaces: LGBTQCensorship
comment: Suppression or prohibition of the discussion, education, or circulation of information related to LGBTQ+ people and identities in media, schools, and/or in the general public.
comment: Supresión o prohibición de la discusión, la educación o la circulación de información relacionada con personas e identidades LGBTQ+ en los medios, escuelas y/o en el público en general.
alternative label: LGBTQ censorship
alternative label: Censura LGBTQ
broader: Censorship
change note: Version 4.2.0
has top concept: Censorship
in scheme: v3
narrower: LGBTQ+ art censorship
narrower: LGBTQ+ book censorship
narrower: LGBTQ+ film censorship
preferred label: Censura LGBTQ+

LGBTQ+ co-parents
type: Concept
issued: 2019-05-14
modified: 2025-02-23
replaces: LGBTQCoParents
comment: Co-parenting people who are LGBTQ+ people. They may or may not be partners.
comment: La coparentalidad de personas que son personas LGBTQ+. Pueden o no ser pareja.
alternative label: LGBTQ co-parents
alternative label: Co-padres LGBTQ+
alternative label: Co-madres LGBTQ+
broader: LGBTQ+ parents
change note: Version 4.2.0
has top concept: LGBTQ+ families
in scheme: v3
narrower: LGBTQ+ co-fathers
narrower: LGBTQ+ co-mothers
preferred label: Co-madres y co-padres LGBTQ+
related: LGBTQ+ co-parenthood

LGBTQ+ death notices
type: Concept
issued: 2019-05-14
modified: 2025-02-23
replaces: LGBTQDeathNotices
comment: Public announcements in periodicals, online information centers, or social media about the death of an LGBTQ+ person, typically including details about funerals and memorial services.
comment: Anuncios públicos en publicaciones periódicas, centros de información en línea o redes sociales sobre la muerte de una persona LGBTQ+, que generalmente incluyen detalles sobre funerales y servicios conmemorativos.
alternative label: LGBTQ death announcements
alternative label: LGBTQ death notices
alternative label: Avisos de muerte LGBTQ ||
change note: Version 4.2.0
in scheme: v3
preferred label: Obituarios LGBTQ+
related: LGBTQ+ death and dying
related: LGBTQ+ obituaries
related: AIDS death and dying

LGBTQ+ foster parents
type: Concept
issued: 2019-05-14
modified: 2025-02-23
replaces: LGBTQFosterParents
comment: Foster parents who are LGBTQ+ people.
comment: Padres y/o madres adoptivos que sean personas LGBTQ+.
alternative label: LGBTQ foster parents
alternative label: Madres de acogida LGBTQ+
alternative label: Padres de acogida LGBTQ+
broader: LGBTQ+ families
broader: LGBTQ+ foster families
broader: LGBTQ+ parents
change note: Version 4.2.0
has top concept: LGBTQ+ families
in scheme: v3
preferred label: Madres y padres de acogida LGBTQ+
related: LGBTQ+ adoptive parents

LGBTQ+ hotels
type: Concept
issued: 2019-05-14
modified: 2025-02-23
replaces: LGBTQHotels
comment: Establishments providing accommodations, meals, and other services for travelers; use in reference to hotels catering to LGBTQ+ people or commonly used by LGBTQ+ people.
comment: Establecimientos que brindan alojamiento, comidas y otros servicios a viajeros; utilícese en referencia a hoteles que atienden a personas LGBTQ+ o que son comúnmente utilizados por personas LGBTQ+.
alternative label: LGBTQ hotels
alternative label: Hoteles LGBTQ
change note: Version 4.2.0
in scheme: v3
narrower: LGBTQ+ resorts
preferred label: Hoteles LGBTQ+
related: LGBTQ+ tourism

LGBTQ+ incarcerated people
type: Concept
issued: 2019-05-14
modified: 2025-04-17
replaces: LGBTQPrisoners
comment: LGBTQ+ people whose liberty is restrained against their will, with or without legal process, whether by a government authority, institution, or extrajudicial actors. Generally, this refers to individuals subject to physical and/or legal confinement within a jail, prison, detention center, etc. It may also include LGBTQ+ people forcibly confined within hospitals and other healthcare facilities.
comment: Personas LGBTQ+ que son privadas de su libertad contra su voluntad por una institución o autoridad. Normalmente se utiliza para describir a personas condenadas a confinamiento en una prisión pública o privada por un tribunal dentro de un sistema penal, pero también puede incluir a personas confinadas por la fuerza en hospitales y otras instituciones.
alternative label: Prisoners (LGBTQ)
alternative label: LGBTQ+ inmates
alternative label: LGBTQ+ prisoners
alternative label: Incarcerated people (LGBTQ)
alternative label: Incarcerated LGBTQ+ people
alternative label: LGBTQ+ imprisoned people
alternative label: Imprisoned people (LGBTQ)
alternative label: Imprisoned LGBTQ+ people
alternative label: Prisioneros (LGBTQ)
broader: LGBTQ+ people
change note: Version 4.2.0
has top concept: LGBTQ+ people
in scheme: v3
narrower: LGBTQ+ prisoners of conscience
preferred label: Prisioneros LGBTQ+
related: Detention of LGBTQ+ people
related: LGBTQ+ incarceration

Internet forums
type: Concept
issued: 2019-05-14
modified: 2025-07-16
modified: 2025-03-20
replaces: internetForums
replaces: LGBTQInternetForums
comment: Websites designed to facilitate discussion amongst users through posted messages.
comment: Sitios web diseñados para facilitar el debate entre los usuarios a través de mensajes publicados.
comment: Websites that facilitate online conversations between LGBTQ+ people, often about LGBQ+ issues.
comment: Sitios web que facilitan conversaciones en línea entre personas LGBTQ+, a menudo sobre temas LGBTQ+.
alternative label: LGBTQ Internet forums
broader: Social media
broader: LGBTQ+ social media
change note: Version 4.2.0
has top concept: Social media
has top concept: LGBTQ+ social media
in scheme: v3
preferred label: Foros de internet
preferred label: LGBTQ+ Internet forums
preferred label: Foros de internet LGBTQ+
related: LGBTQ+ websites

Takatāpui
type: Concept
issued: 2019-05-14
modified: 2025-02-23
replaces: takatapui
comment: Term used by the Māori people, or people who are part of the Indigenous Polynesian people of mainland Aotearoa (New Zealand), that was historically used to describe an "intimate companion of the same sex." In the 1980s, the term was reclaimed for use by lesbian, gay, bisexual, transgender, queer, intersex people, and other members of Rainbow communities. Only use to refer to individuals who identify as Takatāpui.
comment: Término utilizado por el pueblo maorí, o personas que forman parte del pueblo indígena polinesio de la parte continental de Aotearoa (Nueva Zelanda), que históricamente se utilizó para describir a un "compañero íntimo del mismo sexo". En la década de 1980, el término fue reclamado para ser utilizado por personas lesbianas, gay, bisexuales, transgénero, queer, intersex y otros miembros de las comunidades arcoíris. Utilícese únicamente para referirse a personas que se identifiquen como takatāpui.
alternative label: LGBTQ+ Māori people
alternative label: Māori (LGBTQ)
alternative label: Māori LGBTQ+ people
alternative label: Personas LGBTQ+ Maori
alternative label: Personas LGBTQ+ Māori
broader: Non-Euro-American gender and sexual identities
broader: Indigenous LGBTQ+ people
broader: Sexual minorities
change note: Version 4.2.0
has top concept: Gender
in scheme: v3
related: Indigiqueer

LGBTQ+ motherhood
type: Concept
issued: 2019-05-14
modified: 2025-02-23
replaces: LGBTQMotherhood
comment: Motherhood experiences, as experienced by LGBTQ+ people.
comment: Experiencias de maternidad, tal como las viven las personas LGBTQ+.
alternative label: LGBTQ motherhood
alternative label: Maternity (LGBTQ)
alternative label: Motherhood (LGBTQ)
alternative label: LGBTQ+ maternity
alternative label: Maternidad LGBTQ
alternative label: Maternidad (LGBTQ)
broader: LGBTQ+ adoptive families
broader: LGBTQ+ parenthood
change note: Version 4.2.0
has top concept: LGBTQ+ families
in scheme: v3
preferred label: Maternidad LGBTQ+
related: Motherhood
related: Mothers

LGBTQ+ motorcycle clubs
type: Concept
issued: 2019-05-14
modified: 2025-02-23
replaces: LGBTQMotorcycleClubs
comment: Organized groups of LGBTQ+ people formed around shared interest in and activities related to motorcycles.
comment: Grupos organizados de personas LGBTQ+ que se forman en torno a intereses compartidos y actividades relacionadas con las motocicletas.
alternative label: LGBTQ motorcycle clubs
alternative label: Moto Clubs LGBTQ+
alternative label: Clubs de Moteros LGBTQ+
alternative label: Clubs de motoreros LGBTQ+
broader: LGBTQ+ clubs and organizations
change note: Version 4.2.0
has top concept: LGBTQ+ clubs and organizations
in scheme: v3
preferred label: Clubs de Motociclistas LGBTQ+
related: Dykes on bikes
related: Leather community
related: Leather and kink clubs

LGBTQ+ obituaries
type: Concept
issued: 2019-05-14
modified: 2025-02-23
replaces: LGBTQObituaries
comment: Public notices published shortly after an LGBTQ+ person's death to inform others of their passing and celebrate their life.
comment: Avisos públicos publicados poco después de la muerte de una persona LGBTQ+ para informar a otras personas sobre su fallecimiento y celebrar su vida.
alternative label: LGBTQ obituaries
broader: LGBTQ+ newspapers
change note: Version 4.2.0
has top concept: LGBTQ+ press
in scheme: v3
preferred label: Obituarios LGBTQ+
related: LGBTQ+ death and dying
related: LGBTQ+ death notices
related: AIDS death and dying

LGBTQ+ porn magazines
type: Concept
issued: 2019-05-14
modified: 2025-02-23
replaces: LGBTQPornMagazines
comment: Erotic or sexually explicit magazines featuring LGBTQ+ people.
comment: Revistas eróticas o sexualmente explícitas protagonizadas por personas LGBTQ+.
alternative label: LGBTQ porn magazines
alternative label: Revistas pornográficas (LGBTQ)
alternative label: Revistas pornográficas LGBTQ+
broader: LGBTQ+ press
broader: LGBTQ+ pornography
change note: Version 4.2.0
has top concept: LGBTQ+ press
in scheme: v3
preferred label: Revistas porno LGBTQ+
related: Porn industry
related: LGBTQ+ periodicals

LGBTQ+ riots
type: Concept
issued: 2019-05-14
modified: 2025-02-23
replaces: LGBTQRiots
comment: Civil disorder directed against authorities, property, and other individuals, typically in response to grievances, conflicts, or injustice; use in reference to riots involving LGBTQ+ people or in response to LGBTQ+ issues.
comment: Desorden civil dirigido contra autoridades, propiedades y otras personas, generalmente en respuesta a agravios, conflictos o injusticias; utilícese en referencia a disturbios que involucran a personas LGBTQ+ o en respuesta a asuntos LGBTQ+.
alternative label: LGBTQ riots
alternative label: Disturbios (LGBTQ)
alternative label: Motines (LGBTQ)
alternative label: Motines LGBTQ+
change note: Version 4.2.0
in scheme: v3
narrower: Stonewall riots
preferred label: Disturbios LGBTQ+
related: LGBTQ+ demonstrations

LGBTQ+ self-repression
type: Concept
issued: 2019-05-14
modified: 2025-02-23
replaces: LGBTQSelfRepression
comment: Restraint or denial of one’s own thoughts, wishes, feelings or identity, as experienced by LGBTQ+ people.
comment: Restricción o negación de los pensamientos, deseos, sentimientos o identidad propia, tal como lo experimentan las personas LGBTQ+.
alternative label: LGBTQ self-repression
alternative label: Auto represión LGBTQ
change note: Version 4.2.0
in scheme: v3
preferred label: Auto represión LGBTQ+
related: Denial of sexual orientation
related: Internalized homophobia
related: Internalized oppression

LGBTQ+ single parents
type: Concept
issued: 2019-05-14
modified: 2025-03-20
replaces: LGBTQSingleParents
comment: LGBTQ+ people who are parents but are not married or part of a long-term partnership.
comment: Personas LGBTQ+ que son padres y/o madres pero no están casadas ni en una relación a largo plazo.
alternative label: LGBTQ single parents
alternative label: Padres solteros LGBTQ+
alternative label: Madres solteras LGBTQ+
broader: LGBTQ+ parents
broader: Single people
change note: Version 4.2.0
has top concept: LGBTQ+ families
in scheme: v3
narrower: LGBTQ+ single fathers
narrower: LGBTQ+ single mothers
preferred label: Madres y padres solteros LGBTQ+

Eurogames
type: Concept
is replaced by: homoit0000949
issued: 2019-05-14
modified: 2022-08-22
modified: 2022-08-15
modified: 2025-02-23
replaces: eurogames
replaces: gayGames
replaces: LGBTQSportingEvents
replaces: outgames
comment: The most important gay and lesbian sporting event in Europe, hosted by license of the European Gay and Lesbian Sport Federation (EGLSF)
comment: An international sport and cultural event held by the Federation of Gay Games since 1982 that promotes acceptance of LGBTQ+ people and features LGBTQ+ athletes, artists, and other individuals
comment: Organized games or sports activities for LGBTQ+ people or communities; includes both competitive and recreational events.
comment: Juegos o actividades deportivas organizadas para personas o comunidades LGBTQ+; incluye eventos competitivos y recreativos.
comment: A sporting and cultural event open to anyone regardless of sexual identity or qualifying standards that is intended to bring together athletes and artists from around the globe, many from countries where homosexuality remains illegal; separate from the Gay Games
alternative label: LGBTQ sporting events
alternative label: Eventos deportivos LGBTQ
alternative label: Eventos de deporte LGBTQ
broader: Europride
change note: Version 4.2.0
has top concept: Europride
in scheme: v3
preferred label: Gay Games
preferred label: LGBTQ+ sporting events
preferred label: Eventos deportivos LGBTQ+
preferred label: Outgames
related: LGBTQ+ athletes

LGBTQ+ sports clubs
type: Concept
issued: 2019-05-14
modified: 2025-02-23
replaces: LGBTQSportsClubs
comment: Organized groups of LGBTQ+ people formed for the purpose of playing sports; includes professional and amateur sports clubs.
comment: Grupos organizados de personas LGBTQ+ formados para el propósito de jugar deportes; incluye clubs deportivos profesionales y aficionados.
alternative label: LGBTQ sports clubs
alternative label: Clubs de deporte LGBTQ
alternative label: Clubs deportivos LGBTQ
broader: LGBTQ+ clubs and organizations
change note: Version 4.2.0
has top concept: LGBTQ+ clubs and organizations
in scheme: v3
narrower: Gay sports clubs
narrower: Lesbian sports clubs
preferred label: Clubs deportivos LGBTQ+
related: LGBTQ+ athletes

Masochism
type: Concept
issued: 2019-05-14
modified: 2025-02-23
replaces: masochism
comment: Erotic or sexual enjoyment of pain and intense sensations.
comment: Disfrute erótico o sexual del dolor y de sensaciones intensas.
broader: Sadomasochism
broader: Sexual preference
change note: Version 4.2.0
has top concept: Eroticism
in scheme: v3
preferred label: Masoquismo
related: Sadism
related: Sexual identity

Massage
type: Concept
issued: 2019-05-14
modified: 2025-02-23
replaces: massage
comment: Manipulation of the body through techniques like rubbing and kneading muscles and joints with the hands, typically to relieve tension and pain or to provide erotic stimulation.
comment: Manipulación del cuerpo con las manos mediante técnicas como frotar y masajear músculos y articulaciones, generalmente para aliviar la tensión y el dolor o proporcionar estimulación erótica.
change note: Version 4.2.0
in scheme: v3
narrower: Erotic massage
preferred label: Masaje
related: Physical affection

Packing (Phallus)
type: Concept
issued: 2019-05-14
modified: 2025-02-23
replaces: packingPhallus
comment: The act of wearing padding or a phallic object in the front of the pants or underwear to give the appearance of having a bulge.
comment: El acto de llevar acolchado o un objeto fálico en la parte delantera de los pantalones o la ropa interior de una persona para dar la apariencia de tener un protuberancia.
alternative label: Abultar
broader: Gender expression
change note: Version 4.2.0
has top concept: Gender
in scheme: v3
preferred label: Packing
related: Dildo harnesses
related: Penis
related: Packers (Phallus)

Pangender people
type: Concept
issued: 2019-05-14
modified: 2025-02-23
replaces: pangenderPeople
comment: People who identify as multiple or all genders.
comment: Personas que se identifican como de múltiples o todos los géneros.
broader: Non-Euro-American gender and sexual identities
broader: Transgender people
broader: Gender minorities
change note: Version 4.2.0
has top concept: Gender
in scheme: v3
preferred label: Personas pangénero
related: Pangender identity

Pederasts
type: Concept
issued: 2019-05-14
modified: 2025-02-23
replaces: pederasts
comment: Adult men who have sexual and mentor/protégé relationships with adolescent boys. This term has historically been used to describe gay men. Only use in historical contexts.
comment: Hombres adultos que tienen relaciones sexuales y de mentoría/protección con adolescentes hombres. Este término se ha utilizado históricamente para describir a los hombres gay. Utilícese únicamente en contextos históricos.
broader: LGBTQ+ historical terms
broader: Sexual identity
broader: Sexual preference
change note: Version 4.2.0
has top concept: LGBTQ+ historical terms
in scheme: v3
preferred label: Pederastas
related: Pederasty

Pederasty
type: Concept
issued: 2019-05-14
modified: 2025-02-23
replaces: pederasty
comment: Term used to describe the practices of adult men who engage in sexual and mentor/protégé relationships with adolescent boys. This term has historically been used to describe the practices of gay men. Only use in historical contexts.
comment: Término utilizado para describir las prácticas de hombres adultos que mantienen relaciones sexuales y de mentor/pupilo con niños adolescentes. Este término se ha utilizado históricamente para describir las prácticas de los hombres gay. Utilícese únicamente en contextos históricos.
broader: LGBTQ+ historical terms
change note: Version 4.2.0
has top concept: LGBTQ+ historical terms
in scheme: v3
preferred label: Pederastia
related: Pederasts
related: Sexual preference
related: Sodomy

Pinkwashing
type: Concept
issued: 2019-05-14
modified: 2025-02-23
replaces: pinkwashing
comment: A variety of marketing and political strategies aimed at promoting products, countries, people, or entities to LGBTQ+ people; using LGBTQ+-related symbols in order to be perceived as progressive, modern, and tolerant; and/or utilizing concern for LGBTQ+ people and rights to justify or deviate attention from settler-colonialism, genocide, invasion, and intervention in other countries.
comment: Una variedad de estrategias políticas y de marketing destinada a promover productos, países, personas o entidades entre personas LGBTQ+ o utilizar símbolos LGBTQ+ para ser percibidos como progresistas, modernos y tolerantes.
alternative label: Lavado rosa
alternative label: Lavado de imagen rosa
change note: Version 4.2.0
in scheme: v3
related: Homonationalism
related: LGBTQ+ friendliness
related: LGBTQ+ marketing

Police entrapment
type: Concept
issued: 2019-05-14
modified: 2025-02-23
replaces: policeEntrapment
comment: A practice in which law enforcement agents or agents of the state coerce an individual to commit a "crime" they would have otherwise been unlikely or unwilling to commit. Legal definitions of entrapment vary widely depending on the jurisdiction, but the term is often used colloquially to refer to police acting dishonestly or in bad faith, as well as policing focused on anticipating and inducing crime, rather than responding to reports of crime.
comment: Práctica en la que los agentes de las fuerzas de seguridad o los agentes del Estado fuerzan a una persona a cometer un "delito" que, de otro modo, probablemente no cometería o no estaría dispuesta a cometer. Las definiciones jurídicas de la trampa varían mucho en función de la jurisdicción, pero el término se utiliza a menudo coloquialmente para referirse a la policía que actúa de forma deshonesta o de mala fe, así como a la actuación policial centrada en anticipar e inducir el delito, en lugar de responder a las denuncias de delitos.
alternative label: Agentes encubiertos
broader: Police harassment
change note: Version 4.2.0
has top concept: Harassment
in scheme: v3
narrower: Police entrapment of LGBTQ+ people
preferred label: Aprisionamiento policial
related: Arrests of LGBTQ+ people
related: Police

Police harassment
type: Concept
issued: 2019-05-14
modified: 2025-02-23
replaces: policeHarassment
comment: Any of various forms of inappropriate conduct, illegal actions, or abuses of power undertaken by law enforcement agents or agents of the state against members of the public. This includes but is not limited to racial, ethnic, and other forms of profiling; unwarranted surveillance, searches, and seizure; selective enforcement; excessive use of force; sexual misconduct; intimidation and witness tampering; falsification of evidence; coerced confessions; false arrests and imprisonment; and bribing or lobbying.
comment: Cualquiera de las diversas formas de conducta inapropiada, acciones ilegales o abusos de poder cometidos por agentes de las fuerzas de seguridad o agentes del Estado contra miembros del público. Esto incluye, entre otros, la elaboración de perfiles raciales, étnicos y de otro tipo; la vigilancia, el registro y la incautación injustificados; la aplicación selectiva de la ley; el uso excesivo de la fuerza; la conducta sexual indebida; la intimidación y la manipulación de testigos; la falsificación de pruebas; las confesiones forzadas; las detenciones y encarcelamientos falsos; y el soborno o el cabildeo.
alternative label: Harrassment by police
alternative label: Misconduct by police
alternative label: Mistreatment by police
alternative label: Police misconduct
alternative label: Police mistreatment
broader: Harassment
change note: Version 4.2.0
has top concept: Harassment
in scheme: v3
narrower: Police entrapment
narrower: Police raids
narrower: Police harassment of LGBTQ+ people
preferred label: Acoso policial

Porn stars
type: Concept
issued: 2019-05-14
modified: 2025-02-23
replaces: pornStars
comment: Actors in erotic or sexually explicit films.
comment: Actores y actrices en películas eróticas o sexualmente explícitas.
alternative label: Pornographic actors
alternative label: Pornstars
alternative label: Porn actresses
alternative label: Adult entertainers
alternative label: Porn actors
alternative label: Pornographic stars
alternative label: Pornographic actresses
alternative label: Adult actors
alternative label: Actores pornográficos
alternative label: Actores porno
alternative label: Actrices porno
alternative label: Actrices pornográficas
alternative label: Estrellas de porno
broader: Sex workers
change note: Version 4.2.0
has top concept: Sex workers
in scheme: v3
narrower: LGBTQ+ porn stars
preferred label: Estrellas porno
related: Gay for pay
related: Pornography

Post-operative
type: Concept
issued: 2019-05-14
modified: 2025-02-23
replaces: postOperative
comment: Individuals who have recently undergone a surgical operation; commonly used to describe trans people who have undergone gender affirming surgery.
comment: Personas que recientemente hayan atravesado una operación quirúrgica; se utiliza comúnmente para describir a personas trans que han atravesado una cirugía de afirmación de género.
alternative label: Post-operatorio
alternative label: Post quirúrgico
broader: Transitioning status
change note: Version 4.2.0
has top concept: Transitioning (Gender)
in scheme: v3
preferred label: Post-quirúrgico
related: Gender-affirming surgery
related: Transgender people
related: Transsexual people

Pre-operative
type: Concept
issued: 2019-05-14
modified: 2025-02-23
replaces: preOperative
comment: The medical status of individuals who plan to undertake a surgical procedure but have not yet done so. Commonly used to describe trans people who have not yet undergone gender affirming surgery but plan to do so.
comment: El estado médico de las personas que planean someterse a un procedimiento quirúrgico pero aún no lo han hecho. Se utiliza comúnmente para describir a personas trans que aún no se han sometido a una cirugía de afirmación de género pero que planean hacerlo.
alternative label: Pre-operatorio
alternative label: Pre quirúrgico
broader: Transitioning status
change note: Version 4.2.0
has top concept: Transitioning (Gender)
in scheme: v3
preferred label: Pre-quirúrgico
related: Gender-affirming surgery
related: Transgender people
related: Transsexual people

Queer children
type: Concept
issued: 2019-05-14
modified: 2025-02-23
replaces: queerChildren
comment: Queer people who have not yet reached the age of adolescence.
comment: Niños menores de 18 años que se identifican como queer.
broader: LGBTQ+ children
broader: Queer youth
change note: Version 4.2.0
has top concept: Family members
in scheme: v3
preferred label: Niños queer
related: Queer characters
related: Queer identity

Queer dominatrices
type: Concept
issued: 2019-05-14
modified: 2025-02-23
replaces: queerDominatrices
comment: Women who take a dominant role in BDSM activities; use for dominatrices who identify as queer.
comment: Mujeres que desempeñan un papel dominante en las actividades de BDSM; utilícese para dominatrices que se autoidentifican como queer.
broader: LGBTQ+ dominatrices
change note: Version 4.2.0
has top concept: Relationship minorities
in scheme: v3
preferred label: Dominatrices queer
related: Bisexual dominatrices
related: Lesbian dominatrices
related: Transgender dominatrices

Queer mistresses (BDSM culture)
type: Concept
issued: 2019-05-14
modified: 2026-02-24
replaces: queerMistresses
comment: Queer women who are part of the BDSM scene and assume the mistress role in sexual relationships with a mistress/submissive dynamic.
comment: Mujeres queer que forman parte de la escena BDSM y asumen el rol de ama en las relaciones sexuales con una dinámica ama/esclava.
broader: LGBTQ+ mistresses (BDSM culture)
change note: Version 4.2.0
has top concept: Sexual identity
in scheme: v3
preferred label: Amas queer
related: Bisexual mistresses (BDSM culture)
related: Lesbian mistresses (BDSM culture)
related: Transgender mistresses (BDSM culture)

Queer parents
type: Concept
issued: 2019-05-14
modified: 2025-02-23
replaces: queerParents
comment: Queer people who are parents.
comment: Personas queer que son padres y/o madres.
alternative label: Madres queer
alternative label: Padres queer
broader: LGBTQ+ parents
change note: Version 4.2.0
has top concept: LGBTQ+ families
in scheme: v3
preferred label: Madres y padres queer
related: Children of queer people
related: Queer people
related: Queerspawn

Radical feminism
type: Concept
issued: 2019-05-14
modified: 2025-02-23
replaces: radicalFeminism
comment: Perspective within feminism that calls for a radical reordering of society in which male supremacy is eliminated in all social and economic contexts.
comment: Perspectiva dentro del feminismo que exige un reordenamiento radical de la sociedad en la que se elimine la supremacía masculina en todos los contextos sociales y económicos.
broader: Feminism
change note: Version 4.2.0
has top concept: Feminism
in scheme: v3
preferred label: Feminismo radical
related: Social privilege
related: Womyn
related: Radical feminists

Sadism
type: Concept
issued: 2019-05-14
modified: 2025-02-23
replaces: sadism
comment: Erotic or sexual enjoyment of the application of pain or intense sensations. Derived from the literary works of the Marquis de Sade.
comment: Preferencia sexual o fetiche relacionado con la dominación o con diversas prácticas de BDSM, incluido el dolor, la humillación y el sufrimiento. Derivado de las obras literarias del Marqués de Sade.
broader: Sadomasochism
broader: Sexual preference
change note: Version 4.2.0
has top concept: Eroticism
in scheme: v3
preferred label: Sadismo
related: Masochism
related: Sexual identity

Voyeurism
type: Concept
issued: 2019-05-14
modified: 2025-02-23
replaces: voyeurism
comment: Practice of watching or listening to others, typically without their awareness or consent. In consensual sexual encounters, voyeurism involves watching or listening to someone undress or engage in sexual activity without actively participating.
comment: Práctica de observar o escuchar a otras personas, generalmente sin su conocimiento o consentimiento. En los encuentros sexuales consensuales, el voyeurismo implica mirar o escuchar a alguien desvestirse o participar de una actividad sexual sin participar activamente.
alternative label: Scopophilia
alternative label: Scoptophilia
alternative label: Voyeurismo
alternative label: Escopofilia
broader: BDSM
broader: Sex (Act)
change note: Version 4.2.0
has top concept: Eroticism
in scheme: v3
preferred label: Voyerismo
related: Exhibitionism
related: Public sex

Sexology
type: Concept
issued: 2019-05-14
modified: 2025-04-24
replaces: sexology
comment: Scientific study of human sexuality including sexual interests, behaviors, and functions that utilizes tools from other academic fields like anthropology, biology, medicine, and psychology.
comment: Estudio científico de la sexualidad humana, incluidos los intereses, comportamientos y funciones sexuales, y que utiliza herramientas de otras áreas académicas como la antropología, la biología, la medicina y la psicología.
change note: Version 4.2.0
in scheme: v3
preferred label: Sexología
related: Sexologists
related: Sexuality
related: Sexual studies

Sexual behavior change
type: Concept
issued: 2019-05-14
modified: 2025-02-23
replaces: sexualBehaviourChange
comment: Term used to describe changes in behavior related to safer sexual practices (e.g., condom use, STI testing).
comment: Término utilizado para describir cambios en el comportamiento relacionados con prácticas sexuales más seguras (por ejemplo, uso de condones, pruebas de ITS).
change note: Version 4.2.0
in scheme: v3
preferred label: Cambio de comportamiento sexual
preferred label: Sexual behaviour change
related: Risk behaviors
related: Safer sex
related: Sexual preference

Sexual offenses laws
type: Concept
issued: 2019-05-14
modified: 2025-02-23
replaces: sexualOffencesLaws
comment: Legislation determining the kinds of sexual behaviors and activities that are legally permissible. Laws vary by jurisdiction but typically address crimes like sexual coercion, sexual assault, incest, and sex trafficking. Historically and in the present day, sexual offenses laws have also served to criminalize consensual but non-normative sexual practices, such as anal sex and homosexuality.
comment: Legislación que determina los tipos de conductas y actividades sexuales que están legalmente permitidas. Las leyes varían según la jurisdicción, pero normalmente abordan delitos como la coerción sexual, la agresión sexual, el incesto y el tráfico sexual. Históricamente y en la actualidad, las leyes sobre delitos sexuales también han servido para criminalizar prácticas sexuales consensuales pero no normativas, como el sexo anal y la homosexualidad.
alternative label: Sexual criminal codes
alternative label: Códigos criminales sexuales
broader: Criminal law
change note: Version 4.2.0
has top concept: Law
in scheme: v3
narrower: Sodomy laws
preferred label: Leyes sobre delitos sexuales
related: Age of consent
related: Police interactions with LGBTQ+ people

Sexual harassment
type: Concept
issued: 2019-05-14
modified: 2025-02-23
replaces: sexualHarassment
comment: Unwelcome behavior of a sexual nature, including unwanted advances or requests for sexual favors.
comment: Comportamiento no deseado de naturaleza sexual, incluidos insinuaciones no deseadas o pedidos de favores sexuales.
broader: Harassment
change note: Version 4.2.0
has top concept: Harassment
in scheme: v3
preferred label: Acoso sexual
related: Anti-LGBTQ+ violence
related: Intimate partner violence
related: Sexism

Sexual health
type: Concept
issued: 2019-05-14
modified: 2025-02-23
replaces: sexualHealth
comment: State of physical, emotional, mental, and social well being in relation to sexuality. This includes one’s ability to have responsible, satisfying, and safer sex free of violence or coercion.
comment: Estado de bienestar físico, emocional, mental y social en relación con la sexualidad. Esto incluye la capacidad de tener relaciones sexuales responsables, satisfactorias y seguras, libres de violencia o coerción.
change note: Version 4.2.0
in scheme: v3
preferred label: Salud sexual
related: AIDS education
related: Sexual dysfunction
related: Sexual function

Leather and kink activism
type: Concept
issued: 2019-05-14
modified: 2025-02-23
replaces: SMMovement
comment: Organizing and activism focused on increasing awareness and acceptance of kinks, fetishes, sadomasochism, leather and related subcultures, closely associated with LGBTQ+ activism and the sex-positive feminist movement.
comment: Organización y activismo centrados en aumentar la concienciación y la aceptación de las subculturas kinks, fetichistas, sadomasoquistas, de cuero y afines, estrechamente relacionadas con el activismo LGBTQ+ y el movimiento feminista del sexo positivo.
broader: Social movements
change note: Version 4.2.0
has top concept: Social movements
in scheme: v3
preferred label: Activismo leather y kink
related: LGBTQ+ activism
related: Sadomasochism
related: Sex-positive feminism

Social constructionism
type: Concept
issued: 2019-05-14
modified: 2025-02-23
replaces: socialConstructionism
comment: Belief or theory that categories of gender, sexual orientation, and ethnicity are cultural constructs rather than intrinsic categories of nature.
comment: Creencia o teoría de que las categorías de género, orientación sexual y etnicidad son construcciones culturales y no categorías intrínsecas de la naturaleza.
broader: Theories
change note: Version 4.2.0
has top concept: Theories
in scheme: v3
preferred label: Construccionismo social
related: Essentialism
related: Medicalization
related: Queer theory

Sodomy laws
type: Concept
issued: 2019-05-14
modified: 2025-02-23
replaces: sodomyLaws
comment: Laws and regulations regarding the legality of sodomy, particularly in the United States, Great Britain, and/or former British colonies.
comment: Leyes y regulaciones relativas a la legalidad de la sodomía, particularmente en los Estados Unidos, Gran Bretaña y/o antiguas colonias británicas.
alternative label: Leyes sobre sodomía
broader: Sexual offenses laws
change note: Version 4.2.0
has top concept: Law
in scheme: v3
preferred label: Leyes de sodomía
related: Sodomy
related: Police interactions with LGBTQ+ people
related: Criminalization of homosexuality

Spanking
type: Concept
issued: 2019-05-14
modified: 2025-02-23
replaces: spanking
comment: Striking the buttocks, usually with the hand or paddle, as a form of impact play.
comment: Golpear las nalgas, normalmente con la mano o con una paleta, como forma de juego de impacto.
alternative label: Azotainas
alternative label: Zurras eróticas
alternative label: Disciplina inglesa
alternative label: Palmada
broader: Impact play
change note: Version 4.2.0
has top concept: Eroticism
in scheme: v3
preferred label: Nalgada
related: Anal play
related: Butt
related: Spanking paddles

Testosterone
type: Concept
issued: 2019-05-14
modified: 2025-02-23
replaces: testosterone
comment: A steroid hormone that is produced in the testes, ovaries, and adrenal cortex. Testosterone is commonly utilized in masculinizing hormone therapy regimens for certain secondary sexual characteristics, such as increased muscle mass and growth of body hair.
comment: Hormona esteroide que se produce en los testículos, los ovarios y la corteza suprarrenal. La testosterona se utiliza comúnmente en regímenes de terapia hormonal masculinizante para ciertas características sexuales secundarias, como el aumento de la masa muscular y el crecimiento del vello corporal.
broader: Hormone therapy (Gender)
broader: Hormones
change note: Version 4.2.0
has top concept: Medical care
in scheme: v3
preferred label: Testosterona
related: FtMs
related: Trans men

Tomboys
type: Concept
issued: 2019-05-14
modified: 2025-02-23
replaces: tomboys
comment: Girls who exhibit some characteristics associated with gender expectations for boys.
comment: Niñas que exhiben algunas características asociadas con las expectativas de género para los niños.
alternative label: Tomboy
alternative label: Marimacha
alternative label: Machona
alternative label: Machorra
alternative label: Machota
broader: Gender roles
broader: Girls
change note: Version 4.2.0
has top concept: Role behavior
in scheme: v3
preferred label: Marimacho
related: Butches
related: Masculine of center

Transgender dominatrices
type: Concept
issued: 2019-05-14
modified: 2025-02-23
replaces: transgenderDominatrices
comment: Women who take a dominant role in BDSM activities; use for dominatrices who identify as transgender.
comment: Mujeres que desempeñan un papel dominante en las actividades de BDSM; utilícese para dominatrices que se autoidentifican como transgénero.
broader: LGBTQ+ dominatrices
change note: Version 4.2.0
has top concept: Relationship minorities
in scheme: v3
preferred label: Dominatrices transgénero
related: Bisexual dominatrices
related: Lesbian dominatrices
related: Queer dominatrices

Transgender families
type: Concept
issued: 2019-05-14
modified: 2025-02-23
replaces: transgenderFamilies
comment: Families, whether biological, adoptive, or chosen, in which one or more individuals identify as transgender.
comment: Familias, ya sean biológicas, adoptivas o elegidas, en las que una o más personas se autoidentifican como transgénero.
broader: LGBTQ+ families
change note: Version 4.2.0
has top concept: LGBTQ+ families
in scheme: v3
preferred label: Familias transgénero
related: Children of transgender people
related: Transgender parents
related: People with transgender parents

Transgender identity
type: Concept
issued: 2019-05-14
modified: 2025-02-23
replaces: transgenderIdentity
comment: Identity term used to describe people who cross or transgress the gender they were assigned at birth.
comment: Término identitario utilizado para describir a las personas que traspasan o transgreden el género que les fue asignado al nacer.
broader: Gender identity
change note: Version 4.2.0
has top concept: Gender
in scheme: v3
preferred label: Identidad transgénero
related: Transgender people
related: Transgender children
related: Trans

Transgender mistresses (BDSM culture)
type: Concept
issued: 2019-05-14
modified: 2026-02-24
replaces: transgenderMistresses
comment: Transgender women who are part of the BDSM scene and assume the mistress role in sexual relationships with a mistress/submissive dynamic.
comment: Mujeres transgénero que forman parte de la escena BDSM y asumen el rol de amas en relaciones sexuales con una dinámica ama/esclava.
broader: LGBTQ+ mistresses (BDSM culture)
change note: Version 4.2.0
has top concept: Sexual identity
in scheme: v3
preferred label: Amas transgénero
related: Bisexual mistresses (BDSM culture)
related: Lesbian mistresses (BDSM culture)
related: Queer mistresses (BDSM culture)

Trigender people
type: Concept
issued: 2019-05-14
modified: 2025-02-23
replaces: trigenderPeople
comment: People whose gender continually moves between or among three gender identities, typically male, female, and a third gender.
comment: Personas cuyo género se mueve continuamente entre tres identidades de género, típicamente masculina, femenina y un tercer género.
broader: Non-Euro-American gender and sexual identities
broader: Transgender people
broader: Gender minorities
change note: Version 4.2.0
has top concept: Gender
in scheme: v3
preferred label: Personas trigénero
related: Trigender identity

Voguing
type: Concept
issued: 2019-05-14
modified: 2025-02-23
replaces: voguing
comment: A highly stylized form of dance originating in the Harlem ballroom scene in the 1980s and 1990s.
comment: Una forma de danza muy estilizada que se originó en la escena de ballroom de Harlem en las décadas de 1980 y 1990.
alternative label: Vogueing
change note: Version 4.2.0
in scheme: v3
related: Ball culture
related: Drag
related: Drag balls

Vulva
type: Concept
issued: 2019-05-14
modified: 2025-02-23
replaces: vulva
comment: External genitalia surrounding the vagina.
comment: Genitales externos que rodean la vagina.
broader: Genitals
change note: Version 4.2.0
has top concept: Sex (Body)
in scheme: v3
related: Labiaplasty
related: Vaginectomy
related: Vaginoplasty

Wacking off
type: Concept
issued: 2019-05-14
modified: 2025-02-23
replaces: wackingOff
comment: Slang term for masturbation that is commonly used in the United States.
comment: Término de la jerga para la masturbación, que se usa comúnmente en los Estados Unidos.
alternative label: Haciendo una paja
alternative label: Hacerse una puñeta
broader: Manual sex
broader: Masturbation
broader: Phallic sex
change note: Version 4.2.0
has top concept: Sex (Act)
in scheme: v3
narrower: Wanking

Whakatane
type: Concept
issued: 2019-05-14
modified: 2025-02-23
replaces: wakatane
comment: In Māori culture in New Zealand, this term is used to describe people assigned female at birth who pursue traditionally male roles.
comment: En la cultura maorí de Nueva Zelanda, este término se utiliza para describir a las personas asignadas al sexo femenino al nacer y que desempeñan roles tradicionalmente masculinos.
alternative label: Wakatane
broader: Non-Euro-American gender and sexual identities
broader: MVPFAFF+
change note: Version 4.2.0
has top concept: Gender
in scheme: v3
related: Butches
related: Whakawāhine

Whips
type: Concept
issued: 2019-05-14
modified: 2025-02-23
replaces: whips
comment: Sticks, cords, or straps, usually with stiff handles, that are used for striking individuals. Often used in BDSM circles to enhance sexual arousal.
comment: Palos, cuerdas o correas, generalmente con mangos rígidos, que se utilizan para golpear a personas. A menudo se utilizan en círculos de BDSM para mejorar la excitación sexual.
broader: Sex accessories
change note: Version 4.2.0
has top concept: Sex accessories
in scheme: v3
preferred label: Látigos
related: Flagellation
related: Whipping

Wimmin
type: Concept
issued: 2019-05-14
modified: 2025-02-23
replaces: wimmin
comment: A way of spelling "women" that is used in certain feminist circles. First used by George P. Krapp (1872-1934) and then appeared in 19th century Black American English renderings before being used by feminists in the 20th century.
comment: Una forma de deletrear "women" (mujeres en inglés) que se utiliza en ciertos círculos feministas. Utilizado por primera vez por George P. Krapp (1872-1934) y luego apareció en representaciones del inglés afroamericano del siglo XIX antes de ser utilizado por feministas en el siglo XX.
change note: Version 4.2.0
in scheme: v3
related: Feminism
related: Females
related: Womyn

Amatonormativity
type: Concept
issued: 2020-06-02
modified: 2025-02-23
replaces: amatonormativity
comment: The assumption that all people share a desire for romantic relationships and that this is a preferential life goal.
comment: La suposición de que todas las personas comparten el deseo de tener relaciones románticas y que este es un objetivo de vida preferencial.
broader: Social norms
change note: Version 4.2.0
has top concept: Social norms
in scheme: v3
preferred label: Amatonormatividad
related: Aromantic people
related: LGBTQ+ discrimination
related: Compulsory monogamy

LGBTQ+ people in recovery
type: Concept
issued: 2020-06-03
modified: 2025-04-24
replaces: LGBTQPeopleInRecovery
comment: LGBTQ+ people currently in recovery from use disorders, conditions, or addictions. Follow the individual's preference for "recovery" or "sobriety" whenever possible.
comment: Personas LGBTQ+ actualmente en recuperación de trastornos, condiciones o adicciones por consumo. Siga la preferencia de la persona sobre el uso de "recuperación" o "sobriedad" siempre que sea posible.
alternative label: LGBTQ people in recovery
broader: LGBTQ+ people
change note: Version 4.2.0
has top concept: LGBTQ+ people
in scheme: v3
preferred label: Personas LGBTQ+ en recuperación
related: Cocaine
related: Alcoholics
related: Two-Spirit people in recovery

Leather bars
type: Concept
issued: 2020-06-03
modified: 2025-02-23
replaces: leatherBars
comment: Bars or clubs that cater to or which are known to be especially friendly to the leather community.
comment: Bares o clubes que atienden a miembros de la comunidad de cuero.
broader: LGBTQ+ bars
change note: Version 4.2.0
has top concept: LGBTQ+ meeting places
in scheme: v3
preferred label: Bares leather
related: Dark rooms
related: Gay bars
related: Leather community

Stigma
type: Concept
issued: 2020-06-03
modified: 2025-02-23
replaces: stigma
comment: Widespread disapproval of a group of people or set of behaviors based on preconceived ideas.
comment: Desaprobación generalizada de un grupo de personas o de un conjunto de conductas basada en ideas preconcebidas.
change note: Version 4.2.0
in scheme: v3
preferred label: Estigma
related: Intolerance towards LGBTQ+ people
related: LGBTQ+ discrimination
related: Gay shame

Uranism
type: Concept
issued: 2020-06-03
modified: 2025-02-23
replaces: uranism
comment: Historical term originating from the German "Uranismus" coined by Karl Heinrich Ulrichs as an umbrella term for what are now referred to as gender and sexual minorities; use only in historical contexts.
comment: Término histórico que se origina en el "uranismo" alemán acuñado por Karl Heinrich Ulrichs como término general para lo que ahora se conoce como minorías sexuales y de género; utilícese únicamente en contextos históricos.
alternative label: Uranismus
alternative label: Congenital sexual inversion
alternative label: Urningism
alternative label: Uraniadism
alternative label: Uranianism
broader: LGBTQ+ historical terms
change note: Version 4.2.0
has top concept: LGBTQ+ historical terms
in scheme: v3
preferred label: Uranismo
related: Inverts
related: Sexual inversion
related: Uranians

Mastectomy
type: Concept
issued: 2020-12-11
modified: 2025-02-23
replaces: mastectomy
comment: A surgical procedure aimed at removing the breast or as much breast tissue as possible; often undergone as part of "top surgery" for transgender men or nonbinary people.
comment: Un procedimiento quirúrgico destinado a extirpar la mama o la mayor cantidad de tejido mamario posible; a menudo se realiza como parte de una "cirugía superior" para hombres transgénero o personas no binarias.
alternative label: Breast amputation
alternative label: Amputación de senos
broader: Top surgery
change note: Version 4.2.0
has top concept: Medical care
in scheme: v3
preferred label: Mastectomía
related: Breast
related: Breast reduction
related: Chest reconstruction surgery

Megasexuality
type: Concept
issued: 2020-12-11
modified: 2025-02-23
replaces: megasexuality
comment: A sexual orientation generally characterized by a person's lack of emotional connection to other people unless or until they have formed a strong sexual connection with them first.
comment: Una orientación sexual generalmente caracterizada por la falta de conexión emocional de una persona con otras personas a menos que, o hasta que, primero esa persona haya formado una fuerte conexión sexual con ellas.
broader: Sexual identity
broader: Sexual orientation
change note: Version 4.2.0
has top concept: Sexual identity
in scheme: v3
preferred label: Megasexualidad
related: Sexual relationships
related: Megasexual people

Swinging
type: Concept
issued: 2020-12-11
modified: 2025-02-23
replaces: swinging
comment: An agreement, sexual practice, or relationship in which a couple engages in group sex or the swapping of sexual partners within a group, often on a habitual basis.
comment: Un acuerdo, una práctica sexual o una relación en la que una pareja mantiene relaciones sexuales en grupo o intercambia parejas sexuales dentro de un grupo, a menudo de forma habitual.
alternative label: Wife swapping
alternative label: Husband swapping
alternative label: Partner swapping
alternative label: Intercambio de esposo
alternative label: Intercambio de esposa
broader: Hierarchical non-monogamy
broader: Consensual non-monogamy
change note: Version 4.2.0
has top concept: Relationship orientation
in scheme: v3
preferred label: Intercambio de parejas
related: Sexual practices
related: Monogamish

Aromanticism
type: Concept
issued: 2021-03-04
modified: 2025-02-23
replaces: aromanticism
comment: A romantic orientation generally characterized by a lack of romantic attraction or desire.
comment: Orientación arromántica caracterizada generalmente por la falta de atracción o deseo romántico.
alternative label: Aromantic
alternative label: Arromántico
broader: Romantic orientation
change note: Version 4.2.0
has top concept: Romantic orientation
in scheme: v3
preferred label: Arromanticismo
related: Asexuality
related: Aromantic people
related: Alloromanticism

Assigned X at birth
type: Concept
issued: 2021-06-30
modified: 2025-02-23
replaces: assignedXAtBirth
comment: The assignment of an "X" gender marker or "X" sex designation shortly after birth. It is uncommon for intersex people to be assigned intersex or X at birth.
comment: La asignación de un marcador de género "X" o una designación de sexo "X" poco después del nacimiento. Es poco común que a las personas intersexuales se les asigne intersex o X al nacer.
alternative label: AXAB
alternative label: Designated X at birth
alternative label: DXAB
alternative label: X assigned at birth
alternative label: XAAB
alternative label: Asignadx X al nacer
alternative label: AXAN
broader: Sex assigned at birth
change note: Version 4.2.0
has top concept: Sex (Body)
in scheme: v3
preferred label: Asignado X al nacer
related: Intersex variations
related: X gender markers

Compersion
type: Concept
issued: 2021-06-30
modified: 2025-02-23
replaces: compersion
comment: The positive emotion an individual may experience in regards to their partner's relationship with another partner. Often defined as the opposite of jealousy.
comment: La emoción positiva que una persona puede experimentar con respecto a la relación de su pareja con otra pareja. A menudo se define como lo opuesto a los celos.
change note: Version 4.2.0
in scheme: v3
preferred label: Compersión
related: Polyamory
related: Consensual non-monogamy

NRE (New Relationship Energy)
type: Concept
issued: 2021-06-30
modified: 2025-02-23
replaces: nre
comment: A strong, almost giddy feeling of excitement and infatuation common in the beginning of a new romantic relationship. Often used in polyamory contexts.
comment: Un sentimiento fuerte, casi vertiginoso, de emoción y enamoramiento, común al comienzo de una nueva relación romántica. A menudo, se utiliza en contextos de poliamor.
change note: Version 4.2.0
in scheme: v3
preferred label: Energía de la Nueva Relación
related: Polyamory
related: Honeymooning
related: Polyamorous people

Relationship anarchists
type: Concept
issued: 2021-06-30
modified: 2025-02-23
replaces: relationshipAnarchists
comment: People who practice a type of non-monogamy characterized by application of anarchist principles (such as autonomy, anti-normativity, anti-hierarchical practices, refusal of state governance) to relationships. Often contrasted with hierarchical polyamory.
comment: Personas que practican un tipo de no monogamia caracterizada por la aplicación de principios anarquistas (como la autonomía, la antinormatividad, las prácticas antijerárquicas, el rechazo de la gobernanza estatal) a las relaciones. A menudo, se contrasta con el poliamor jerárquico.
alternative label: Anarquistas de relación
broader: Relationship minorities
broader: Consensual non-monogamy
broader: Non-monogamous people
change note: Version 4.2.0
has top concept: Relationship minorities
in scheme: v3
preferred label: Anarquistas relacionales
related: Relationship anarchy

Xenogender people
type: Concept
issued: 2021-06-30
modified: 2025-02-23
replaces: xenogenderPeople
comment: A person who identifies their gender in relation to non-human understandings of gender and relates to animals, plants, or other things.
comment: Una persona que identifica su género en relación a interpretaciones no humanas del género y se relaciona a animales, plantas u otras cosas.
change note: Version 4.2.0
in scheme: v3
preferred label: Personas xenogénero
related: Gender identity
related: Non-binary people
related: Xenogender identity

Aromantic families
type: Concept
issued: 2021-11-23
modified: 2025-02-23
comment: Families, whether biological, adoptive, or chosen, in which one or more individuals identify as aromantic.
comment: Familias, ya sean biológicas, adoptivas o elegidas, en las que una o más personas se autoidentifican como arrománticas.
alternative label: Aro families
alternative label: Familias aro
broader: LGBTQ+ families
change note: Version 4.2.0
has top concept: LGBTQ+ families
in scheme: v3
preferred label: Familias arrománticas
related: Aromantic people
related: Aromantic parents
related: Children of aromantic people

Asexual families
type: Concept
issued: 2021-11-23
modified: 2025-02-23
comment: Families, whether biological, adoptive, or chosen, in which one or more individuals identify as asexual.
comment: Familias, ya sean biológicas, adoptivas o elegidas, en las que una o más personas se autoidentifican como asexuales.
alternative label: Ace families
alternative label: Familias ace
broader: LGBTQ+ families
change note: Version 4.2.0
has top concept: LGBTQ+ families
in scheme: v3
preferred label: Familias asexuales
related: Asexual people
related: Asexual parents
related: Children of asexual people

Intersex families
type: Concept
issued: 2021-11-23
modified: 2025-02-23
comment: Families, whether biological, adoptive, or chosen, in which one or more individuals are intersex.
comment: Familias, ya sean biológicas, adoptivas o elegidas, en las que una o más personas son intersex.
broader: LGBTQ+ families
change note: Version 4.2.0
has top concept: LGBTQ+ families
in scheme: v3
preferred label: Familias intersex
related: Intersex people
related: Intersex parents
related: Children of intersex people

Two-Spirit families
type: Concept
issued: 2021-11-23
modified: 2025-02-23
comment: Families, whether biological, adoptive, or chosen, in which one or more individuals identify as Two-Spirit.
comment: Familias, ya sean biológicas, adoptivas o elegidas, en las que una o más personas se autoidentifican como dos espíritus.
alternative label: 2S families
alternative label: Two Spirit families
alternative label: Two Spirited families
alternative label: Two-Spirited families
broader: Two-Spirit people
change note: Version 4.2.0
has top concept: Gender
in scheme: v3
preferred label: Familias dos espíritus
related: Children of Two-Spirit people
related: Two-Spirit fathers
related: Two-Spirit mothers

Aromantic parents
type: Concept
issued: 2021-11-23
modified: 2025-02-23
comment: Parents who are aromantic.
comment: Padres y/o madres que son arrománticos.
alternative label: Aro parents
alternative label: Padres aro
alternative label: Madres aro
alternative label: Madres arrománticos
alternative label: Padres arrománticos
broader: LGBTQ+ parents
change note: Version 4.2.0
has top concept: LGBTQ+ families
in scheme: v3
preferred label: Madres y padres arrománticos
related: Aromantic people
related: Aromantic families
related: Children of aromantic people

Children of aromantic people
type: Concept
issued: 2021-11-23
modified: 2025-02-23
comment: Children who have one or more aromantic parent.
comment: Hijos o hijas que tienen uno o más padres arománticos.
alternative label: Children of aro people
alternative label: Hijos de personas arro
alternative label: Hijas de personas aromáticas
alternative label: Hijas de personas arro||
broader: Children of LGBTQ+ people
change note: Version 4.2.0
has top concept: Family members
in scheme: v3
preferred label: Hijos de personas aromáticas
related: Aromantic people
related: Aromantic families
related: Aromantic parents

t4t
type: Concept
issued: 2021-12-07
modified: 2025-02-23
comment: Abbreviated form of the phrase "trans for trans," a label used to describe trans people who prioritize engaging in romantic, sexual, or other relationships with other trans people.
comment: Forma abreviada de la frase en inglés "trans for trans", traducida como "trans para trans", una etiqueta utilizada para describir a las personas trans que priorizan entablar relaciones románticas, sexuales o de otro tipo con otras personas trans.
alternative label: T4T (Trans for Trans)
alternative label: TFT
alternative label: Trans4Trans
alternative label: tft
alternative label: T4T
alternative label: Trans for trans
change note: Version 4.2.0
in scheme: v3
related: Partners of transgender people
related: Transgender people
related: Transgender community

Costumes
type: Concept
issued: 2022-01-18
modified: 2025-02-23
comment: Sets of clothing worn to emulate a particular person, place, thing, or time period.
comment: Conjuntos de ropa que se usan para emular a una persona, lugar, cosa o período de tiempo particular.
broader: Clothing
change note: Version 4.2.0
has top concept: Gender
in scheme: v3
preferred label: Disfraces
related: Drag
related: Halloween (LGBTQ+ culture)
related: Fursuits

Two-Spirit community
type: Concept
issued: 2022-01-19
modified: 2025-02-23
comment: A group of Two-Spirit people united by their shared identity.
comment: Grupos de personas que comparten la experiencia de la identidad dos espíritus.
alternative label: 2S community
alternative label: Two Spirit community
alternative label: Two Spirited community
alternative label: Two-Spirited community
change note: Version 4.2.0
in scheme: v3
preferred label: Comunidad dos espíritus
related: LGBTQ+ communities
related: Two-Spirit people
related: Two-Spirit community centers

Facial masculinization surgery
type: Concept
issued: 2022-02-14
modified: 2025-02-23
comment: Any of various surgeries undertaken to masculinize the face or facial features.
comment: Cualquiera de las diversas cirugías realizadas para masculinizar el rostro o los rasgos faciales.
alternative label: FMS
broader: Facial gender affirming surgery
change note: Version 4.2.0
has top concept: Medical care
in scheme: v3
preferred label: Cirugía de masculinización facial
preferred label: Facial masculinisation surgery
related: Transitioning status
related: Transitioning (Gender)
related: Facial feminization surgery

Chest reconstruction surgery
type: Concept
issued: 2022-02-14
modified: 2025-02-23
comment: Reconstruction of the chest, typically following a mastectomy, to give the chest a more masculine appearance.
comment: Reconstrucción del tórax, generalmente después de una mastectomía, para darle al tórax una apariencia más masculina.
alternative label: Chest wall reconstruction
alternative label: Reconstrucción de la pared toráxica
broader: Top surgery
change note: Version 4.2.0
has top concept: Medical care
in scheme: v3
preferred label: Cirugía de reconstrucción torácica
related: Transitioning (Gender)
related: Mastectomy
related: Chest

Stand-to-Pee devices
type: Concept
issued: 2022-02-15
modified: 2025-02-23
comment: Devices designed to allow individuals to pee while standing up; often used by trans men or transmasculine people to pee in public urinals without risking their safety.
alternative label: STP devices
alternative label: STPs
alternative label: Stand to pee devices
broader: Gender expression
change note: Version 4.2.0
has top concept: Gender
in scheme: v3
related: Binding (Chest)
related: Metoidioplasty
related: Neophallus

Lesbian hard of hearing people
type: Concept
issued: 2022-02-17
modified: 2025-02-23
comment: Lesbians with significant or total hearing loss who may or may not consider themselves d/Deaf.
comment: Lesbianas con pérdida auditiva significativa o total que pueden o no considerarse S/sordas.
alternative label: Hearing impaired lesbians
alternative label: HoH lesbians
alternative label: Lesbian HoH people
alternative label: Lesbian hearing impaired people
alternative label: Lesbianas con dificultades de audición
alternative label: Lesbianas con dificultades auditivas
broader: Lesbian disabled people
broader: LGBTQ+ hard of hearing people
change note: Version 4.2.0
has top concept: LGBTQ+ people
in scheme: v3
preferred label: Lesbianas con problemas de audición
related: Lesbian Deaf people
related: LGBTQ+ Deaf culture

Gay hard of hearing men
type: Concept
issued: 2022-02-17
modified: 2025-02-23
comment: Gay men with significant or total hearing loss who may or may not consider themselves d/Deaf.
comment: Hombres gay con pérdida auditiva significativa o total que pueden o no considerarse S/sordos.
alternative label: Gay HoH people
alternative label: Hearing impaired gay men
alternative label: HoH gay men
alternative label: Gay HoH men
alternative label: Gay hard of hearing people
alternative label: HoH gay people
alternative label: Gay hearing impaired men
alternative label: Hombres gay con dificultades de audición
alternative label: Hombres gay con dificultades auditivas
broader: Gay disabled men
broader: LGBTQ+ hard of hearing people
change note: Version 4.2.0
has top concept: LGBTQ+ people
in scheme: v3
preferred label: Hombres gay con problemas de audición
related: Gay Deaf men
related: LGBTQ+ Deaf culture

Bisexual hard of hearing people
type: Concept
issued: 2022-02-17
modified: 2025-02-23
comment: Bisexual people with significant or total hearing loss who may or may not consider themselves d/Deaf.
comment: Niñas (normalmente niñas menores de 18 años) que son bisexuales.
alternative label: Bisexual HoH people
alternative label: Bisexual hearing impaired people
alternative label: Hearing impaired bisexual people
alternative label: HoH bisexual people
broader: Bisexual disabled people
broader: LGBTQ+ hard of hearing people
change note: Version 4.2.0
has top concept: LGBTQ+ people
in scheme: v3
preferred label: Niñas bisexuales
related: Bisexual Deaf people
related: LGBTQ+ Deaf culture

Transgender hard of hearing people
type: Concept
issued: 2022-02-17
modified: 2025-02-23
comment: Transgender people with significant or total hearing loss who may or may not consider themselves d/Deaf.
comment: Personas transgénero con pérdida auditiva significativa o total, que pueden o no considerarse S/sordas.
alternative label: Hearing impaired transgender people
alternative label: HoH transgender people
alternative label: Transgender HoH people
alternative label: Transgender hearing impaired people
alternative label: Personas transgénero con dificultades de audición
alternative label: Personas transgénero con dificultades auditivas
broader: Transgender disabled people
broader: LGBTQ+ hard of hearing people
change note: Version 4.2.0
has top concept: LGBTQ+ people
in scheme: v3
preferred label: Personas transgénero con problemas de audición
related: Transgender Deaf people
related: LGBTQ+ Deaf culture

Queer hard of hearing people
type: Concept
issued: 2022-02-17
modified: 2025-02-23
comment: Queer people with significant or total hearing loss who may or may not consider themselves d/Deaf.
comment: Personas queer con pérdida auditiva significativa o total, que pueden o no considerarse S/sordas.
alternative label: Hearing impaired queer people
alternative label: HoH queer people
alternative label: Queer HoH people
alternative label: Queer hearing impaired people
alternative label: Personas queer con dificultades de audición
alternative label: Personas queer con dificultades auditivas
broader: Queer disabled people
broader: LGBTQ+ hard of hearing people
change note: Version 4.2.0
has top concept: LGBTQ+ people
in scheme: v3
preferred label: Personas queer con problemas de audición
related: Queer Deaf people
related: LGBTQ+ Deaf culture

Lesbian Deaf people
type: Concept
issued: 2022-02-17
modified: 2025-02-23
comment: Lesbians with significant or total hearing loss. Some but not all Deaf people prefer to capitalize Deaf in recognition of the cultural and linguistic identity they share with other Deaf people.
comment: Lesbianas con pérdida auditiva significativa o total. Algunas personas sordas, pero no todas, prefieren escribir “Sorda/o” con mayúscula en reconocimiento de la identidad cultural y lingüística que comparten con otras personas sordas.
alternative label: Deaf lesbians
alternative label: Sordas lesbianas
broader: Lesbian disabled people
broader: LGBTQ+ Deaf people
change note: Version 4.2.0
has top concept: LGBTQ+ people
in scheme: v3
preferred label: Personas lesbianas sordas
related: Lesbian hard of hearing people
related: LGBTQ+ Deaf culture

Gay Deaf men
type: Concept
issued: 2022-02-17
modified: 2025-02-23
comment: Gay men with significant or total hearing loss. Some but not all Deaf people prefer to capitalize Deaf in recognition of the cultural and linguistic identity they share with other Deaf people.
comment: Hombres gay con pérdida auditiva significativa o total. Algunas personas sordas, pero no todas, prefieren escribir “Sorda/o” con mayúscula en reconocimiento de la identidad cultural y lingüística que comparten con otras personas sordas.
alternative label: Deaf gay men
alternative label: Gay Deaf people
alternative label: Deaf gay people
alternative label: Hombres gay sordos
broader: Gay disabled men
broader: LGBTQ+ Deaf people
change note: Version 4.2.0
has top concept: LGBTQ+ people
in scheme: v3
preferred label: Personas gay sordas
related: Gay hard of hearing men
related: LGBTQ+ Deaf culture

Bisexual Deaf people
type: Concept
issued: 2022-02-17
modified: 2025-02-23
comment: Bisexual people with significant or total hearing loss. Some but not all Deaf people prefer to capitalize Deaf in recognition of the cultural and linguistic identity they share with other Deaf people.
comment: Personas bisexuales con pérdida auditiva significativa o total. Algunas personas sordas, pero no todas, prefieren escribir “Sorda/o” con mayúscula en reconocimiento de la identidad cultural y lingüística que comparten con otras personas sordas.
alternative label: Deaf bisexual people
alternative label: Sordos bisexuales
alternative label: Personas sordas bisexuales
alternative label: Sordas bisexuales
broader: Bisexual disabled people
broader: LGBTQ+ Deaf people
change note: Version 4.2.0
has top concept: LGBTQ+ people
in scheme: v3
preferred label: Personas bisexuales sordas
related: Bisexual hard of hearing people
related: LGBTQ+ Deaf culture

Transgender Deaf people
type: Concept
issued: 2022-02-17
modified: 2025-02-23
comment: Transgender people with significant or total hearing loss. Some but not all Deaf people prefer to capitalize Deaf in recognition of the cultural and linguistic identity they share with other Deaf people.
comment: Personas transgénero con pérdida auditiva significativa o total. Algunas personas sordas, pero no todas, prefieren escribir “Sorda/o” con mayúscula en reconocimiento de la identidad cultural y lingüística que comparten con otras personas sordas.
alternative label: Deaf transgender people
alternative label: Personas sordas transgénero
broader: Transgender disabled people
broader: LGBTQ+ Deaf people
change note: Version 4.2.0
has top concept: LGBTQ+ people
in scheme: v3
preferred label: Personas transgénero sordas
related: Transgender hard of hearing people
related: LGBTQ+ Deaf culture

Queer Deaf people
type: Concept
issued: 2022-02-17
modified: 2025-02-23
comment: Queer people with significant or total hearing loss. Some but not all Deaf people prefer to capitalize Deaf in recognition of the cultural and linguistic identity they share with other Deaf people.
comment: Personas queer con pérdida auditiva significativa o total. Algunas personas sordas, pero no todas, prefieren escribir “Sorda/o” con mayúscula en reconocimiento de la identidad cultural y lingüística que comparten con otras personas sordas.
alternative label: Deaf queer people
alternative label: Personas sordas queer
broader: Queer disabled people
broader: LGBTQ+ Deaf people
change note: Version 4.2.0
has top concept: LGBTQ+ people
in scheme: v3
preferred label: Personas queer sordas
related: Queer hard of hearing people
related: LGBTQ+ Deaf culture

Transgender people with chronic illnesses
type: Concept
issued: 2022-02-17
modified: 2025-02-23
comment: Transgender people who have long-term health conditions that require continued medical attention and/or significantly impact or limit daily life; some but not all people with chronic illnesses consider themselves disabled.
comment: Personas transgénero que tienen condiciones de salud a largo plazo que requieren atención médica continua y/o impactan o limitan significativamente la vida diaria; algunas, pero no todas, las personas con enfermedades crónicas se consideran discapacitadas.
alternative label: Chronically ill transgender people
alternative label: Personas con enfermedades crónicas transgénero
alternative label: Enfermos crónicos transgénero
alternative label: Enfermas crónicas transgénero
broader: LGBTQ+ people with chronic illnesses
change note: Version 4.2.0
has top concept: LGBTQ+ people
in scheme: v3
preferred label: Personas transgénero con enfermedades crónicas
related: Transgender people
related: Transgender disabled people
related: Transgender wheelchair users

Anti-intersex discrimination
type: Concept
issued: 2022-02-28
modified: 2025-02-23
comment: The unjust or prejudicial treatment of intersex people due to the fact that they are intersex; may include the denial of legal rights, employment, and housing.
comment: El trato injusto o perjudicial hacia las personas intersexuales por el hecho de ser intersex; puede incluir la negación de derechos legales, empleo y vivienda.
broader: LGBTQ+ discrimination
change note: Version 4.2.0
has top concept: LGBTQ+ discrimination
in scheme: v3
preferred label: Discriminación anti-intersex
related: Intolerance towards LGBTQ+ people
related: Intersexphobia
related: Anti-gender movement

Endosex
type: Concept
issued: 2022-02-28
modified: 2025-02-23
comment: The state of individuals born with the sexual anatomy, reproductive system, and chromosomes associated with their assigned sex (i.e., not intersex).
comment: El estado de las personas que nacen con la anatomía sexual, el sistema reproductivo y los cromosomas asociados con su sexo asignado (es decir, no intersexual).
alternative label: Dyadic
alternative label: Non-intersex
alternative label: Perisex
alternative label: No-intersex
broader: Sex (Body)
change note: Version 4.2.0
has top concept: Sex (Body)
in scheme: v3
related: Sex assigned at birth
related: Assigned sex
related: Endosex people

Endosex people
type: Concept
issued: 2022-02-28
modified: 2025-02-23
comment: Individuals born with the sexual anatomy, reproductive system, and chromosomes associated with their assigned sex (i.e., people who are not intersex).
comment: Personas que nacen con la anatomía sexual, el sistema reproductivo y los cromosomas asociados con su sexo asignado (es decir, personas que no son intersex).
alternative label: Dyadic people
alternative label: Non-intersex people
alternative label: Perisex people
alternative label: Personas no-intersex
change note: Version 4.2.0
in scheme: v3
preferred label: Personas endosex
related: Sex assigned at birth
related: Assigned sex
related: Endosex

Passing (Sexuality)
type: Concept
issued: 2022-02-28
modified: 2025-02-23
comment: The ability of a person who is not heterosexual to "pass," or be accepted or regarded as heterosexual by others. "Passing" has historically been used to describe an individual's ability to "pass" as a certain race or ethnicity, though the term was later appropriated by the LGBTQ+ community.
comment: La capacidad de una persona que no es heterosexual de "pasar", ser aceptada o considerada heterosexual por otras personas. "Pasar" se ha utilizado históricamente para describir la capacidad de una persona de "pasar" como una determinada raza o etnia, aunque eventualmente la comunidad LGBTQ+ se apropió del término.
alternative label: Passing (Sexual identity)
alternative label: Passing (Sexual orientation)
alternative label: Pasando
alternative label: Pasar desapercibido
change note: Version 4.2.0
in scheme: v3
preferred label: Passing (sexualidad)
related: Passing (Gender)
related: Sexual identity
related: Sexuality

Two-Spirit identity
type: Concept
issued: 2022-03-29
modified: 2025-02-23
comment: Identity term used by Indigenous people in North America to reconnect with the multiple gender and sexual roles in Indigenous cultures.
comment: Término de identidad utilizado por las comunidades indígenas de Norteamérica para reconectar con los múltiples roles de género y sexuales de las culturas indígenas.
alternative label: 2S identity
alternative label: Two Spirit identity
alternative label: Two Spirited identity
alternative label: Two-Spirited identity
broader: Non-Euro-American gender and sexual identities
change note: Version 4.2.0
has top concept: Gender
in scheme: v3
preferred label: Identidad dos espíritus
related: Berdache
related: Native American LGBTQ+ people
related: Appropriation of Two-Spirit identity

Polysexual people
type: Concept
issued: 2022-03-31
modified: 2025-02-23
comment: Individuals who experience sexual attraction to more than one gender; includes bisexual and pansexual people.
comment: Personas que sienten atracción sexual por más de un género; incluye personas bisexuales y pansexuales.
alternative label: Polysexuals
alternative label: Polisexuales
broader: Bi+ people
broader: LGBTQ+ people
change note: Version 4.2.0
has top concept: LGBTQ+ people
in scheme: v3
preferred label: Personas polisexuales
related: Bisexuality
related: Polysexuality

Pansexuality
type: Concept
issued: 2022-03-31
modified: 2025-02-23
comment: Sexual identity used to describe sexual and/or romantic attraction to people of all genders.
comment: Identidad sexual utilizada para describir la atracción sexual y/o romántica hacia personas de todos los géneros.
broader: Sexual identity
broader: Sexual orientation
broader: Polysexuality
change note: Version 4.2.0
has top concept: Sexual identity
in scheme: v3
preferred label: Pansexualidad
related: Pansexual people

BIPOC
type: Concept
issued: 2022-04-18
modified: 2025-02-23
comment: Acronym primarily used in the United States to describe Black, Indigenous, and people of color as a group, while also centering the specific experiences of Black and Indigenous people.
comment: Acrónimo utilizado principalmente en los Estados Unidos para describir a personas negras, indígenas y de color como grupo, centrando, a la vez, en las experiencias específicas de las personas negras e indígenas.
alternative label: Black, Indigenous, and people of color
alternative label: Black, Indigenous, and people of colour
alternative label: Personas negras, indígenas y de color
change note: Version 4.2.0
in scheme: v3
related: Black LGBTQ+ people
related: LGBTQ+ people of color
related: QTPOC

Indigenous intersex people
type: Concept
issued: 2022-05-11
modified: 2025-02-23
comment: Intersex people who are part of an Indigenous people, or culturally distinct ethnic group whose members are directly descended from the earliest known inhabitants of a particular region and, to some extent, maintain the language and culture of those people. Only use to describe people who identify as Indigenous; use more specific terms whenever possible.
comment: Personas intersexuales que forman parte de un pueblo indígena o grupo étnico culturalmente distinto cuyos miembros descienden directamente de los primeros habitantes conocidos de una región en particular y, hasta cierto punto, mantienen el idioma y la cultura de ese pueblo. Utilícese únicamente para describir a personas que se autoidentifiquen como indígenas; utilícese términos más específicos siempre que sea posible.
alternative label: Intersex Indigenous people
alternative label: Personas indígenas intersex
alternative label: Personas intersex indígenas
broader: Indigenous LGBTQ+ people
change note: Version 4.2.0
has top concept: LGBTQ+ people
in scheme: v3
narrower: Pacific Islander American intersex people
narrower: Kānaka Maoli intersex people
narrower: Native American intersex people
preferred label: Personas intersexuale indígenas

LGBTQ+ vlogs
type: Concept
issued: 2022-05-11
modified: 2026-02-23
comment: A form of online blogging via short videos about an individual's life; use in reference to vlogs created by LGBTQ+ people or focusing on LGBTQ+ issues.
comment: Una forma de blogueo en línea a través de videos cortos sobre la vida de una persona; utilícese en referencia a vlogs creados por personas LGBTQ+ o que se centren en asuntos LGBTQ+.
alternative label: LGBTQ+ video blogs
alternative label: Video blogs (LGBTQ)
alternative label: Vlogs (LGBTQ)
broader: Blogs
broader: LGBTQ+ home movies
change note: Version 4.2.0
has top concept: LGBTQ+ social media
in scheme: v3
preferred label: Vlogs LGBTQ+
related: LGBTQ+ social media
related: LGBTQ+ podcasts

Nipple
type: Concept
issued: 2022-05-11
modified: 2025-02-23
comment: The small protuberance of a mammary gland.
comment: La pequeña protuberancia de una glándula mamaria.
alternative label: Nipples
alternative label: Pezones
alternative label: Tetilla
alternative label: Tetillas
broader: Erogenous body parts
change note: Version 4.2.0
has top concept: Erogenous body parts
in scheme: v3
preferred label: Pezón
related: Nipple clamps
related: Nipple play
related: Nipple torture

Greyromantic people
type: Concept
issued: 2022-05-11
modified: 2025-02-23
comment: Individuals who experience rare, infrequent, or low-intensity romantic attraction.
comment: Personas que experimentan una atracción romántica rara, poco frecuente o de baja intensidad.
alternative label: Gray-romantic people
alternative label: Grayromantic people
alternative label: Grayromantics
alternative label: Grey-romantic people
alternative label: Greyromantics
alternative label: Personas gris-románticas
alternative label: Grisrománticos
alternative label: Personas gris románticas
broader: Romantic minorities
change note: Version 4.2.0
has top concept: Romantic minorities
in scheme: v3
narrower: Greyromantic college students
preferred label: Personas grisrománticas
related: Greysexual people
related: Greyromanticism

Transgender people in the workplace
type: Concept
issued: 2022-06-15
modified: 2025-02-23
comment: The presence of transgender people in the workplace, including acceptance of and issues faced by transgender workers.
comment: La presencia de personas transgénero en el lugar de trabajo, incluida la aceptación de los trabajadores transgénero y los problemas a los que se enfrentan.
broader: LGBTQ+ people in the workplace
change note: Version 4.2.0
has top concept: LGBTQ+ employment
in scheme: v3
preferred label: Personas transgénero en el lugar de trabajo
related: Transgender people
related: Transgender-owned businesses
related: Transgender-focused businesses

Queer gaze
type: Concept
issued: 2022-06-15
modified: 2025-02-23
comment: A term used to describe the ways LGBTQ+ people create and engage with media and art, in contrast to the male gaze, female gaze, or straight gaze.
comment: Un término utilizado para describir las formas en que las personas LGBTQ+ crean e interactúan con los medios y el arte, en contraste a la mirada masculina, la mirada femenina o la mirada hetero.
broader: Queer theory
change note: Version 4.2.0
has top concept: Theories
in scheme: v3
preferred label: Mirada queer
related: Queer (Verb)
related: Female gaze
related: Male gaze

Actorfic
type: Concept
issued: 2022-07-04
modified: 2025-02-23
comment: Fanfiction that focuses on, incorporates, or details the relationships of real-life actors, often of the same sex or gender.
comment: Fanfiction que se centra, incorpora o detalla las relaciones de actores de la vida real, a menudo del mismo sexo o género.
alternative label: Actor fanfic
alternative label: Actor fic
broader: Real person fiction
change note: Version 4.2.0
has top concept: Subcultures
in scheme: v3
related: LGBTQ+ actors
related: LGBTQ+ films
related: Homoeroticism

Aromantic people in fandom
type: Concept
issued: 2022-07-04
modified: 2025-02-23
comment: The participation and inclusion of aromantic people in fan communities.
comment: La participación e inclusion de personas arrománticas en comunidades de fans.
alternative label: Aromantics in fandom
alternative label: Arrománticos en fandom
alternative label: Arrománticas en fandom
broader: LGBTQ+ people in fandom
change note: Version 4.2.0
has top concept: LGBTQ+ people
in scheme: v3
preferred label: Personas arrománticas en fandom
related: Aromantic people
related: Aromantic authors
related: Aromantic fiction

Asexual people in fandom
type: Concept
issued: 2022-07-04
modified: 2025-02-23
comment: The participation and inclusion of asexual people in fan communities.
comment: La participación e inclusión de las personas asexuales en las comunidades de aficionados.
alternative label: Asexuals in fandom
alternative label: Asexuales en fandom
broader: LGBTQ+ people in fandom
change note: Version 4.2.0
has top concept: LGBTQ+ people
in scheme: v3
preferred label: Personas asexuales en fandom
related: Asexual people
related: Asexual authors
related: Asexual fiction

Bara
type: Concept
issued: 2022-07-04
modified: 2025-02-23
comment: A genre of Japanese art created primarily by gay men for other gay men that emphasizes masculinity, muscles, body fat, and hair (similar to Bears and Gym subculture in the United States).
comment: Género de arte japonés creado principalmente por hombres gay para otros hombres gay que enfatiza la masculinidad, los músculos, la grasa corporal y el vello (similar a la subcultura de los osos y los gimnasios en los Estados Unidos).
broader: Bara fandom
change note: Version 4.2.0
has top concept: Subcultures
in scheme: v3
related: Bears (Gay culture)
related: Macho men
related: Gym subculture

Bishounen
type: Concept
issued: 2022-07-04
modified: 2025-02-23
comment: Japanese word that means "beautiful boy" and is used to describe a particular aesthetic of androgynous male beauty. While in Japanese "bishounen" refers specifically to youths under the age of twenty and "biseinen" is used to describe beautiful adult men, English-speaking anime and manga fan communities often use "bishounen" in reference to any good-looking male character, regardless of age.
comment: Palabra japonesa que significa “niño hermoso” y que se utiliza para describir una estética particular de belleza masculina andrógina. Mientras que en japonés "bishounen" se refiere específicamente a jóvenes menores de veinte años y "biseinen" se usa para describir hombres adultos hermosos, las comunidades de fanáticos del anime y manga de habla inglesa a menudo usan "bishounen" en referencia a cualquier personaje masculino atractivo, independientemente de la edad.
broader: Anime and manga fandom
change note: Version 4.2.0
has top concept: Subcultures
in scheme: v3
related: Youth
related: Boys' Love (Genre)
related: Seme (Yaoi)
related: Uke (Yaoi)

Fanart
type: Concept
issued: 2022-07-04
modified: 2025-02-23
comment: Art created by fans that relates to media properties or other subjects of fandom.
comment: Arte creado por fanáticos que se relaciona con propiedades de los medios u otros temas del fandom.
alternative label: Fan art
alternative label: Arte de fans
broader: Fanworks
change note: Version 4.2.0
has top concept: Subcultures
in scheme: v3
narrower: Slash art
related: Fanfiction
related: Slash fanworks

Furry conventions
type: Concept
issued: 2022-07-04
modified: 2025-02-23
comment: Conventions for furries that focus on furry fanworks.
comment: Convenciones para furros que se centran en obras de fans furro.
alternative label: Furry cons
broader: Fandom conventions
broader: Furry fandom
change note: Version 4.2.0
has top concept: Subcultures
in scheme: v3
preferred label: Convenciones de furros
related: Europride
related: LGBTQ+ meeting places

Homophobia in fandom
type: Concept
issued: 2022-07-04
modified: 2025-02-23
comment: Issues and discussions about the presence of homophobia in fan spaces and works.
comment: Cuestiones y discusiones sobre la presencia de la homofobia en espacios y obras de fans.
broader: Homophobia
broader: Gender in fandom
change note: Version 4.2.0
has top concept: LGBTQ+ phobia
in scheme: v3
preferred label: Homofobia en el fandom
related: LGBTQ+ people in fandom
related: Racism in fandom

Kirk/Spock
type: Concept
issued: 2022-07-04
modified: 2025-02-23
comment: The homoerotic fan pairing of Kirk and Spock from Star Trek: The Original Series. The Kirk/Spock fandom originated much of the terminology and practices associated with fandom today--for example, the word "slash" comes from the forward slash in Kirk/Spock.
comment: El emparejamiento homoerótico por fans de Kirk y Spock de "Star Trek: The Original Series". El fandom de Kirk/Spock originó gran parte de la terminología y las prácticas asociadas con el fandom actual; por ejemplo, la palabra "slash" proviene de la barra diagonal en Kirk/Spock.
alternative label: K/S
alternative label: Spirk
broader: Ship names in fandom
change note: Version 4.2.0
has top concept: Subcultures
in scheme: v3
related: LGBTQ+ science fiction
related: Homoeroticism
related: One true pairing

Lesbians in fandom
type: Concept
issued: 2022-07-04
modified: 2025-02-23
comment: The participation and inclusion of lesbians in fan communities.
comment: La participación e inclusión de lesbianas en las comunidades de fans.
alternative label: Lesbians in fan communities
alternative label: Lesbianas en comunidades fan
broader: LGBTQ+ people in fandom
change note: Version 4.2.0
has top concept: LGBTQ+ people
in scheme: v3
preferred label: Lesbianas en fandom
related: Lesbians
related: Lesbian fiction
related: Lesbian authors

LGBTQ+ fanfiction
type: Concept
issued: 2022-07-04
modified: 2025-02-23
comment: Fanfiction that primarily focuses on LGBTQ+ people, communities, and relationships, often using characters who are not stated to be LGBTQ+ in canon.
comment: Fanfiction que se centra principalmente en personas, comunidades y relaciones LGBTQ+, y que a menudo utiliza personajes que no están declarados como LGBTQ+ en el canon.
alternative label: Fan fic (LGBTQ)
alternative label: Fan fics (LGBTQ)
alternative label: Fan fiction (LGBTQ)
alternative label: Fanfiction (LGBTQ)
alternative label: LGBTQ+ fan fics
alternative label: LGBTQ+ fan fiction
alternative label: LGBTQ+ fanfics
broader: Fanfiction
change note: Version 4.2.0
has top concept: Subcultures
in scheme: v3
preferred label: Fanfiction LGBTQ+
related: LGBTQ+ fiction
related: LGBTQ+ youth literature
related: LGBTQ+ authors

Misogyny in fandom
type: Concept
issued: 2022-07-04
modified: 2025-02-23
comment: Issues and discussions about the presence of misogyny in fan spaces and works.
comment: Cuestiones y discusiones sobre la presencia de la misoginia en espacios y obras de fans.
alternative label: Sexism in fandom
alternative label: Sexismo en fandom
broader: Misogyny
broader: Gender in fandom
change note: Version 4.2.0
has top concept: Misogyny
in scheme: v3
preferred label: Misoginia en fandom
related: Sexism
related: Racism in fandom

Original slash fiction
type: Concept
issued: 2022-07-04
modified: 2025-02-23
comment: Original works of creative fiction that focus on same-sex or same-gender relationships and incorporate tropes from fanfiction; includes femslash fiction.
comment: Obras originales de ficción creativa que se centran en relaciones entre personas del mismo sexo o del mismo género e incorporan tropos de fanfiction; incluye la ficción femslash.
broader: Slash fiction
change note: Version 4.2.0
has top concept: Subcultures
in scheme: v3
preferred label: Ficción slash orginal
related: LGBTQ+ fiction
related: LGBTQ+ erotic literature
related: Yaoi

Queer people in fandom
type: Concept
issued: 2022-07-04
modified: 2025-02-23
comment: The participation and inclusion of queer people in fan communities.
comment: La participación e inclusión de personas queer en las comunidades de fans.
broader: LGBTQ+ people in fandom
change note: Version 4.2.0
has top concept: LGBTQ+ people
in scheme: v3
preferred label: Personas queer en fandom
related: Queer fiction
related: Queer people
related: Queer authors

Shipping in fandom
type: Concept
issued: 2022-07-04
modified: 2025-02-23
comment: Term used to describe fans' desire to see certain characters in sexual or romantic relationships, as well as the practice of pairing those characters in fanworks. The terms "shipping" and "ship" come from "relationship."
comment: Término utilizado para describir el deseo de los fans de ver a ciertos personajes en relaciones sexuales o románticas, así como la práctica de emparejar a esos personajes en obras de fans. Los términos "shipping" y "ship" provienen de "relationship" en inglés.
alternative label: Shipping en el fandom
broader: Fandom
change note: Version 4.2.0
has top concept: Subcultures
in scheme: v3
narrower: Pairings in fandom
narrower: Ship names in fandom
preferred label: Shippeo en el fandom
related: LGBTQ+ headcanons

Slash conventions
type: Concept
issued: 2022-07-04
modified: 2025-02-23
comment: Conventions focused on slash, or fanworks depicting same-sex or same-gender couples that are typically erotic or pornographic in nature. Historically used for male-male couples only, but is now used more broadly; includes femslash conventions.
comment: Convenciones centradas en slash, o fanworks que representan parejas del mismo sexo o del mismo género que son típicamente de naturaleza erótica o pornográfica. Históricamente se utilizaba únicamente para parejas de hombres, pero ahora se utiliza de forma más amplia; incluye convenciones del femslash.
alternative label: Slash cons
alternative label: Cons slash
broader: Fandom conventions
broader: Slash fandom
change note: Version 4.2.0
has top concept: Subcultures
in scheme: v3
preferred label: Convenciones slash
related: Europride
related: LGBTQ+ meeting places

Transfic
type: Concept
issued: 2022-07-04
modified: 2025-02-23
comment: Term used to describe fanfiction about trans characters, typically characters who are not stated to be transgender, transsexual, or gender diverse in the canon text
comment: Término utilizado para describir fanfiction sobre personajes trans, generalmente personajes que no se declaran como transgénero, transexual o de género diverso en el texto canónico.
broader: Fanfiction
change note: Version 4.2.0
has top concept: Subcultures
in scheme: v3
related: Gender swapping
related: Transgender fiction
related: Alternate universe settings (Fanfiction)

Transphobia in fandom
type: Concept
issued: 2022-07-04
modified: 2025-02-23
comment: Issues and discussions about the presence of transphobia in fan spaces and works.
comment: Asuntos y debates sobre la presencia de la transfobia en espacios y obras de fans.
broader: Transphobia
broader: Gender in fandom
change note: Version 4.2.0
has top concept: LGBTQ+ phobia
in scheme: v3
preferred label: Transfobia en fandom
related: LGBTQ+ people in fandom
related: Racism in fandom

Two-Spirit people in fandom
type: Concept
issued: 2022-07-04
modified: 2025-02-23
comment: The participation and inclusion of Two-Spirit people in fan communities.
comment: La participación e inclusión de las personas dos espíritus en las comunidades de aficionados.
alternative label: 2S people in fandom
alternative label: Two Spirit people in fandom
alternative label: Two Spirited people in fandom
alternative label: Two-Spirited people in fandom
broader: Gender in fandom
change note: Version 4.2.0
has top concept: Subcultures
in scheme: v3
preferred label: Personas dos espíritus en fandom
related: Two-Spirit people
related: Two-Spirit fiction
related: LGBTQ+ people in fandom

Yuri
type: Concept
issued: 2022-07-04
modified: 2025-02-23
comment: A genre focusing on the romantic or sexual relationships between female characters from anime and manga.
comment: Un género del anime y manga que se centra en las relaciones románticas o sexuales entre personajes femeninos.
broader: Yuri fandom
change note: Version 4.2.0
has top concept: Subcultures
in scheme: v3
related: Lesbian fiction
related: Lesbian erotic literature
related: Femslash

Sobriety
type: Concept
is replaced by: homoit0002228
issued: 2020-06-03
issued: 2022-07-19
modified: 2022-12-16
modified: 2025-04-24
replaces: sobriety
comment: Conscious abstinence from addictive or mind-altering substances, typically alcohol or drugs.
comment: LGBTQ+ people intentionally refraining from substance use (typically drugs or alcohol). Follow the individual's preference for "sobriety" or "recovery" whenever possible.
comment: Personas LGBTQ+ que se abstienen intencionalmente de consumir sustancias (usualmente drogas o alcohol). Siga la preferencia de la persona sobre el uso de "sobriedad" o "recuperación" siempre que sea posible.
alternative label: LGBTQ+ sober people
alternative label: Sober LGBTQ+ people
alternative label: Sober people (LGBTQ)
alternative label: Sobriety (LGBTQ)
broader: LGBTQ+ people
change note: Version 4.2.0
has top concept: LGBTQ+ people
in scheme: v3
preferred label: LGBTQ+ people practicing sobriety
preferred label: Personas LGBTQ+ que practican la sobriedad
related: Party drugs
related: Recovery groups
related: Two-Spirit people practicing sobriety

Gender-neutral language
type: Concept
issued: 2022-11-08
modified: 2025-02-23
comment: Language that avoids the use of gender-specific words, either to be inclusive of nonbinary, agender, and other gender diverse peoples, or to avoid gender bias.
comment: Lenguaje que evita el uso de palabras generizadas, ya sea para incluir a personas no binarias, agénero y otras personas género-diversas, o para evitar prejuicios de género.
alternative label: Gender inclusive language
alternative label: Gender neutral language
alternative label: Gender-inclusive language
alternative label: Lenguaje de género inclusivo
alternative label: Lenguage inclusivo
alternative label: Lenguaje de género neutral
alternative label: Lenguaje neutro
change note: Version 4.2.0
in scheme: v3
preferred label: Lenguaje de género neutro
related: Misgendering
related: Pronouns
related: Sexism

QTPOC
type: Concept
issued: 2022-11-08
modified: 2025-02-23
comment: Acronym used to refer to queer and trans people of color as a group. Typically used to acknowledge the particularities of queer and trans people of color's experiences and the intersections of queerphobia, transphobia, and racism as directed towards queer and trans people of color.
comment: Acrónimo utilizado para referirse a personas de color queer y trans como grupo. Normalmente se utiliza para reconocer las particularidades de las experiencias de las personas queer y trans de color y las intersecciones de la queerfobia, la transfobia y el racismo dirigidas hacia las personas queer y trans de color.
alternative label: Queer and trans people of color
alternative label: Personas queer y trans de color
change note: Version 4.2.0
in scheme: v3
related: Transmisogyny
related: BIPOC
related: LGBTQ+ people of color

Transfeminism
type: Concept
issued: 2022-11-08
modified: 2025-02-28
comment: As defined by Emi Koyama, transfeminism is a movement by and for trans woman who view the liberation of trans women as essential to the liberation of all women.
comment: Como lo define Emi Koyama, el transfeminismo es un movimiento por y para mujeres trans que ven la liberación de las mujeres trans como esencial para la liberación de todas las mujeres.
alternative label: Trans feminism
alternative label: Trans feminismo
broader: Feminism
change note: Version 4.2.0
has top concept: Feminism
in scheme: v3
preferred label: Transfeminismo
related: Intersectionality
related: Trans women
related: Transmisogyny

Chemsex
type: Concept
issued: 2022-11-10
modified: 2025-04-24
comment: Sexual activities that include the use of drugs, typically to trigger sexual arousal, increase sexual pleasure, and/or facilitate sexual encounters that last several hours or days.
comment: Actividades sexuales que incluyen el uso de drogas, generalmente para desencadenar la excitación sexual, aumentar el placer sexual y/o facilitar encuentros sexuales que duran varias horas o días.
broader: Sex (Act)
change note: Version 4.2.0
has top concept: Sex (Act)
in scheme: v3
preferred label: Sexdopaje
related: Erection pills
related: Party drugs
related: Two-Spirit people who use substances for recreational purposes

Sons
type: Concept
issued: 2022-12-13
modified: 2025-02-23
comment: People who are sons.
comment: Personas que son hijos.
broader: Family members
change note: Version 4.2.0
has top concept: Family members
in scheme: v3
narrower: LGBTQ+ sons
narrower: Sons of LGBTQ+ people
narrower: Two-Spirit sons
preferred label: Hijos

Police harassment of LGBTQ+ people
type: Concept
issued: 2023-01-13
modified: 2025-02-23
comment: Any of various forms of inappropriate conduct, illegal actions, or abuses of power undertaken by law enforcement agents or agents of the state against LGBTQ+ members of the public. This includes but is not limited to racial, ethnic, and other forms of profiling; unwarranted surveillance, searches, and seizure; selective enforcement; excessive use of force; sexual misconduct; intimidation and witness tampering; falsification of evidence; coerced confessions; false arrests and imprisonment; and bribing or lobbying.
comment: Cualquiera de las diversas formas de conducta inapropiada, acciones ilegales o abusos de poder que violentan directa o indirectamente a las personas LGBTQ+, incluidas, entre otras, confesiones forzadas, intimidación, arrestos y encarcelamientos falsos, falsificación de pruebas, perjurio policial, manipulación de testigos, brutalidad y corrupción policial, elaboración de caracterizaciones raciales, étnicos y de otro tipo, vigilancia injustificada, registros o incautación de propiedad, soborno o cabildeo para obtener poder o estatus excesivo o para evitar consecuencias, aplicación selectiva de la ley y conducta sexual inapropiada.
alternative label: Mistreatment of LGBTQ+ people by police
alternative label: Harassment of LGBTQ+ people by police
alternative label: Police brutality toward LGBTQ+ people
alternative label: Police misconduct toward LGBTQ+ people
alternative label: Police mistreatment of LGBTQ+ people
alternative label: Maltrato hacia personas LGBTQ+ por la policía
alternative label: Acoso de personas LGBtQ+ por la policía
alternative label: Brutalidad policial hacia personas LGBTQ+
alternative label: Mala conducta policial hacia personas LGBTQ+
alternative label: Maltrato policial contra personas LGBTQ+
broader: Police harassment
broader: Police interactions with LGBTQ+ people
change note: Version 4.2.0
has top concept: Harassment
in scheme: v3
narrower: Police harassment of Black LGBTQ+ people
narrower: Police harassment of Indigenous LGBTQ+ people
preferred label: Acoso policial a personas LGBTQ+

Police harassment of Black LGBTQ+ people
type: Concept
issued: 2023-01-13
modified: 2025-02-23
comment: Any of various forms of inappropriate conduct, illegal actions, or abuses of power undertaken by law enforcement agents or agents of the state against Black LGBTQ+ members of the public. This includes but is not limited to racial, ethnic, and other forms of profiling; unwarranted surveillance, searches, and seizure; selective enforcement; excessive use of force; sexual misconduct; intimidation and witness tampering; falsification of evidence; coerced confessions; false arrests and imprisonment; and bribing or lobbying.
comment: Cualquiera de las diversas formas de conducta inapropiada, acciones ilegales o abusos de poder que violentan directa o indirectamente a las personas LGBTQ+ negras, incluidas, entre otras, confesiones forzadas, intimidación, arrestos y encarcelamientos falsos, falsificación de pruebas, perjurio policial, manipulación de testigos, brutalidad y corrupción policial, elaboración de caracterizaciones raciales, étnicos y de otro tipo, vigilancia injustificada, registros o incautación de propiedad, soborno o cabildeo para obtener poder o estatus excesivo o para evitar consecuencias, aplicación selectiva de la ley y conducta sexual inapropiada.
broader: Police harassment of LGBTQ+ people
change note: Version 4.2.0
has top concept: Harassment
in scheme: v3
preferred label: Acoso policial a personas LGBTQ+ negras
related: Black LGBTQ+ people
related: Anti-Blackness
related: White supremacy in policing

Police violence toward LGBTQ+ people
type: Concept
issued: 2023-01-13
modified: 2025-02-23
comment: Any of various forms of police violence aimed toward LGBTQ+ people.
comment: Cualquiera de las diversas formas de violencia policial dirigida hacia personas LGBTQ+.
alternative label: Police abuse toward LGBTQ+ people
alternative label: Police torture of LGBTQ+ people
alternative label: Abuso policial contra personas LGBTQ+
alternative label: Tortura policial contra personas LGBTQ+
broader: Anti-LGBTQ+ violence
broader: Police interactions with LGBTQ+ people
change note: Version 4.2.0
has top concept: Anti-LGBTQ+ violence
in scheme: v3
narrower: Police raids on LGBTQ+-related establishments
narrower: Shootings of LGBTQ+ people by police
preferred label: Violencia policial hacia personas LGBTQ+

No Police at Pride
type: Concept
issued: 2023-01-13
modified: 2026-02-27
comment: Primarily Canadian and U.S. American movement wherein police officers were banned from LGBTQ+ pride events in some locations, due to historical and contemporary mistreatment of LGBTQ+ persons, especially Black and Indigenous LGBTQ+ persons. In recent years acted as a response to the 2010-2017 Toronto serial homicides and the mishandling of the investigation by the Toronto Police Service.
comment: Movimiento principalmente canadiense y estadounidense en el que se le prohibió a agentes de policía participar en eventos del orgullo LGBTQ+ en algunos lugares, debido al maltrato histórico y contemporáneo hacia las personas LGBTQ+, especialmente las personas LGBTQ+ negras e indígenas. En los últimos años, fungió como respuesta a los homicidios en serie de Toronto de 2010-2017 y al mal manejo de la investigación por parte del Servicio Policial de Toronto.
alternative label: No Cops at Pride movement
alternative label: No Cops at Pride
alternative label: No Police at Pride movement
alternative label: Movimiento No Cops at Pride
alternative label: Moviento No Police at Pride
change note: Version 4.2.0
in scheme: v3
related: Pride events
related: LGBTQ+ pride
related: Police

Digital identification of LGBTQ+ people by police
type: Concept
issued: 2023-01-13
modified: 2026-02-27
comment: Identification of LGBTQ+ people, or people believed to be LGBTQ+, by police using digital tools, such as phone records, mobile applications, facial identification algorithms, and artificial intelligence technologies. Such data is then used to entrap and prosecute LGBTQ+ persons, especially in areas where being LGBTQ+ is criminalized.
comment: Identificación de personas LGBTQ+, o personas que se cree que son LGBTQ+, por parte de la policía utilizando herramientas digitales, como registros telefónicos, aplicaciones móviles, algoritmos de identificación facial y tecnologías de inteligencia artificial. Luego, esos datos se utilizan para atrapar y procesar a personas LGBTQ+, especialmente en áreas donde ser LGBTQ+ aún está criminalizado.
alternative label: Digital stop and search to identify LGBTQ+ people
alternative label: Identification of LGBTQ+ people by police using phone data
alternative label: Police use of digital tools to identify LGBTQ+ people
alternative label: Detenciones y registros digitales para identificar a personas LGBTQ+
alternative label: Identificación de personas LGBTQ+ por la policía mediante datos telefónicos
alternative label: Uso policial de herramientas digitales para identificar a personas LGBTQ+
broader: Identification of LGBTQ+ people by police
change note: Version 4.2.0
has top concept: Police interactions with LGBTQ+ people
in scheme: v3
preferred label: Identificación digital de personas LGBTQ+ por parte de la policía
related: Dating applications
related: LGBTQ+ dating websites
related: Police

White supremacy in policing
type: Concept
issued: 2023-01-13
modified: 2025-02-23
comment: Historical and contemporary linkages between white supremacist ideologies and modern policing institutions, primarily discussed within the context of the countries of Canada and the United States.
comment: Vínculos históricos y contemporáneos entre las ideologías supremacistas blancas y las instituciones policiales modernas, discutidos principalmente en el contexto de los países de Canadá y Estados Unidos.
alternative label: Far-right presence in police forces
alternative label: Infiltration of police by white supremacists
alternative label: Law enforcement and white supremacy
alternative label: Police and right-wing extremism
alternative label: Police officer ties with white supremacists
alternative label: Police with far-right ties
alternative label: Presencia de la extrema derecha en las fuerzas policiales
alternative label: Infiltración de supremacistas blancos en la policía
alternative label: Fuerzas del orden y supremacía blanca
alternative label: Policía y extremismo de derecha
alternative label: Vínculos de policías con supremacistas blancos
alternative label: Policía vinculada a la extrema derecha||
change note: Version 4.2.0
in scheme: v3
preferred label: Supremacía blanca en la policía
related: Police
related: Police harassment of Black LGBTQ+ people
related: Police harassment of Indigenous LGBTQ+ people

Aromantic literature
type: Concept
issued: 2023-03-20
modified: 2025-02-23
comment: Written literary works about aromanticism, aromantic characters, or aromantic themes.
comment: Obras literarias escritas sobre el aromanticismo, personajes arrománticos o temas arrománticos.
broader: LGBTQ+ literature
change note: Version 4.2.0
has top concept: Subcultures
in scheme: v3
preferred label: Literatura arromántica
related: Aromantic authors
related: Aromantic poetry
related: Aromantic drama

Megasexual poetry
type: Concept
issued: 2023-04-11
modified: 2025-02-23
comment: Literary works, typically written in verse, that focus on megasexual characters, themes, or identity.
comment: Obras literarias, normalmente escritas en verso, que se centran en personajes, temas o identidades megasexuales.
broader: LGBTQ+ poetry
change note: Version 4.2.0
has top concept: Subcultures
in scheme: v3
preferred label: Poesía megasexual
related: Megasexual authors
related: Megasexual fiction
related: Megasexual literature

Appropriation of marginalized identities
type: Concept
issued: 2023-04-14
modified: 2025-02-23
comment: Falsely claiming belonging to a marginalized group (including, but not limited to: disability, ethnicity, race, and sexuality).
comment: Afirmar falsamente pertenecer a un grupo marginado (incluyendo, pero no limitado a: la discapacidad, el origen étnico, la raza y la sexualidad).
change note: Version 4.2.0
in scheme: v3
narrower: Appropriation of Indigenous identity
preferred label: Apropiación de identidades marginadas

Bothies
type: Concept
issued: 2023-04-14
modified: 2025-02-23
comment: People who have two or more LGBTQ+ parents or caregivers. Includes individuals born to or adopted by people in a heterosexual relationship who later came out as LGBTQ+, as well as individuals born to or adopted by LGBTQ+ people who came together to create their own families, such as lesbian couples who choose to conceive with friends who are gay men. For use in a Canadian and United States context.
comment: Personas que tienen dos o más padres o cuidadores LGBTQ+. Incluye a personas nacidas o adoptadas por personas en una relación heterosexual que luego se declararon LGBTQ+, así como personas nacidas o adoptadas por personas LGBTQ+ que se unieron para crear sus propias familias, como parejas de lesbianas que eligen concebir con amigos que son hombres gay. Utilícese en contextos canadienses y estadounidenses.
broader: Children of LGBTQ+ people
broader: LGBTQ+ slang
change note: Version 4.2.0
has top concept: Family members
in scheme: v3
related: LGBTQ+ families
related: LGBTQ+ parents

LGBTQ+ children of LGBTQ+ parents
type: Concept
issued: 2023-04-14
modified: 2025-02-23
comment: Term used to describe people who are LGBTQ+ and have at least one LGBTQ+ parent or caregiver.
comment: Término utilizado para describir a las personas que son LGBTQ+ y que tienen al menos un padre o cuidador LGBTQ+.
alternative label: Second generation (LGBTQ+ families)
alternative label: Segunda generación (familias LGBTQ+)
broader: Children of LGBTQ+ people
broader: LGBTQ+ people
change note: Version 4.2.0
has top concept: Family members
in scheme: v3
preferred label: Hijos LGBTQ+ de padres y madres LGBTQ+
related: LGBTQ+ families
related: Lesbian parents

Culturally queer
type: Concept
issued: 2023-04-14
modified: 2025-02-23
comment: Term used to describe the feeling shared by many people with queer parents or caregivers that they grew up immersed in queer culture, including queer traditions, celebrations, media, and language.
comment: Término utilizado para describir el sentimiento compartido por muchas personas con padres o cuidadores queer de que crecieron inmersos en una cultura queer, incluidas las tradiciones, las celebraciones, los medios y el lenguaje queer.
broader: Queer culture
change note: Version 4.2.0
has top concept: Subcultures
in scheme: v3
preferred label: Culturalmente queer
related: Children of queer people
related: Queer families
related: Queer people

Gender role stereotypes
type: Concept
issued: 2023-04-14
modified: 2025-02-23
comment: Widely held but oversimplified and often offensive ideas regarding gender roles, which are socially-determined rules or standards for gendered behaviors. Use the term "Gender roles" to describe gender roles as a whole, rather than stereotypes related to them.
comment: Ideas generalizadas pero demasiado simplificadas y a menudo ofensivas sobre los roles de género, que son reglas o estándares socialmente determinados para comportamientos de género. Utilice el término "Roles de género" para describir los roles de género como un todo, en lugar de estereotipos relacionados a ellos.
alternative label: Gender stereotypes
alternative label: Estereotipos de género
broader: Gender roles
change note: Version 4.2.0
has top concept: Role behavior
in scheme: v3
preferred label: Estereotipos de rol de género
related: Gender binaries
related: Gender expression
related: Gender relations

Queer art
type: Concept
issued: 2023-04-14
modified: 2025-04-23
comment: Term for different forms of creative activity, including visual, material, and performing arts, by queer artists or about queer topics and communities.
comment: Término para diferentes formas de actividad creativa, incluidas las artes visuales, materiales y escénicas, realizadas por artistas queer o sobre temas y comunidades queer.
broader: LGBTQ+ arts
change note: Version 4.2.0
has top concept: Subcultures
in scheme: v3
narrower: Queer architecture
preferred label: Arte queer
related: Queer erotic art
related: Queer people in visual art

Lesbian erotic art
type: Concept
issued: 2023-04-14
modified: 2025-02-23
comment: Erotic art, created by lesbian artists, depicting lesbian people, or that are regarded as important within lesbian culture.
comment: Arte erótico, creado por artistas lesbianas, que representa a lesbianas o a personas consideradas importantes dentro de la cultura lésbica.
broader: LGBTQ+ erotic art
change note: Version 4.2.0
has top concept: Subcultures
in scheme: v3
narrower: Lesbian porn films
narrower: Lesbian erotic films
preferred label: Arte erótico lésbico
related: Lesbian art

Gay erotic art
type: Concept
issued: 2023-04-14
modified: 2025-02-23
comment: Erotic art, created by gay artists, depicting gay people, or that are regarded as important within gay culture.
comment: Arte erótico, creado por artistas gay, que representa a hombres gay o a personas consideradas importantes dentro de la cultura gay.
broader: LGBTQ+ erotic art
change note: Version 4.2.0
has top concept: Subcultures
in scheme: v3
narrower: Gay porn films
narrower: Gay erotic films
preferred label: Arte erótico gay
related: Gay art

Bisexual erotic art
type: Concept
issued: 2023-04-14
modified: 2025-02-23
comment: Erotic art, created by bisexual artists, depicting bisexual people, or that are regarded as important within bisexual culture.
comment: El acto de emplear a personas bisexuales.
broader: LGBTQ+ erotic art
change note: Version 4.2.0
has top concept: Subcultures
in scheme: v3
narrower: Bisexual porn films
narrower: Bisexual erotic films
preferred label: Empleo bisexual
related: Bisexual art

Transgender erotic art
type: Concept
issued: 2023-04-14
modified: 2025-02-23
comment: Erotic art, created by transgender artists, depicting transgender people, or that are regarded as important within transgender culture.
comment: Arte erótico, creado por artistas transgénero, que representa a personas transgénero, o personas consideradas importantes dentro de la cultura transgénero.
broader: LGBTQ+ erotic art
change note: Version 4.2.0
has top concept: Subcultures
in scheme: v3
narrower: Transgender porn films
narrower: Transgender erotic films
preferred label: Arte erótico transgénero
related: Transgender art

Queer erotic art
type: Concept
issued: 2023-04-14
modified: 2025-02-23
comment: Erotic art, created by queer artists, depicting queer people, or that are regarded as important within queer culture.
comment: Arte erótico, creado por artistas queer, que representa a personas queer, o personas consideradas importantes dentro de la cultura queer.
broader: LGBTQ+ erotic art
change note: Version 4.2.0
has top concept: Subcultures
in scheme: v3
narrower: Queer porn films
narrower: Queer erotic films
preferred label: Arte erótico queer
related: Queer art

Intersex erotic art
type: Concept
issued: 2023-04-14
modified: 2025-02-23
comment: Erotic art, created by intersex artists, depicting intersex people, or that are regarded as important within intersex culture.
comment: Arte erótico, creado por artistas intersex, que representa a personas intersex, o personas consideradas importantes dentro de la cultura intersex.
broader: LGBTQ+ erotic art
change note: Version 4.2.0
has top concept: Subcultures
in scheme: v3
narrower: Intersex erotic films
narrower: Intersex porn films
preferred label: Arte erótico intersex
related: Intersex art

Aromantic erotic art
type: Concept
issued: 2023-04-14
modified: 2025-02-23
comment: Erotic art, created by aromantic artists, depicting aromantic people, or that are regarded as important within aromantic culture.
comment: Arte erótico, creado por artistas arrománticos, que representa a personas arrománticas, o que se consideran importantes dentro de la cultura arromántica.
broader: LGBTQ+ erotic art
change note: Version 4.2.0
has top concept: Subcultures
in scheme: v3
narrower: Aromantic erotic films
narrower: Aromantic porn films
preferred label: Arte erótico arromántico
related: Aromantic art

Asexual erotic art
type: Concept
issued: 2023-04-14
modified: 2025-02-23
comment: Erotic art, created by asexual artists, depicting asexual people, or that are regarded as important within asexual culture.
comment: Arte erótico, creado por artistas asexuales, que representa a personas asexuales o que se considera importante dentro de la cultura asexual.
broader: LGBTQ+ erotic art
change note: Version 4.2.0
has top concept: Subcultures
in scheme: v3
narrower: Asexual erotic films
narrower: Asexual porn films
preferred label: Arte erótico asexual
related: Asexual art

Demisexual erotic art
type: Concept
issued: 2023-04-14
modified: 2025-02-23
comment: Erotic art, created by demisexual artists, depicting demisexual people, or that are regarded as important within demisexual culture.
comment: Arte erótico, creado por artistas demisexuales, que representa a personas demisexuales, o a personas consideradas importantes dentro de la cultura demisexual.
broader: LGBTQ+ erotic art
change note: Version 4.2.0
has top concept: Subcultures
in scheme: v3
narrower: Demisexual erotic films
narrower: Demisexual porn films
preferred label: Arte erótico demisexual
related: Demisexual art

Artificial insemination
type: Concept
issued: 2023-04-14
modified: 2025-02-23
comment: The introduction of semen into the cervical opening, uterus, or fallopian tube using assistance from reproductive technology. Some choose not to use this term due to the implications of the word "artificial."
comment: La introducción de semen en la apertura cervical, el útero o las trompas de Falopio con la ayuda de tecnología reproductiva. Algunos optan por no utilizar este término por las implicaciones de la palabra "artificial".
broader: Insemination
broader: Assisted reproduction
change note: Version 4.2.0
has top concept: LGBTQ+ family planning
in scheme: v3
preferred label: Inseminación artificial
related: Sperm donors
related: Turkey baster babies

Donor insemination
type: Concept
issued: 2023-04-14
modified: 2025-02-23
comment: The process by which donated sperm is placed inside a person with a uterus to induce pregnancy.
comment: El proceso mediante el cual se coloca esperma donado dentro de una persona con útero para inducir el embarazo.
broader: Insemination
broader: Assisted reproduction
change note: Version 4.2.0
has top concept: LGBTQ+ family planning
in scheme: v3
narrower: Sperm donors
preferred label: Inseminación de donante
related: Sperm donation

Donor siblings
type: Concept
issued: 2023-04-14
modified: 2025-02-23
comment: People who are biologically related to one another through a shared donor.
comment: Personas que están relacionadas biológicamente entre sí a través de un donante compartido.
broader: Siblings
change note: Version 4.2.0
has top concept: Family members
in scheme: v3
preferred label: Hermanos de donación
related: Biological parenthood
related: Donors
related: Genetic parenthood

Half-siblings
type: Concept
issued: 2023-04-14
modified: 2025-02-23
comment: Siblings who are biologically related through one but not all of their parents.
comment: Hermanos que están relacionados biológicamente a través de uno, pero no todos, sus padres.
alternative label: Half siblings
broader: Siblings
change note: Version 4.2.0
has top concept: Family members
in scheme: v3
preferred label: Medios hermanos
related: Biological parenthood
related: Genetic parenthood
related: LGBTQ+ siblings

Two-Spirit autobiographies
type: Concept
issued: 2023-06-26
modified: 2025-02-23
comment: Accounts of Two-Spirit peoples' lives written by those people. For written accounts of Two-Spirit people's lives that were not written by the subject, use "Two-Spirit biographies."
comment: Relatos de vida de personas escritos por esas mismas personas; utilícese para autobiografías escritas por autores dos espíritus.
alternative label: 2S autobiographies
alternative label: 2S autobios
alternative label: 2S memoirs
alternative label: Two Spirit autobiographies
alternative label: Two Spirit autobios
alternative label: Two Spirit memoirs
alternative label: Two Spirited autobiographies
alternative label: Two Spirited autobios
alternative label: Two Spirited memoirs
alternative label: Two-Spirited authobiographies
alternative label: Two-Spirited autobios
alternative label: Two-Spirited memoirs
alternative label: Memorias dos espíritus
change note: Version 4.2.0
in scheme: v3
preferred label: Autobiografías dos espíritus
related: LGBTQ+ autobiographies
related: Two-Spirit authors
related: Two-Spirit biographies

Two-Spirit biographies
type: Concept
issued: 2023-06-26
modified: 2025-02-23
comment: Written accounts of the lives of Two-Spirit people. For written accounts of Two-Spirit people's lives written by the subject, use "Two-Spirit autobiographies."
comment: Relatos escritos de la vida de personas conocidas por ser dos espíritus.
alternative label: 2S biographies
alternative label: Two Spirit biographies
alternative label: Two Spirited biographies
alternative label: Two-Spirited biographies
change note: Version 4.2.0
in scheme: v3
preferred label: Biografías dos espíritus
related: LGBTQ+ biographies
related: Two-Spirit autobiographies
related: Two-Spirit authors

Two-Spirit community centers
type: Concept
issued: 2023-06-26
modified: 2025-02-23
comment: Spaces in which people from Two-Spirit communities meet for social, education, recreational, or organizing activities.
comment: Espacios donde las personas de comunidades dos espíritus se reúnen para actividades sociales, educativas, recreativas u organizativas.
alternative label: 2S community centers
alternative label: Two Spirit community centers
alternative label: Two Spirited community centers
alternative label: Two-Spirit community centres
alternative label: Two-Spirited community centers
change note: Version 4.2.0
in scheme: v3
preferred label: Centros comunitarios dos espíritus
related: LGBTQ+ community centers
related: Two-Spirit people
related: Two-Spirit community

Two-Spirit people with chronic illnesses
type: Concept
issued: 2023-06-26
modified: 2025-04-24
comment: Two-Spirit people who have long-term health conditions that require continued medical attention and/or significantly impact or limit daily life; some but not all people with chronic illnesses consider themselves disabled.
comment: Personas dos espíritus que padecen de condiciones de salud a largo plazo que requieren atención médica continua y/o que impactan o limitan significativamente sus vidas diarias; algunas, pero no todas, las personas con enfermedades crónicas se consideran discapacitadas.
alternative label: 2S people with chronic illnesses
alternative label: Chronically ill 2S people
alternative label: Chronically ill Two Spirit people
alternative label: Chronically ill Two Spirited people
alternative label: Chronically ill Two-Spirited people
alternative label: Two Spirit people with chronic illnesses
alternative label: Two Spirited people with chronic illnesses
alternative label: Two-Spirited people with chronic illnesses
alternative label: Personas con enfermedades crónicas dos espíritus
alternative label: Enfermos crónicos dos espíritus
change note: Version 4.2.0
in scheme: v3
preferred label: Personas dos espíritus con enfermedades crónicas
related: LGBTQ+ people with chronic illnesses
related: Two-Spirit disabled people
related: Two-Spirit people who use substances for medical purposes

Two-Spirit studies
type: Concept
issued: 2023-06-27
modified: 2026-02-24
comment: Academic field of research and study about Two-Spirit people, Two-Spirit identity, and Two-Spirit communities.
comment: Campo académico de investigación y estudio sobre las personas dos espíritus, la identidad dos espíritus y las comunidades dos espíritus.
alternative label: 2S studies
alternative label: Two Spirit studies
alternative label: Two Spirited studies
alternative label: Two-Spirited studies
change note: Version 4.2.0
in scheme: v3
preferred label: Estudios dos espíritus
related: Gender studies
related: Queer studies
related: LGBTQ+ studies

Intersex literature
type: Concept
issued: 2023-06-27
modified: 2025-04-23
comment: Written literary works about intersex characters or themes.
comment: Obras literarias escritas sobre personajes o temas intersex.
broader: LGBTQ+ literature
change note: Version 4.2.0
has top concept: Subcultures
in scheme: v3
narrower: Intersex youth literature
preferred label: Literatura intersex
related: Intersex authors
related: Intersex people in literature

Asexual press
type: Concept
issued: 2023-06-28
modified: 2025-02-23
comment: Newspapers, magazines, or other publishing outlets aimed at asexual audiences and/or operated by asexual people.
comment: Periódicos, revistas u otros medios editoriales dirigidos a audiencias asexuales y/o operados por personas asexuales.
broader: LGBTQ+ press
change note: Version 4.2.0
has top concept: LGBTQ+ press
in scheme: v3
narrower: Asexual zines
preferred label: Prensa asexual
related: Asexual newsletters
related: Asexual newspapers

Intersex disabled people
type: Concept
issued: 2023-06-30
modified: 2025-02-23
comment: Intersex people who are disabled.
comment: Personas intersex con discapacidad.
alternative label: Personas discapacitadas intersex
alternative label: Personas intersex con discapacidades
broader: LGBTQ+ disabled people
change note: Version 4.2.0
has top concept: LGBTQ+ people
in scheme: v3
narrower: Intersex blind people
narrower: Intersex wheelchair users
preferred label: Personas intersex discapacitadas
related: Intersex people with chronic illnesses

Whipping
type: Concept
issued: 2023-12-15
modified: 2025-02-23
comment: Consensual use of whips, floggers, or similar impact play tools on the body.
comment: Uso consensual de látigos, azotadores o herramientas de juego de impacto similares en el cuerpo.
alternative label: Latiguear
broader: Impact play
change note: Version 4.2.0
has top concept: Eroticism
in scheme: v3
narrower: Flagellation
preferred label: Azotar
related: Whips
related: Flogging

Wax play
type: Concept
issued: 2023-12-15
modified: 2025-02-23
comment: Application of liquid wax to the body for erotic or sensual play.
comment: Aplicación de cera líquida en el cuerpo para juegos eróticos o sensuales.
alternative label: Juego con velas
broader: Temperature play
change note: Version 4.2.0
has top concept: Eroticism
in scheme: v3
preferred label: Juego con cera
related: Hair removal
related: Fire play
related: Ice play

Muscle worship
type: Concept
issued: 2023-12-15
modified: 2025-02-23
comment: Any practice of revering muscles, usually in a sexual context.
comment: Cualquier práctica de reverencia a los músculos, generalmente en un contexto sexual.
alternative label: Adoración muscular
broader: BDSM
broader: Body part fetishes
broader: Body worship
change note: Version 4.2.0
has top concept: Eroticism
in scheme: v3
preferred label: Adoración de los músculos
related: Gym subculture

Fire play
type: Concept
issued: 2023-12-15
modified: 2025-02-23
comment: The use of fire or flame in a sexual or erotic context.
comment: El uso de fuego o llamas en un contexto sexual o erótico.
alternative label: Juego con fuego
broader: Temperature play
change note: Version 4.2.0
has top concept: Eroticism
in scheme: v3
preferred label: Juego de fuego
related: Wax play
related: Ice play
related: Cigar play

Leather fetish
type: Concept
issued: 2023-12-18
modified: 2025-02-23
comment: Eroticization of leather, especially leather garments and accessories associated with the leather and kink communities.
comment: La erotización del cuero, especialmente de prendas y accesorios de cuero asociados a las comunidades leather y kink.
broader: BDSM
change note: Version 4.2.0
has top concept: Eroticism
in scheme: v3
preferred label: Fetiche leather
related: Bootblacking
related: Leather community
related: Uniform fetish

Mind play
type: Concept
issued: 2023-12-18
modified: 2025-03-20
comment: Psychological games or roleplay performed in order to produce erotic excitement or sexual arousal.
comment: Juegos psicológicos o juegos de rol realizados con el fin de producir excitación erótica o sexual.
alternative label: Juego de mente
broader: BDSM
change note: Version 4.2.0
has top concept: Eroticism
in scheme: v3
narrower: Roleplay
narrower: Erotic hypnosis
preferred label: Juego mental
related: Power exchange

Erotic hypnosis
type: Concept
issued: 2023-12-18
modified: 2025-02-23
comment: The use of hypnosis in a sexual or erotic context.
comment: El uso de la hipnosis en un contexto sexual o erótico.
alternative label: Mind control
alternative label: Control mental
broader: Mind play
change note: Version 4.2.0
has top concept: Eroticism
in scheme: v3
preferred label: Hipnosis erótica
related: Power exchange
related: Dollification
related: Dehumanization (Erotic)

Inflation (Erotic)
type: Concept
issued: 2023-12-18
modified: 2025-02-23
comment: Inflation of the body, parts of the body, clothing, or inflatable objects with air or other substances for sexual arousal or erotic play.
comment: Inflar el cuerpo, partes del cuerpo, ropa u objetos inflables con aire u otras sustancias para excitación sexual o juegos eróticos.
alternative label: Inflatables
broader: BDSM
change note: Version 4.2.0
has top concept: Eroticism
in scheme: v3
preferred label: Inflación (erotico)
related: Sex dolls
related: Rubber and latex fetish
related: Balloon kink

Leather and kink clubs
type: Concept
issued: 2023-12-20
modified: 2025-02-23
comment: Social clubs and other types of membership organizations in the leather, kink, and related communities.
comment: Clubes sociales y otros tipos de organizaciones en comunidades de cuero, kink y afines.
alternative label: Kink clubs
alternative label: SM clubs
alternative label: Clubs leather y kink
alternative label: Clubes kink
alternative label: Clubs kink
broader: LGBTQ+ clubs and organizations
change note: Version 4.2.0
has top concept: LGBTQ+ clubs and organizations
in scheme: v3
preferred label: Clubes leather y kink
related: Dykes on bikes
related: Leather community
related: LGBTQ+ motorcycle clubs

Title contests
type: Concept
issued: 2023-12-20
modified: 2025-02-23
comment: An annual event in leather and kink communities where contestants compete for a title. Contestants are judged on qualities including their stage presence, appearance, charisma, and ability to be a leader and activist in the community for the length of their title year.
comment: Un evento anual en comunidades de leather y kink donde quienes concursan compiten por un título. Se les juzga por cualidades que incluyen su presencia en el escenario, apariencia, carisma y capacidad para ser líder y activista en la comunidad durante el año del título.
alternative label: Leather contests
alternative label: Leather pageants
alternative label: Titleholders
alternative label: Competencia de títulos
broader: LGBTQ+ awards
broader: Europride
change note: Version 4.2.0
has top concept: LGBTQ+ awards
in scheme: v3
preferred label: Concurso de títulos
related: Leather community
related: Leather and kink conventions

Gloves (Erotic)
type: Concept
issued: 2023-12-20
modified: 2025-02-23
comment: A garment covering the hand and used in kink or erotic play.
comment: Una prenda para vestir que cubre la mano y se utiliza para juegos kinki o eróticos.
broader: Sex accessories
broader: LGBTQ+ fashion
change note: Version 4.2.0
has top concept: Sex accessories
in scheme: v3
narrower: Latex gloves
preferred label: Guantes (erótico)
related: Impact play

Bukkake
type: Concept
issued: 2023-12-20
modified: 2025-03-20
comment: A sexual act involving multiple people ejaculating on one person, typically on the face.
comment: Un acto sexual en el que varias personas eyaculan sobre una persona, normalmente en la cara.
broader: Group sex
change note: Version 4.2.0
has top concept: Sexual practices
in scheme: v3
preferred label: Bukake
related: Cum
related: Jizz
related: Pornography

Bugchasing
type: Concept
issued: 2023-12-20
modified: 2025-02-23
comment: The act or fantasy of engaging in sex with the intent to contract HIV/AIDS.
comment: El acto o la fantasía de tener relaciones sexuales con la intención de contraer VIH/SIDA.
alternative label: Caza del bicho
broader: Risk behaviors
change note: Version 4.2.0
has top concept: Risk behaviors
in scheme: v3
related: HIV/AIDS
related: Barebacking
related: BDSM

Body bags (Erotic)
type: Concept
issued: 2023-12-20
modified: 2025-02-23
comment: A body encasing or bag, often leather, used for sensory deprivation or during kink or sexual play.
comment: Una funda o bolsa para el cuerpo, a menudo de cuero, utilizada para la privación sensorial o durante el juego sexual o kinky.
broader: Sex accessories
broader: Kink accessories
change note: Version 4.2.0
has top concept: Sex accessories
in scheme: v3
preferred label: Bolsas corporales (erotica)
related: Bondage
related: Sensory deprivation (Erotic)

Consent play
type: Concept
issued: 2023-12-20
modified: 2025-02-23
comment: A type of consensual play involving mock coercion, intimidation, force, or struggle of one or more partners.
comment: Un tipo de juego consensual que implica la coerción, intimidación, fuerza o lucha simulada de una o más de las personas involucradas en el acto.
alternative label: CNC
alternative label: Consensual nonconsent
alternative label: Rape play
broader: BDSM
change note: Version 4.2.0
has top concept: Eroticism
in scheme: v3
preferred label: Juego de consentimiento
related: Roleplay
related: Power exchange
related: Abduction play

Drag in film
type: Concept
issued: 2024-01-09
modified: 2025-02-23
comment: Films with significant characters who appear in drag. Not to be confused with films where a principal actor plays a character who identifies as a gender other than what the actor identifies as.
comment: Películas con personajes significativos que aparecen en drag. No debe confundirse con películas en las que un actor principal interpreta a un personaje que se identifica con un género distinto al género con el cual se identifica el actor.
alternative label: Drag in cinema
alternative label: Drag in movies
alternative label: Drag en el cine
alternative label: Drag en películas
broader: Drag
broader: LGBTQ+ cinema
change note: Version 4.2.0
has top concept: Gender
in scheme: v3
preferred label: Drag en filmes
related: LGBTQ+ characters
related: Crossdressing

Masks (Erotic)
type: Concept
issued: 2024-01-17
modified: 2025-02-23
comment: Masks worn as a fetish fashion accessory or for sensual or sexual play.
comment: Máscaras utilizadas como accesorio de moda fetiche o para juegos sensuales o sexuales.
broader: Sex accessories
broader: LGBTQ+ fashion
change note: Version 4.2.0
has top concept: Sex accessories
in scheme: v3
narrower: Gas masks (Erotic)
preferred label: Máscaras (erótica)
related: Pup play

Queer joy
type: Concept
issued: 2024-01-18
modified: 2025-02-23
comment: A positive feeling connected to queer community, activism, and/or culture that counters the impact of living in a discriminatory society. Note that queer is used as an umbrella term for the LGBTQ+ community within this phrase.
comment: Un sentimiento positivo conectado con la comunidad, el activismo y/o la cultura queer que contrarresta el impacto de vivir en una sociedad discriminatoria. Tenga en cuenta que queer se utiliza como término general para la comunidad LGBTQ+ dentro de esta frase.
change note: Version 4.2.0
in scheme: v3
preferred label: Alegría queer
related: Queer community
related: Gender euphoria
related: Trans joy

Drag pageants
type: Concept
issued: 2024-06-19
modified: 2025-02-23
comment: Events styled after traditional beauty pageants or contests in which contestants, typically drag queens, female impersonators, and trans women, compete in a range of categories to win a prize or title.
broader: Europride
change note: Version 4.2.0
has top concept: Europride
in scheme: v3
related: Drag
related: Drag bars
related: Drag performers

Bodily autonomy
type: Concept
issued: 2024-06-19
modified: 2025-02-23
comment: An individual's right to make informed decisions about their own body without external influence or coercion.
alternative label: Right to bodily autonomy
change note: Version 4.2.0
in scheme: v3
related: Abortion access for LGBTQ+ people
related: Reproductive rights
related: Reproductive justice

Rape culture
type: Concept
issued: 2024-07-31
modified: 2025-02-23
comment: A term used in gender studies and feminist writing to describe a setting or culture in which sexual violence is pervasive and normalized due to attitudes about gender and sexuality.
alternative label: Rape-supportive culture
broader: Feminist theory
change note: Version 4.2.0
has top concept: Theories
in scheme: v3
related: Corrective rape
related: Sexual assault
related: Sexual violence

Bicuriosity
type: Concept
issued: 2024-07-31
modified: 2025-02-23
comment: A term used to describe the phenomena of heterosexual or hetero-presenting individuals expressing curiosity about exploring sexual relationships or experiences with other people of the same gender.
alternative label: Bi-curiosity
alternative label: Bi-curious
alternative label: Bicurious
broader: Bisexuality
change note: Version 4.2.0
has top concept: Sexual orientation
in scheme: v3
related: Heteronormativity
related: Heterosexuality
related: Questioning

Two-Spirit youth victims of bullying
type: Concept
issued: 2024-07-31
modified: 2025-02-23
comment: Two Spirit youth between the ages of 12-18 who have experienced bullying due to their gender or sexual identity and may or may not have survived; follow the individual's preference for "victims" or "survivors" whenever possible.
alternative label: 2S youth victims of bullying
alternative label: Two Spirited youth victims of bullying
alternative label: Two-Spirited youth victims of bullying
broader: Two-Spirit victims of bullying
broader: Two-Spirit youth
change note: Version 4.2.0
has top concept: Gender
in scheme: v3
related: LGBTQ+ victims of bullying
related: LGBTQ+ youth victims of bullying

Transgender health care bans for children and youth
type: Concept
issued: 2024-07-31
modified: 2025-02-23
comment: Laws or policies instituted that prevent trans and non-binary youth and children from seeking and/or obtaining medical treatment or gender-affirming care, including but not limited to surgery, hormone treatment, and mental health care.
broader: Anti-transgender legislation
change note: Version 4.2.0
has top concept: Law
in scheme: v3
related: Transgender children
related: Transgender youth
related: Health care for transgender children and youth

Girls’ Love (Genre)
type: Concept
issued: 2024-07-31
modified: 2025-02-23
comment: A genre focusing on the romantic or sexual relationships between female characters in anime, dramas, comics, novels, and movies. The term is usually used to describe media originating from Asia.
alternative label: GL (Genre)
broader: Anime and manga fandom
change note: Version 4.2.0
has top concept: Subcultures
in scheme: v3
narrower: Yuri fandom
narrower: Baihe
related: Lesbian fiction

Health care for transgender children and youth
type: Concept
issued: 2024-07-31
modified: 2025-02-23
comment: Organized measures taken for the maintenance or improvement of health via the prevention, diagnosis, and/or treatment of physical and mental health issues faced by transgender children and youth. This includes but is not limited to access to safe, legal therapy and counseling, hormone treatment, and gender-affirming surgery.
alternative label: Health care for trans children and youth
alternative label: Trans health care for children and youth
alternative label: Transgender health care for children and youth
broader: Health care for LGBTQ+ people
change note: Version 4.2.0
has top concept: Health care for LGBTQ+ people
in scheme: v3
related: Transgender children
related: Transgender youth
related: Transgender health care bans for children and youth

Patriarchy
type: Concept
issued: 2024-07-31
modified: 2025-02-23
comment: A cultural system in which positions of dominance and privilege are held by men, while women and other gender minorities are largely excluded from access to power.
alternative label: Androcracy
change note: Version 4.2.0
in scheme: v3
related: Essentialism
related: Genderism
related: Sexism

Reproductive justice
type: Concept
issued: 2024-10-22
modified: 2025-02-23
comment: Organized efforts to secure reproductive rights, including the legal, social, and ethical principles of freedom around reproductive healthcare and decision-making.
change note: Version 4.2.0
in scheme: v3
related: Reproductive rights
related: Reproductive health care for LGBTQ+ people
related: Bodily autonomy

Two-Spirit events
type: Concept
issued: 2024-10-22
modified: 2025-02-23
comment: Organized public or social occasions for Two-Spirit people and communities.
alternative label: Two Spirit events
alternative label: Two-Spirited events
alternative label: Two Spirited events
alternative label: 2S events
change note: Version 4.2.0
in scheme: v3
narrower: Two-Spirit film festivals
related: Europride

Women's events
type: Concept
issued: 2024-10-22
modified: 2025-02-23
comment: Organized public or social occasions for women.
change note: Version 4.2.0
in scheme: v3
narrower: Women's music festivals
related: Europride

LGBTQ+-affirming religious services
type: Concept
issued: 2024-10-22
modified: 2026-02-23
comment: Religious services, or gatherings of people belonging to the same religious group or belief system, that are accepting and supportive of LGBTQ+ people and their identities. Includes services specifically intended for LGBTQ+ people within a denomination or sect that is otherwise not LGBTQ+-affirming.
alternative label: LGBTQ+ affirming religious services
alternative label: LGBTQ+ religious services
alternative label: Religious services (LGBTQ)
change note: Version 4.2.0
in scheme: v3
related: LGBTQ+-affirming religious groups
related: LGBTQ+ African religions
related: Religious views on LGBTQ+ people

Two-Spirit information professionals
type: Concept
issued: 2024-10-22
modified: 2025-02-23
comment: Two-Spirit people whose profession involves managing information by collecting, organizing, storing and disseminating it. This can include but is not limited to librarians, archivists, metadata and IT workers, web developers, and chief information officers. Use more specific terms when possible.
alternative label: Two Spirit information professionals
alternative label: Two-Spirited information professionals
alternative label: Two Spirited information professionals
alternative label: 2s information professionals
broader: Two-Spirit people
change note: Version 4.2.0
has top concept: Gender
in scheme: v3
narrower: Two-Spirit archivists
narrower: Two-Spirit librarians
related: LGBTQ+ information professionals

Pride events
type: Concept
issued: 2024-10-22
modified: 2025-04-23
comment: Events that recognize and celebrate LGBTQ+ people and culture, thereby affirming the visibility, dignity, and diversity of LGBTQ+ communities.
alternative label: LGBTQ+ pride events
broader: Europride
change note: Version 4.2.0
has top concept: Europride
in scheme: v3
narrower: Pride parades
narrower: Pride Month
related: No Police at Pride

Pride Month
type: Concept
issued: 2024-10-22
modified: 2025-02-23
comment: A period of public recognition and celebration of LGBTQ+ people and culture, usually organized over the course of a month with local events, parades, marches, and rallies. Pride occurs at different times during the year in different places but is typically held in June in the United States to commemorate the Stonewall uprising.
alternative label: LGBTQ+ Pride Month
broader: LGBTQ+ pride
broader: Pride events
change note: Version 4.2.0
has top concept: LGBTQ+ pride
in scheme: v3
narrower: Gay Pride Week
related: LGBTQ+ History Month

Redlining
type: Concept
issued: 2024-10-22
modified: 2025-02-23
comment: A discriminatory practice in which financial services are withheld from neighborhoods that have significant numbers of racial and ethnic minorities. Redlining includes but is not limited to denial of credit, insurance, and healthcare; inflated mortgage and interest rates; and the development of food deserts. The term has its roots in the New Deal when color-coded maps were made of metropolitan areas in the United States to indicate where it was considered safe to insure mortgages. Black neighborhoods and surrounding areas were colored red to indicate mortgages should not be insured there.
alternative label: Red lining
alternative label: Credit card redlining
change note: Version 4.2.0
in scheme: v3
related: Anti-Blackness
related: Racism
related: Gentrification

LGBTQ+ safe spaces
type: Concept
issued: 2024-10-22
modified: 2025-02-23
comment: Public spaces designated as safe for, or accepting and affirming of, LGBTQ+ people, often by allies. LGBTQ+ safe spaces are sometimes identified through the display of stickers or placards.
alternative label: Safe spaces (LGBTQ)
alternative label: Safe places (LGBTQ)
alternative label: LGBTQ+ safe places
alternative label: LGBTQ+ safe zones
alternative label: Safe zones (LGBTQ)
broader: LGBTQ+ spaces
change note: Version 4.2.0
has top concept: LGBTQ+ meeting places
in scheme: v3
related: Allies
related: Gay-straight alliances
related: LGBTQ+ friendliness

LGBTQ+ philanthropy
type: Concept
issued: 2024-10-23
modified: 2025-02-23
comment: Efforts to improve the welfare of LGBTQ+ people and communities, especially by the donation of money or resources to charitable causes.
alternative label: Philanthropy (LGBTQ)
alternative label: LGBTQ+ charity
alternative label: Charity (LGBTQ)
change note: Version 4.2.0
in scheme: v3
related: LGBTQ+ movement
related: LGBTQ+ activism
related: LGBTQ+ philanthropists

Feminist film criticism
type: Concept
issued: 2024-10-23
modified: 2025-02-23
comment: The analysis and evaluation of feminist films and film history, or film criticism from a feminist perspective.
alternative label: Feminist film critique
alternative label: Feminist film analysis
broader: Gender studies
broader: Feminist theory
change note: Version 4.2.0
has top concept: Gender studies
in scheme: v3
related: LGBTQ+ film criticism
related: LGBTQ+ literary criticism

Trans joy
type: Concept
issued: 2024-10-23
modified: 2025-02-23
comment: A positive feeling connected to trans identity, being, community, activism, and/or culture that counters the impact of living in a discriminatory society.
alternative label: Transgender joy
change note: Version 4.2.0
in scheme: v3
related: Queer joy
related: Gender euphoria
related: Transgender community

Sexual fluidity
type: Concept
issued: 2024-10-23
modified: 2025-02-23
comment: The idea that a person's sexual orientation can change over time or in different situations.
change note: Version 4.2.0
in scheme: v3
related: Sexuality
related: Sexual preference
related: Situational sexual behavior

Cam models
type: Concept
issued: 2024-10-30
modified: 2025-02-23
comment: Short for "webcam models," this term refers to sex workers who exchange sexual services, performances, or companionship via online video calls and livestreams.
alternative label: Webcam models
alternative label: Cammodels
broader: Sex workers
change note: Version 4.2.0
has top concept: Sex workers
in scheme: v3
narrower: Camboys
narrower: Camgirls
related: Cam modeling

Legalization of sex work
type: Concept
issued: 2024-10-30
modified: 2025-02-23
comment: The creation of a set of laws and regulations intended to legalize the practice and solicitation of sex work, particularly street sex work and other forms of "direct," visible sex work, within certain parameters. This may variously include legalizing the actions of sex workers, their clients, third parties, and/or other individuals who work in proximity to or seek to aid sex workers. Individuals operating outside of these laws and regulations remain subject to penalties.
alternative label: Sex work legalization
alternative label: Legalization of prostitution
alternative label: Prostitution legalization
broader: Sex work legislation
change note: Version 4.2.0
has top concept: Law
in scheme: v3
preferred label: Legalisation of sex work
related: Decriminalization of sex work
related: Criminalization of sex work
related: Sex work abolition

Nordic model (Sex work)
type: Concept
issued: 2024-10-30
modified: 2025-02-23
comment: A legislative approach to sex work first instituted in Sweden in 1999 and then in Norway in 2009 that centers on the criminalization of clients, third parties, and many of the ways sex workers operate. The Nordic model is a form of sex work abolition predicated on the idea that no person can consent to engage in commercial sexual services and that sex workers must therefore be educated and reformed. Sex workers and activists have heavily criticized and opposed the Nordic model.
alternative label: End demand (Sex work)
alternative label: Equality model (Sex work)
alternative label: Neo-abolition movement (Sex work)
alternative label: Nordic and Swedish model (Sex work)
alternative label: Swedish model (Sex work)
broader: Sex work legislation
broader: Sex work abolition
change note: Version 4.2.0
has top concept: Law
in scheme: v3
related: Criminalization of sex work
related: Decriminalization of sex work

Solicitation of sex work
type: Concept
issued: 2024-10-30
modified: 2025-02-23
comment: The act of offering or attempting to exchange money or goods for sexual services or performances.
alternative label: Soliciting
change note: Version 4.2.0
in scheme: v3
narrower: Curb crawling
related: Sex workers' clients

Sugaring
type: Concept
issued: 2024-10-30
modified: 2025-02-23
comment: A form of sex work in which companionship and sexual services are exchanged for money, gifts, and other material benefits. Generally but not always sugaring describes a relationship between an older client and a younger sex worker.
alternative label: Sugar dating
broader: Sex work
change note: Version 4.2.0
has top concept: Sex industry
in scheme: v3
related: Sugar babies
related: Sugar daddies
related: Sugar mamas

Sugar babies
type: Concept
issued: 2024-10-30
modified: 2025-02-23
comment: People who provide companionship and sexual services to sugar mamas or daddies in exchange for money, gifts, and other material benefits.
broader: Sex workers
change note: Version 4.2.0
has top concept: Sex workers
in scheme: v3
related: Sugaring
related: Sugar daddies
related: Sugar mamas

LGBTQ+ porn stars
type: Concept
issued: 2024-10-30
modified: 2025-02-23
comment: LGBTQ+ actors in erotic or sexually explicit films.
alternative label: LGBTQ+ pornstars
alternative label: LGBTQ+ porn actors
alternative label: LGBTQ+ porn actresses
alternative label: Porn stars (LGBTQ)
alternative label: Pornstars (LGBTQ)
alternative label: Porn actors (LGBTQ)
alternative label: Porn actresses (LGBTQ)
alternative label: LGBTQ+ adult entertainers
alternative label: Adult entertainers (LGBTQ)
broader: Porn stars
broader: LGBTQ+ actors
broader: LGBTQ+ sex workers
change note: Version 4.2.0
has top concept: Sex workers
in scheme: v3
related: LGBTQ+ porn films

LGBTQ+ dating
type: Concept
issued: 2024-12-12
modified: 2025-04-01
comment: Term used to describe people spending regular time together due to mutual romantic interest. Use to refer to dating between and/or as experienced by LGBTQ+ people.
alternative label: Dating (LGBTQ)
broader: Relationship satisfaction
change note: Version 4.2.0
has top concept: Relationship satisfaction
in scheme: v3
narrower: LGBTQ+ online dating
related: Dating applications
related: LGBTQ+ dating websites

Two-Spirit celebrities
type: Concept
issued: 2025-03-20
modified: 2025-04-23
comment: Two-Spirit people who have achieved fame and broad public recognition due to the attention given to them by mass media.
alternative label: Two Spirit celebrities
alternative label: Two-Spirited celebrities
alternative label: Two Spirited celebrities
alternative label: 2S celebrities
alternative label: Two-Spirit celebs
alternative label: Famous Two-Spirit people
alternative label: Two-Spirit famous people
broader: Two-Spirit people
change note: Version 4.2.0
has top concept: Gender
in scheme: v4
narrower: Two-Spirit television personalities
related: LGBTQ+ celebrities
related: Two-Spirit people in mass media

Polyamorous families
type: Concept
issued: 2025-03-20
modified: 2025-03-20
comment: Families, whether biological, adoptive, or chosen, in which one or more individuals identify as polyamorous.
alternative label: Poly families
change note: Version 4.2.0
in scheme: v4
related: LGBTQ+ families
related: Polyamorous people
related: Polycules

Chrononormativity
type: Concept
issued: 2025-04-23
modified: 2025-04-23
comment: Term used to describe the ways in which human lives and experiences are expected to follow specific, linear patterns over time in conformity with normative frameworks. This includes expectations regarding how long and what hours people work, with the aim of achieving maximum productivity, as well as expectations for people to reach life milestones, such as graduating high school, getting married, and having children, at specific ages and in a particular order.
alternative label: Normative time
broader: Social norms
change note: Version 4.2.0
has top concept: Social norms
in scheme: v4
narrower: White time
related: Crip time
related: Queer time

Compulsory heterosexuality
type: Concept
issued: 2025-04-23
modified: 2025-04-23
comment: Term coined by Adrienne Rich in 1980 to describe the idea that heterosexuality is assumed of and enforced upon people in patriarchal societies to ensure the continued subjugation of women. Thus, heterosexuality and, particularly, women's sexual interest in men, is not always natural but instead is ingrained as a social requirement from an early age.
alternative label: Comphet
broader: Social norms
broader: Theories
change note: Version 4.2.0
has top concept: Social norms
in scheme: v4
related: Heterosexism
related: Heteronormativity

Two-Spirit people in arts and media
type: Concept
issued: 2025-04-23
modified: 2025-04-23
comment: Umbrella term for the depiction of Two-Spirit people and communities in different forms of creative activity and cultural production, including literature, visual art, and popular media. Use more specific terms if possible.
alternative label: Two Spirit people in arts and media
alternative label: Two-Spirited people in arts and media
alternative label: Two Spirited people in arts and media
alternative label: 2S people in arts and media
broader: Two-Spirit people
change note: Version 4.2.0
has top concept: Gender
in scheme: v4
narrower: Two-Spirit people in visual art
narrower: Two-Spirit people in literature
related: LGBTQ+ people in arts and media

Two-Spirit people who use substances for medical purposes
type: Concept
issued: 2025-04-24
modified: 2025-04-24
comment: Two-Spirit people who use substances (that are typically deemed harmful or are subject to legal restriction, such as drugs and alcohol) in order to manage pain and other symptoms related to a medical condition or disability.
alternative label: Two Spirit people who use substances for medical purposes
alternative label: Two-Spirited people who use substances for medical purposes
alternative label: Two Spirited people who use substances for medical purposes
alternative label: 2S people who use substances for medical purposes
broader: Two-Spirit people who use substances
change note: Version 4.2.0
has top concept: Gender
in scheme: v4
related: LGBTQ+ people who use substances for medical purposes
related: Two-Spirit disabled people
related: Two-Spirit people with chronic illnesses

Sexual studies
type: Concept
issued: 2025-04-24
modified: 2026-02-24
comment: An interdisciplinary field that studies the social, cultural, and historical dimensions of sex and sexuality.
change note: Version 4.2.0
in scheme: v4
related: Sexology
related: Sexuality
related: LGBTQ+ studies

LGBTQ+ hand signs (Language)
type: Concept
issued: 2026-02-23
modified: 2026-02-23
comment: Visual gestural signs used in sign languages to describe LGBTQ+ people, cultures, and related terminology.
alternative label: LGBTQ+ hand signs
broader: LGBTQ+ Deaf culture
change note: Version 4.2.0
has top concept: LGBTQ+ communities
in scheme: v4
related: LGBTQ+ Deaf people
related: LGBTQ+ hard of hearing people
related: LGBTQ+ slang

Two-Spirit weddings
type: Concept
issued: 2026-02-23
modified: 2026-02-23
comment: Marriage ceremonies and the accompanying festivities; use to describe weddings in which both partners are Two-Spirit.
alternative label: Two Spirit weddings
alternative label: Two Spirited weddings
alternative label: Two-Spirited weddings
alternative label: 2S weddings
change note: Version 4.2.0
in scheme: v4
related: LGBTQ+ weddings
related: Two-Spirit brides
related: Two-Spirit grooms

Two-Spirit brides
type: Concept
issued: 2026-02-23
modified: 2026-02-26
comment: Two-Spirit people who are getting married and identify as a bride.
alternative label: Two Spirit brides
alternative label: Two Spirited brides
alternative label: Two-Spirited brides
alternative label: 2S brides
broader: Two-Spirit people
change note: Version 4.2.0
has top concept: Gender
in scheme: v4
related: Two-Spirit weddings
related: LGBTQ+ brides
related: Two-Spirit grooms

Two-Spirit grooms
type: Concept
issued: 2026-02-23
modified: 2026-02-26
comment: Two-Spirit people who are getting married and identify as a groom.
alternative label: Two Spirit grooms
alternative label: Two Spirited grooms
alternative label: Two-Spirited grooms
alternative label: 2S grooms
broader: Two-Spirit people
change note: Version 4.2.0
has top concept: Gender
in scheme: v4
related: Two-Spirit weddings
related: LGBTQ+ grooms
related: Two-Spirit brides

LGBTQ+ people with depression
type: Concept
issued: 2026-02-24
modified: 2026-02-24
comment: LGBTQ+ people who experience any of the key symptoms of depression, including but not limited to persistent sadness, loss of interest in everyday activities and difficulty and managing work, relationships, etc. LGBTQ+ people are at risk for a higher rate of depression due to life factors such as social stigma, discrimination, lack of family support, and other stressors.
alternative label: LGBTQ+ depressed people
alternative label: Depressed people (LGBTQ+)
alternative label: Depressed LGBTQ+ people
change note: Version 4.2.0
in scheme: v4
related: Mental disorders
related: Mental health care for LGBTQ+ people
related: LGBTQ+ people with anxiety

LGBTQ+ people with anxiety
type: Concept
issued: 2026-02-24
modified: 2026-02-24
comment: LGBTQ+ people who experience any of the key symptoms of anxiety including but not limited to feelings of unease, worry and fear, commonly as a reaction to stress. LGBTQ+ people are at risk of higher rates of anxiety due to life factors such as social stigma, discrimination, lack of family support, and other stressors.
alternative label: LGBTQ+ anxious people
alternative label: Anxious people (LGBTQ+)
alternative label: Anxious LGBTQ+ people
change note: Version 4.2.0
in scheme: v4
related: Mental disorders
related: Mental health care for LGBTQ+ people
related: LGBTQ+ people with depression

Two-Spirit medical professionals
type: Concept
issued: 2026-02-24
modified: 2026-03-04
comment: Two-Spirit people who are trained and licensed to provide healthcare services, such as diagnosing, treating, and preventing physical or mental illness.
alternative label: Two Spirit medical professionals
alternative label: Two-Spirited medical professionals
alternative label: Two Spirited medical professionals
alternative label: 2S medical professionals
broader: Two-Spirit people
change note: Version 4.2.0
has top concept: Gender
in scheme: v4
narrower: Two-Spirit medical doctors
narrower: Two-Spirit nurses
related: LGBTQ+ medical professionals

Adoptive parents
type: Concept
issued: 2019-05-14
modified: 2025-02-23
replaces: adoptiveParents
comment: People who have adopted children, either legally or through a social/cultural practice.
comment: Personas que han adoptado niños, ya sea legalmente o a través de una practica sociocultural.
alternative label: Padres adoptivos
alternative label: Madres adoptivas
broader: Parents
change note: Version 4.2.0
has top concept: Family members
in scheme: v3
preferred label: Madres y padres adoptivos
related: Birth parents
related: Social parenthood
related: LGBTQ+ adoption
related: LGBTQ+ adoptive parents

Agender people
type: Concept
issued: 2019-05-14
modified: 2025-02-23
replaces: agenderPeople
comment: People who identify as not having a gender, or being genderless.
comment: Personas que se autoidentifican como sin género.
broader: Transgender people
broader: Gender minorities
change note: Version 4.2.0
has top concept: LGBTQ+ people
in scheme: v3
preferred label: Personas agénero
related: Gender identity
related: Non-binary people
related: Agender identity

AIDS education
type: Concept
issued: 2019-05-14
modified: 2025-02-23
replaces: AIDSEducation
comment: Instruction about HIV/AIDS, including topics like the history of the AIDS epidemic, contraction, prevention, and treatment.
comment: Instrucción sobre el VIH/SIDA, incluyendo temas como la historia de la epidemia del SIDA, cómo se contrae, su prevención y tratamiento.
broader: Information provision
change note: Version 4.2.0
has top concept: Information provision
in scheme: v3
preferred label: Educación sobre el SIDA
related: HIV/AIDS
related: Safer sex
related: Sex education
related: Sexual health

Anal fisting
type: Concept
issued: 2019-05-14
modified: 2025-02-23
replaces: analFisting
comment: Sexual practice of inserting a fist into an anus.
comment: Práctica sexual de introducir un puño en el ano.
broader: Anal sex
broader: Fisting
change note: Version 4.2.0
has top concept: Sex (Act)
in scheme: v3
preferred label: Fisting anal
related: Rimming
related: Anal play
related: Vaginal fisting

Arrests of LGBTQ+ people
type: Concept
issued: 2019-05-14
modified: 2025-02-23
replaces: arrestsOfLGBTQPeople
comment: Apprehension and detention of LGBTQ+ people by an institution or authority in order to deprive them of their freedom of movement.
comment: Aprehensión y detención de personas LGBTQ+ por parte de una institución o autoridad con el fin de privarlas de su libertad de movimiento.
alternative label: Arrests of LGBTQ people
alternative label: Detenciones de personas LGBTQ
alternative label: Arrestos de personas LGBTQ+
alternative label: Arrestos de personas LGBTQ
broader: Detention of LGBTQ+ people
broader: Police interactions with LGBTQ+ people
change note: Version 4.2.0
has top concept: Detention of LGBTQ+ people
in scheme: v3
preferred label: Detenciones de personas LGBTQ+
related: LGBTQ+ civil disobedience
related: LGBTQ+ persecutions
related: Police entrapment

Normalization
type: Concept
issued: 2019-05-14
modified: 2025-02-23
replaces: normalisation
comment: Social processes through which ideas, characteristics, and behaviors come to be seen as "normal" or "natural" and accepted as such.
comment: Procesos sociales a través de los cuales ideas, características y conductas llegan a ser vistas como "normales" o "naturales" y aceptadas como tales.
alternative label: Assimilation
alternative label: Asimilación
change note: Version 4.2.0
in scheme: v3
preferred label: Normalización
preferred label: Normalisation
related: Heteronormativity
related: Homonormativity
related: LGBTQ+ social processes
related: Social norms

Berdache
type: Concept
issued: 2019-05-14
modified: 2025-02-23
replaces: berdache
comment: An offensive term developed by settler anthropologists to broadly describe Indigenous people expressing mixed gender roles; only use in historical contexts.
comment: Término ofensivo desarrollado por antropólogos colonizadores para describir ampliamente a los indígenas que expresan roles mixtos de género; utilícese únicamente en contextos históricos.
alternative label: Bardache
broader: LGBTQ+ historical terms
broader: Slurs
change note: Version 4.2.0
has top concept: LGBTQ+ historical terms
in scheme: v3
related: Native American LGBTQ+ people
related: Two-Spirit people
related: Two-Spirit identity

Bisexual activism
type: Concept
issued: 2019-05-14
modified: 2025-02-23
replaces: bisexualActivism
comment: Direct action and organizing to achieve political or social change and acceptance for bisexuality.
comment: Acción directa y organización para lograr el cambio político o social y la aceptación de la bisexualidad.
broader: LGBTQ+ activism
change note: Version 4.2.0
has top concept: LGBTQ+ activism
in scheme: v3
preferred label: Activismo bisexual
related: Bisexual information centers
related: Bisexual movement
related: Bisexual political activists
related: Bisexual rights

Bisexual drama
type: Concept
issued: 2019-05-14
modified: 2025-02-23
replaces: bisexualDrama
comment: Works of fiction written to be performed; use in reference to dramatic works focusing on bisexual characters or themes.
comment: Mujeres que desempeñan un papel dominante en las actividades del BDSM; utilícese para dominatrices que se autoidentifiquen como bisexuales.
broader: LGBTQ+ drama
change note: Version 4.2.0
has top concept: Subcultures
in scheme: v3
preferred label: Dominatrices bisexuales
related: Bisexual characters
related: Bisexual literature
related: Bisexual theater
related: Bisexual authors

Bisexual movement
type: Concept
issued: 2019-05-14
modified: 2025-04-17
replaces: bisexualMovement
comment: Umbrella term for activism focused on the rights of bisexual people and issues faced by bisexual communities.
comment: Personas bisexuales que son madres.
alternative label: Mamás bisexuales
broader: LGBTQ+ movement
change note: Version 4.2.0
has top concept: Social movements
in scheme: v3
preferred label: Madres bisexuales
related: Bisexual activism
related: Bisexual information centers
related: Bisexual press
related: Bisexual demonstrations

Bisexual press
type: Concept
issued: 2019-05-14
modified: 2025-02-23
replaces: bisexualPress
comment: Newspapers, magazines, or other publishing outlets aimed at bisexual audiences and/or operated by bisexual people.
comment: Personas bisexuales que son candidatas a cargos públicos, que ejercen cargos públicos o que han desempeñado cargos políticos. Los políticos pueden ser elegidos mediante elección pública o designados de otro modo.
alternative label: Oficiales públicos bisexuales
alternative label: Oficiales públicas bisexuales
alternative label: Políticas bisexuales
broader: LGBTQ+ press
change note: Version 4.2.0
has top concept: LGBTQ+ press
in scheme: v3
narrower: Bisexual newsletters
narrower: Bisexual newspapers
preferred label: Políticos bisexuales
related: Bisexual movement
related: LGBTQ+ magazines

Bisexual youth
type: Concept
issued: 2019-05-14
modified: 2025-02-23
replaces: bisexualYouth
comment: Bisexual people between the ages of childhood and adulthood.
comment: Personas bisexuales entre las edades de la infancia y la edad adulta.
alternative label: Bisexual teenagers
alternative label: Bisexual adolescents
alternative label: Bisexual teens
alternative label: Adolescentes bisexuales
alternative label: Jóvenes bisexuales
broader: Bisexual people
broader: LGBTQ+ youth
change note: Version 4.2.0
has top concept: LGBTQ+ people
in scheme: v3
narrower: Bisexual boys
narrower: Bisexual girls
preferred label: Juventud bisexual
related: Bisexual youth literature

Bullying
type: Concept
issued: 2019-05-14
modified: 2025-04-01
replaces: bullying
comment: A form of aggressive behavior that can include verbal harassment, physical assault, or coercion. Bullying is typically directed repeatedly towards particular victims, often on the grounds of race, gender, sexuality, or ability.
comment: Una forma de comportamiento agresivo que puede incluir el acoso verbal, la agresión física o la coerción. Por lo general, el acoso se dirige repetidamente hacia víctimas particulares, a menudo por motivos de raza, género, sexualidad o capacidad.
change note: Version 4.2.0
in scheme: v3
preferred label: Acoso
related: Harassment
related: LGBTQ+ phobia
related: LGBTQ+ victims of bullying
related: LGBTQ+ survivors of bullying

Children of transgender people
type: Concept
issued: 2019-05-14
modified: 2025-02-23
replaces: childrenOfTransgenderPeople
comment: Children who have one or more transgender parent.
comment: Hijos o hijas que tienen uno o más madres o padres transgénero.
alternative label: Hijas de personas transgénero
broader: Children of LGBTQ+ people
change note: Version 4.2.0
has top concept: Family members
in scheme: v3
narrower: Sons of transgender people
narrower: People with transgender parents
preferred label: Hijos de personas transgénero
related: Transgender families
related: Transgender parents

Circumcision
type: Concept
issued: 2019-05-14
modified: 2025-02-23
replaces: circumcision
comment: Surgical removal of the foreskin of the penis.
comment: Extirpación quirúrgica del prepucio del pene.
change note: Version 4.2.0
in scheme: v3
preferred label: Circuncisión
related: Cut men
related: Clitoridectomy
related: Foreskin restoration
related: Uncut men

Cissexual people
type: Concept
issued: 2019-05-14
modified: 2025-02-23
replaces: cissexualPeople
comment: Individuals whose sex matches the sex or gender they were assigned at birth. Whereas cisgender refers to people who are not transgender, cissexual refers to people who are not transsexual.
comment: Personas cuyo sexo coincide con el sexo o género que se les asignó al nacer. Mientras que "cisgénero" se refiere a personas que no son transgénero, "cisexual" se refiere a personas que no son transexuales.
change note: Version 4.2.0
in scheme: v3
preferred label: Personas cisexuales
related: Cisgender people
related: Transsexual people
related: Cissexuality

Cottages (Gay culture)
type: Concept
issued: 2019-05-14
modified: 2025-02-23
replaces: cottages
comment: UK slang term for public bathrooms used as locations for sexual encounters, particularly by gay men.
comment: Término de la jerga británica para referirse a los baños públicos utilizados como lugares para encuentros sexuales, especialmente entre hombres gay.
alternative label: Public urinals
alternative label: Cottages
alternative label: Urinarios públicos
alternative label: Baños públicos
broader: Sex locations
change note: Version 4.2.0
has top concept: Sex locations
in scheme: v3
narrower: Glory holes
preferred label: Cottages (Cultura gay)
related: Cottaging (Gay culture)
related: Public bathrooms
related: Tearooms (Gay culture)

Court orders
type: Concept
issued: 2019-05-14
modified: 2025-02-23
replaces: courtOrders
comment: Proclamations by a judge or panel of judges requiring or authorizing specific actions (e.g., court orders approving or denying requests for name or gender marker changes).
comment: Proclamaciones de un juez o de un panel de jueces que requieren o autorizan acciones específicas (por ejemplo, órdenes judiciales que aprueban o deniegan solicitudes de cambios de nombre o marcador de género).
alternative label: Orden judicial
alternative label: Mandato judicial
broader: Law
broader: Official documentation
change note: Version 4.2.0
has top concept: Law
in scheme: v3
preferred label: Órdenes de la corte
related: Birth certificates
related: Driver's licenses
related: Gender markers

Cubs (Gay culture)
type: Concept
issued: 2019-05-14
modified: 2025-02-23
replaces: cubs
comment: Slang commonly used in gay communities in the United States to describe younger, heavy-set gay men, usually with hairy bodies and facial hair.
comment: Jerga comúnmente utilizada en las comunidades gay de Estados Unidos para describir a hombres gay más jóvenes y corpulentos, generalmente con cuerpos peludos y vello facial.
alternative label: Cubs
alternative label: Cubs (Cultura gay)
broader: Bears (Gay culture)
broader: Gay culture
broader: Gender roles
broader: Wolves (Gay culture)
change note: Version 4.2.0
has top concept: Subcultures
in scheme: v3
preferred label: Cachorros (Cultura gay)
related: Gender expression

Dandies
type: Concept
issued: 2019-05-14
modified: 2025-02-23
replaces: dandies
comment: Men who place particular importance upon physical appearance, refined language, and leisurely hobbies.
comment: Hombres que dan especial importancia a la apariencia física, al lenguaje refinado y a las aficiones ociosas.
broader: Gender roles
broader: LGBTQ+ historical terms
broader: Sexual identity
change note: Version 4.2.0
has top concept: Role behavior
in scheme: v3
preferred label: Dandis
related: Dandyism
related: Gender expression

Demisexuality
type: Concept
issued: 2019-05-14
modified: 2025-02-23
replaces: demisexuality
comment: A sexual orientation generally characterized by the lack of sexual attraction to other people unless or until emotional connections have been formed.
comment: Una orientación sexual generalmente caracterizada por la falta de atracción sexual hacia otras personas a menos o hasta que se hayan formado conexiones emocionales.
broader: Sexual orientation
change note: Version 4.2.0
has top concept: Sexual orientation
in scheme: v3
preferred label: Demisexualidad
related: Demisexual people
related: Compulsory sexuality
related: Demigender identity
related: Demiromanticism

Desire to have children
type: Concept
issued: 2019-05-14
modified: 2025-02-23
replaces: desireToHaveChildren
comment: A person's drive or desire to have children.
comment: El impulso o deseo de una persona de tener hijos.
alternative label: Deseo por tener hijos
change note: Version 4.2.0
in scheme: v3
preferred label: Deseo de tener hijos
related: Children
related: Conception by LGBTQ+ people
related: LGBTQ+ family planning
related: LGBTQ+ parenthood

Dildos
type: Concept
issued: 2019-05-14
modified: 2025-02-23
replaces: dildos
comment: A sex toy, often explicitly (although not necessarily) phallic in appearance, intended for sexual penetration or other sexual activity during masturbation or with sex partners.
comment: Instrumentos con forma fálica utilizados para la estimulación sexual, generalmente mediante la penetración del ano o la vagina.
broader: Sex accessories
change note: Version 4.2.0
has top concept: Sex accessories
in scheme: v3
preferred label: Consoladores
related: Dildo harnesses
related: Penis
related: Strap-on sex
related: Vibrators

Drag balls
type: Concept
issued: 2019-05-14
modified: 2025-02-23
replaces: dragBalls
comment: Events that are part of the drag ball subculture that emerged in early 20th-century New York City among primarily African-American and Latin American LGBTQ+ people. During a drag ball, individuals "walk" or perform for prizes.
comment: Eventos que forman parte de la subcultura de bailes de drag que surgió a principios del siglo XX en la ciudad de Nueva York entre personas LGBTQ+ principalmente afroamericanas y latinoamericanas. Durante un drag ball, las personas "caminan" o actúan para ganar premios.
alternative label: Balls de drag
broader: Europride
change note: Version 4.2.0
has top concept: Europride
in scheme: v3
preferred label: Bailes de drag
related: Ball culture
related: Drag
related: Drag community
related: Voguing

Egg donors
type: Concept
issued: 2019-05-14
modified: 2025-02-23
replaces: eggDonors
comment: Individuals of any gender who donate their own eggs for the purpose of inducing pregnancy.
comment: Personas de cualquier género que donan sus propios óvulos con el fin de inducir el embarazo.
broader: Donors
change note: Version 4.2.0
has top concept: Donors
in scheme: v3
preferred label: Donantes de óvulos
related: Genetic parenthood
related: LGBTQ+ family planning
related: Surrogacy
related: Gestational surrogacy

Exhibitionism
type: Concept
issued: 2019-05-14
modified: 2025-02-23
replaces: exhibitionism
comment: A kink characterized by the sexual desire to display one's body or engage in sexual activities in public.
broader: BDSM
broader: Sexual practices
change note: Version 4.2.0
has top concept: Eroticism
in scheme: v3
preferred label: Exhibicionismo
related: Public sex
related: Voyeurism
related: LGBTQ+ people with sexual addictions

Fisting
type: Concept
issued: 2019-05-14
modified: 2025-02-23
replaces: fisting
comment: The insertion of a hand (or fist) into the vagina or anus.
comment: Acto sexual que consiste en introducir toda la mano, apretada o con los dedos estirados, en la vagina o el ano.
alternative label: Fist fucking
alternative label: Handballing
alternative label: Manual penetration
broader: Sexual practices
change note: Version 4.2.0
has top concept: Sexual practices
in scheme: v3
narrower: Anal fisting
narrower: Vaginal fisting
related: Fingering
related: Sex swings

Social parenthood
type: Concept
issued: 2019-05-14
modified: 2025-02-23
replaces: socialParenthood
comment: A basis of parenthood understood to be in opposition to biological parenthood, that challenges the assumption that parenthood presupposes blood relation. Social parenthood is the full- or part-time care, nurturing, and protection of a child by an adult who has taken on that duty.
comment: Una base de la paternidad entendida como opuesta a la paternidad biológica, que desafía la suposición de que la paternidad presupone una relación de sangre. La paternidad social es el cuidado, la crianza y la protección a tiempo completo o parcial de un niño por parte de un adulto que ha asumido ese deber.
alternative label: Foster parenthood
alternative label: Familias de acogida
change note: Version 4.2.0
in scheme: v3
preferred label: Paternidad social
related: Adoptive parenthood
related: Adoptive parents
related: Biological parenthood
related: Foster parents

FtXs
type: Concept
issued: 2019-05-14
modified: 2025-02-23
replaces: ftxs
comment: People who transition from female to unknown or not female.
comment: Personas que transicionan de mujer a un género desconocido o a no mujer.
broader: Transgender people
change note: Version 4.2.0
has top concept: LGBTQ+ people
in scheme: v3
preferred label: FTXs
related: FtMs
related: MtFs
related: MtXs
related: X-jendā

Gay-straight alliances
type: Concept
issued: 2019-05-14
modified: 2025-02-23
replaces: gay-straightAlliances
comment: Alliances to make schools, sports clubs, etc. safe and welcoming to all people regardless of sexual orientation or gender identity.
comment: Alianzas para hacer que las escuelas, clubes deportivos, etc. sean seguros y acogedores para todas las personas sin importar su orientación sexual o identidad de género.
alternative label: GSAs
alternative label: Alianza de Género y Sexualidad
alternative label: AGS
broader: LGBTQ+ social processes
change note: Version 4.2.0
has top concept: LGBTQ+ social processes
in scheme: v3
preferred label: Alianzas Gay-Heterosexual
related: Allies
related: LGBTQ+ friendliness
related: LGBTQ+ movement
related: LGBTQ+ safe spaces

Gender bending
type: Concept
issued: 2019-05-14
modified: 2025-02-23
replaces: genderBending
comment: The practice of transgressing or "bending" expected gender roles, which often involves adopting or exaggerating stereotypically feminine or masculine traits to expose them as artificial. Gender bending is similar to drag, though drag is often associated with artistic or stage performances, whereas gender bending is typically enacted in everyday life.
comment: La práctica de transgredir o "doblar" los roles de género esperados, lo que a menudo implica adoptar o exagerar rasgos estereotípicamente femeninos o masculinos para exponerlos como artificiales. La transgresión de género es similar al drag, aunque el drag se asocia, a menudo, con representaciones artísticas o escénicas, mientras que la transgresión de género suele representarse en la vida cotidiana.
broader: Gender expression
change note: Version 4.2.0
has top concept: Gender
in scheme: v3
preferred label: Transgresión de género
related: Androgyny
related: Gender roles
related: Gender creative
related: Gender transgression

Genderfluid people
type: Concept
issued: 2019-05-14
modified: 2025-02-23
replaces: genderfluidPeople
comment: People who identify as different genders at different times, including multiple genders at once or none at all. Only use to describe people who self-identify as genderfluid.
comment: Personas que se identifican con diferentes géneros en diferentes momentos, incluidos varios géneros a la vez o ninguno en absoluto. Utilícese únicamente para describir a personas que se autoidentifiquen como de género fluido.
broader: Transgender people
broader: Gender minorities
change note: Version 4.2.0
has top concept: LGBTQ+ people
in scheme: v3
preferred label: Personas de género fluido
related: Bigender people
related: Genderfluid identity
related: Gender identity

Genderqueer people
type: Concept
issued: 2019-05-14
modified: 2025-02-23
replaces: genderqueerPeople
comment: Individuals who self-identify as genderqueer, an umbrella term for queer or non-normative gender identities and gender expressions.
comment: Personas que se autoidentifican como genderqueer, un término general para identidades y expresiones de género queer o no normativas.
broader: Queer people
broader: Gender minorities
change note: Version 4.2.0
has top concept: LGBTQ+ people
in scheme: v3
narrower: Transgenderqueer people
preferred label: Personas genderqueer
related: Transgender people
related: Genderqueer identity

Glory holes
type: Concept
issued: 2019-05-14
modified: 2025-02-23
replaces: gloryHoles
comment: Holes through walls or partitions, such as public bathroom stalls, that allow people to perform or observe sex acts, typically anonymously. Often associated with gay male culture due to the historical and ongoing use of glory holes by closeted gay men to facilitate oral or anal sex without the risk of identification or arrest.
comment: Agujeros en paredes o tabiques, como en puestos de baños públicos, que permiten a las personas realizar u observar actos sexuales, generalmente de forma anónima. A menudo se asocian con la cultura masculina gay debido al uso histórico y continuo de agujeros gloriosos por parte de hombres gay en el clóset para facilitar el sexo oral o anal sin riesgo de identificación o arresto.
alternative label: Gloriosos agujeros
broader: Cottages (Gay culture)
broader: Gay saunas
broader: Public bathrooms
broader: Tearooms (Gay culture)
change note: Version 4.2.0
has top concept: Sex locations
in scheme: v3
preferred label: Agujeros gloriosos
related: Sexual practices

Harnesses
type: Concept
issued: 2019-05-14
modified: 2025-02-23
replaces: harnesses
comment: Wearable accessories, typically consisting of leather straps and metal rings or points of attachment. May be worn as a fashion statement, to signal one's belonging to the leather or BDSM communities, or during sex to restrict movement, increase pleasure, and/or to permit the attachment of a sex accessory, such as a dildo.
broader: Sex accessories
broader: Kink accessories
change note: Version 4.2.0
has top concept: Sex accessories
in scheme: v3
narrower: Chest harnesses
narrower: Dildo harnesses
narrower: Thigh harnesses
preferred label: Arneses

Serostatus
type: Concept
issued: 2019-05-14
modified: 2025-02-23
replaces: serostatus
comment: The presence (seropositivity) or absence (seronegativity) of antibodies in blood serum; commonly used in in reference to HIV testing.
comment: La presencia (seropositividad) o ausencia (seronegatividad) de anticuerpos en el suero sanguíneo; comúnmente utilizado en referencia a las pruebas de VIH.
alternative label: HIV-serostatus
alternative label: Serostatus-VIH
change note: Version 4.2.0
in scheme: v3
preferred label: Seroestatus
related: HIV/AIDS
related: HIV-negative people
related: HIV-positive people
related: HIV-undetectable people

Hormones
type: Concept
issued: 2019-05-14
modified: 2025-02-23
replaces: hormones
comment: Regulatory substances produced in organisms and transported throughout the body to stimulate specific cells or tissues into action. Though hormones regulate digestion, respiration, sleep, and many other bodily functions, the term is most commonly used by the general public to describe the "sex hormones," or the hormones involved in puberty and sexual development, reproduction, and sexual desire.
comment: Sustancias reguladoras producidas en organismos y transportadas por todo el cuerpo para estimular la acción de células o tejidos específicos. Aunque las hormonas regulan la digestión, la respiración, el sueño y muchas otras funciones corporales, el público en general utiliza el término con mayor frecuencia para describir las "hormonas sexuales", o las hormonas involucradas en la pubertad y el desarrollo sexual, la reproducción y el deseo sexual.
broader: Sex (Body)
change note: Version 4.2.0
has top concept: Sex (Body)
in scheme: v3
narrower: Estrogen
narrower: Testosterone
narrower: Androgens
preferred label: Hormonas
related: Steroidogenic factor 1 protein

Sexual intercourse
type: Concept
issued: 2019-05-14
modified: 2025-02-23
replaces: sexualIntercourse
comment: Term used to describe sexual activity between two or more people, typically involving penetration.
comment: Término utilizado para describir la actividad sexual entre dos o más personas, que normalmente implica penetración.
alternative label: Coito
broader: Sex (Act)
broader: Sexual practices
change note: Version 4.2.0
has top concept: Sex (Act)
in scheme: v3
preferred label: Relaciones sexuales
related: Fucking
related: Getting laid
related: Strap-on sex

Intergenerational relationships
type: Concept
issued: 2019-05-14
modified: 2025-02-23
replaces: intergenerationalRelationships
comment: Ongoing connections (romantic, sexual, play, or platonic) between two or more people of different age groups or from different generations.
comment: Conexiones continuas (románticas, sexuales, lúdicas o platónicas) entre dos o más personas de diferentes grupos de edad o de diferentes generaciones.
broader: Relationship satisfaction
change note: Version 4.2.0
has top concept: Relationship satisfaction
in scheme: v3
preferred label: Relaciones intergeneracionales
related: Age of consent
related: Sexual identity
related: Relationship orientation

Intimate partner violence
type: Concept
issued: 2019-05-14
modified: 2025-02-23
replaces: intimatePartnerViolence
comment: Acts of violence or abuse directed against an individual by their current or former partner in a romantic, sexual, or play relationship.
comment: Actos de violencia o abuso dirigidos contra una persona por su pareja actual o anterior en una relación romántica, sexual o de juego.
alternative label: Intimate partner abuse
alternative label: Violencia de pareja
broader: LGBTQ+ domestic violence
change note: Version 4.2.0
has top concept: Anti-LGBTQ+ violence
in scheme: v3
preferred label: Violencia doméstica
related: LGBTQ+ personal and family law
related: Social privilege
related: Sexual harassment
related: Significant others

Lesbianism
type: Concept
issued: 2019-05-14
modified: 2025-02-23
replaces: lesbianism
comment: Sexual orientation of women and femmes who are sexually and/or romantically attracted to other women and femmes. However, not all lesbians are women, and gender non-conforming people who belong to lesbian communities have often identified as lesbian.
comment: Orientación sexual de mujeres y femmes que se sienten atraídas sexual y/o románticamente por otras mujeres y femmes. Sin embargo, no todas las lesbianas son mujeres, y las personas disidentes de género que pertenecen a comunidades lésbicas a menudo se han identificado como lesbianas.
broader: Sexual orientation
change note: Version 4.2.0
has top concept: Sexual orientation
in scheme: v3
preferred label: Lesbianismo
related: Bisexuality
related: Lesbians
related: Homosexuality
related: Tribadism

LGBTQ+ awards
type: Concept
issued: 2019-05-14
modified: 2025-02-23
replaces: LGBTQAwards
comment: Prizes or forms of recognition given in honor of achievements by LBGTQ+ individuals or in support of LGBTQ+ issues or communities.
comment: Premios o formas de reconocimiento otorgados en honor a los logros de las personas LBGTQ+ o en apoyo a los asuntos o comunidades LGBTQ+.
alternative label: LGBTQ awards
alternative label: Premios LGBTQ
change note: Version 4.2.0
in scheme: v3
narrower: LGBTQ+ literary awards
narrower: Title contests
preferred label: Premios LGBTQ+

LGBTQ+ divorce
type: Concept
issued: 2019-05-14
modified: 2025-02-23
replaces: LGBTQDivorce
comment: Legal dissolution of marriages involving one or more LGBTQ+ people.
comment: Disolución legal de matrimonios que involucran a una o más personas LGBTQ+.
alternative label: LGBTQ divorce
broader: LGBTQ+ separation
broader: Marriage
change note: Version 4.2.0
has top concept: Living arrangements
in scheme: v3
narrower: Same-sex divorce
preferred label: Divorcio LGBTQ+
related: Child custody
related: Divorced people

LGBTQ+ friendliness
type: Concept
issued: 2019-05-14
modified: 2025-02-23
replaces: LGBTQFriendliness
comment: Places, policies, people, or institutions that are open and welcoming to LGBTQ+ people.
comment: Lugares, políticas, personas o instituciones abiertas y acogedoras para las personas LGBTQ+.
alternative label: LGBTQ friendliness
change note: Version 4.2.0
in scheme: v3
preferred label: Amabilidad LGBTQ+
related: Allies
related: Gay-straight alliances
related: Pinkwashing
related: LGBTQ+ safe spaces

LGBTQ+ lovers
type: Concept
issued: 2019-05-14
modified: 2025-02-23
replaces: LGBTQLovers
comment: LGBTQ+ people engaging in sexual or romantic relationships with other people; typically used to describe people who are not married.
comment: Personas LGBTQ+ que mantienen relaciones sexuales o románticas con otras personas; normalmente se utiliza para describir a personas que no están casadas.
alternative label: Lovers (LGBTQ)
alternative label: LGBTQ lovers
alternative label: Amantes LGBTQ
alternative label: Amantes (LGBTQ)
broader: LGBTQ+ people
change note: Version 4.2.0
has top concept: LGBTQ+ people
in scheme: v3
preferred label: Amantes LGBTQ+
related: Fuck buddies
related: LGBTQ+ partners
related: Sexual relationships
related: Significant others

LGBTQ+ plays
type: Concept
issued: 2019-05-14
modified: 2025-02-23
replaces: LGBTQPlays
comment: Works of drama consisting primarily of dialogue between characters and intended for theatrical performance; use in reference to plays focusing on LGBTQ+ characters or themes.
comment: Obras dramáticas que principalmente consisten de diálogos entre personajes y que son destinadas a ser puestas en escena; utilícese en referencia a obras teatrales que se centren en personajes o temas LGBTQ+.
alternative label: LGBTQ stage performances
alternative label: LGBTQ plays
alternative label: Obras LGBTQ
alternative label: Representaciones teatrales LGBTQ
change note: Version 4.2.0
in scheme: v3
preferred label: Obras de teatro LGBTQ+
related: LGBTQ+ drama
related: Gay theater
related: Lesbian theater
related: LGBTQ+ arts

LGBTQ+ pubs
type: Concept
issued: 2019-05-14
modified: 2025-02-23
replaces: LGBTQPubs
comment: A drinking establishment that serves food and acts as a community gathering place; use in reference to pubs that primarily cater to LGBTQ+ people.
comment: Un establecimiento de bebidas que sirve comida y funge como lugar de encuentro comunitario; utilícese en referencia a pubs que atienden principalmente a personas LGBTQ+.
alternative label: LGBTQ public houses
alternative label: LGBTQ pubs
alternative label: Tabernas LGBTQ+
change note: Version 4.2.0
in scheme: v3
preferred label: Pubs LGBTQ+
related: LGBTQ+ bars
related: Drag bars
related: Gay bars
related: Lesbian bars

LGBTQ+ separation
type: Concept
issued: 2019-05-14
modified: 2025-02-23
replaces: LGBTQSeparation
comment: Arrangement mutually agreed upon or ordered by a judge for married LGBTQ+ people to live apart while remaining legally married.
comment: Arreglo mutuamente acordado u ordenado por un juez para que las personas LGBTQ+ casadas vivan separadas mientras permanecen legalmente casadas.
alternative label: Marital separation (LGBTQ)
alternative label: LGBTQ separation
alternative label: Separación LGBTQ
broader: Marriage
change note: Version 4.2.0
has top concept: Living arrangements
in scheme: v3
narrower: LGBTQ+ divorce
preferred label: Separación LGBTQ+
related: Child custody
related: Marital status
related: Relationship satisfaction

LGBTQ+ sexual abuse
type: Concept
issued: 2019-05-14
modified: 2025-02-23
replaces: LGBTQSexualAbuse
comment: Acts of sexual abuse and violence directed towards LGBTQ+ people.
comment: Actos de abuso y violencia sexual dirigidos a personas LGBTQ+.
alternative label: LGBTQ sexual abuse
alternative label: Abuso sexual LGBTQ
broader: Sexual violence
change note: Version 4.2.0
has top concept: Sexual violence
in scheme: v3
preferred label: Abuso sexual LGBTQ+
related: Consent
related: LGBTQ+ domestic violence
related: LGBTQ+ victims of sexual abuse
related: LGBTQ+ survivors of sexual abuse

LGBTQ+ social parenthood
type: Concept
issued: 2019-05-14
modified: 2025-02-23
replaces: LGBTQSocialParenthood
comment: The experiences involved in social parenting, as experienced by LGBTQ+ people.
comment: Las experiencias involucradas en la paternidad social, tal como las experimentan las personas LGBTQ+.
alternative label: Social parenthood (LGBTQ)
alternative label: Paternidad social LGBTQ
broader: LGBTQ+ parenthood
change note: Version 4.2.0
has top concept: LGBTQ+ parenthood
in scheme: v3
preferred label: Paternidad social LGBTQ+
related: LGBTQ+ families
related: LGBTQ+ adoptive parenthood
related: LGBTQ+ family planning
related: LGBTQ+ foster parenthood

Libido
type: Concept
issued: 2019-05-14
modified: 2025-02-23
replaces: libido
comment: A person's overall sexual drive or desire for sexual activity.
comment: El impulso sexual general de una persona o el deseo de actividad sexual.
alternative label: Sex drive
alternative label: Deseo sexual
change note: Version 4.2.0
in scheme: v3
preferred label: Líbido
related: Sex (Act)
related: Sexual excitement
related: Sexual function
related: Sexuality

Lingerie
type: Concept
issued: 2019-05-14
modified: 2025-02-23
replaces: lingerie
comment: Category of clothing that includes bras, underwear, hosiery, and robes; typically refers to undergarments and sleepwear designed to be sexually appealing and worn in erotic contexts.
comment: Categoría de ropa que incluye sujetadores, ropa interior, medias y batas; típicamente, se refiere a ropa interior y ropa de dormir diseñada para ser sexualmente atractiva y usada en contextos eróticos.
alternative label: Ropa íntima
broader: Clothing
broader: Drag
broader: Sex accessories
change note: Version 4.2.0
has top concept: Gender
in scheme: v3
preferred label: Lencería
related: Crossdressers
related: Crossdressing

Mental disorders
type: Concept
issued: 2019-05-14
modified: 2026-02-24
replaces: mentalDisorders
comment: Medical conditions defined by changes or disturbances in an individual's thinking, feeling, mood, and behavior.
comment: Condiciones médicas definidas por cambios o alteraciones en el pensamiento, los sentimientos, el estado de ánimo y el comportamiento de una persona.
alternative label: Mental illnesses
alternative label: Psychiatric disorders
alternative label: Enfermedades mentales
alternative label: Desórdenes psiquiátricos
alternative label: Trastornos mentales
change note: Version 4.2.0
in scheme: v3
narrower: Ego-dystonic sexual orientation
preferred label: Desórdenes mentales
related: LGBTQ+ people with depression
related: LGBTQ+ people with anxiety

Misgendering
type: Concept
issued: 2019-05-14
modified: 2025-02-23
replaces: misgendering
comment: The act of referring to a person's gender incorrectly, often by using pronouns they do not identify with.
comment: El acto de referirse incorrectamente al género de una persona, a menudo mediante el uso de pronombres con los que no se identifica.
change note: Version 4.2.0
in scheme: v3
preferred label: Malgenerizar
related: Deadnaming
related: Gender identity
related: Pronouns
related: Gender-neutral language

MtXs
type: Concept
issued: 2019-05-14
modified: 2025-02-23
replaces: mtxs
comment: People who transition from male to unknown or not male.
comment: Personas que hacen transición de hombre a un género desconocido o a no-hombre.
broader: Transgender people
change note: Version 4.2.0
has top concept: LGBTQ+ people
in scheme: v3
preferred label: MTXs
related: FtMs
related: FtXs
related: MtFs
related: X-jendā

Neovagina
type: Concept
issued: 2019-05-14
modified: 2025-02-23
replaces: neovagina
comment: A surgically constructed vagina; typically made using tissue grafted from other parts of the body.
comment: Una vagina construida quirúrgicamente; por lo general, se elabora con tejido injertado de otras partes del cuerpo.
broader: Gender-affirming surgery
broader: Vagina
change note: Version 4.2.0
has top concept: Medical care
in scheme: v3
related: Clitoroplasty
related: Labiaplasty
related: Vaginoplasty

Nude art
type: Concept
issued: 2019-05-14
modified: 2025-02-23
replaces: nudes
comment: Works of art depicting naked individuals, either for aesthetic or erotic purposes; includes paintings, photographs, sculptures, etc.
comment: Obras de arte que representan a personas desnudas, con fines estéticos o eróticos; incluye pinturas, fotografías, esculturas, etc.
change note: Version 4.2.0
in scheme: v3
narrower: Nude photographs
preferred label: Arte desnudo
related: LGBTQ+ arts
related: LGBTQ+ erotic art

Partner notification
type: Concept
issued: 2019-05-14
modified: 2025-02-23
replaces: partnerNotification
comment: The practice of notifying the sexual partners of a person who has been newly diagnosed with a sexually transmitted infection to inform them that they have been exposed to the infection.
comment: La práctica de notificar a las parejas sexuales de una persona a la que se le ha diagnosticado recientemente una infección de transmisión sexual para informarles que han estado expuestas a la infección.
change note: Version 4.2.0
in scheme: v3
preferred label: Notificación a la pareja
related: Sexual relationships
related: STDs
related: Significant others
related: Partners

Physical affection
type: Concept
issued: 2019-05-14
modified: 2025-02-23
replaces: physicalAffection
comment: Touch between two or more people intended to arouse or convey feelings of closeness; can be used to express sexual or non-sexual intimacy and includes actions such as kissing, cuddling, embracing, and holding hands.
comment: Tacto entre dos o más personas destinado a despertar o transmitir sentimientos de cercanía; se puede utilizar para expresar intimidad sexual o no sexual e incluye acciones como besar, abrazar, sostener y tomar de la mano.
alternative label: Cariño físico
change note: Version 4.2.0
in scheme: v3
narrower: Kissing
preferred label: Afecto físico
related: Eroticism
related: Massage
related: Homoeroticism

Queens (Gay culture)
type: Concept
issued: 2019-05-14
modified: 2025-02-23
replaces: queens
comment: Slang term for effeminate gay men; predominantly used in the United States.
comment: Término de la jerga para hombres gay afeminados; utilizado predominantemente en los Estados Unidos.
alternative label: Queens
alternative label: Reinas
broader: Gay culture
broader: Gay men
change note: Version 4.2.0
has top concept: Subcultures
in scheme: v3
narrower: Drag queens
preferred label: Reinas (Cultura gay)
related: Gender expression
related: Sissies

Queer youth
type: Concept
issued: 2019-05-14
modified: 2025-02-23
replaces: queerYouth
comment: Queer people who are between the ages of childhood and adulthood.
comment: Personas queer que se encuentran entre las edades de la niñez y la edad adulta.
alternative label: Queer teenagers
alternative label: Queer adolescents
alternative label: Queer teens
alternative label: Adolescentes queer
alternative label: Jóvenes queer
broader: Queer people
broader: LGBTQ+ youth
change note: Version 4.2.0
has top concept: LGBTQ+ people
in scheme: v3
narrower: Queer children
preferred label: Juventud queer
related: Queer youth literature

Queer theology
type: Concept
issued: 2019-05-14
modified: 2025-02-23
replaces: queerTheology
comment: A theological method that developed out of queer theory. Queer theology, which encompasses the previously commonly used terms gay theology and lesbian theology, can variously be understood as (1) theology done by, with, and for LGBTQ+ people according to their needs; (2) theology that purposefully opposes social and cultural norms surrounding gender and sexuality; and (3) theology that broadly challenges and deconstructs harmful historical boundaries.
comment: Un método teológico que se desarrolló a partir de la teoría queer. La teología queer, que abarca los términos previa y comúnmente utilizados de teología gay y teología lesbiana, puede entenderse de diversas formas, como (1) teología realizada por, con y para personas LGBTQ+ de acuerdo a sus necesidades; (2) teología que se opone deliberadamente a las normas sociales y culturales con respecto al género y la sexualidad; y (3) teología que desafía y deconstruye de forma abarcadora fronteras históricas dañinas.
alternative label: Gay theology
alternative label: LGBTQ+ theology
alternative label: Lesbian theology
alternative label: Teología gay
alternative label: Teología LGBTQ+
alternative label: Teología lesbiana
change note: Version 4.2.0
in scheme: v3
preferred label: Teología queer
related: LGBTQ+ African religions
related: LGBTQ+ spiritual people
related: Queer theory

Sex clubs
type: Concept
issued: 2019-05-14
modified: 2025-02-23
replaces: sexClubs
comment: Establishments where patrons can engage in sex with other patrons, as well as formal or informal groups that organize sex-related activities.
comment: Establecimientos en los que los clientes pueden mantener relaciones sexuales con otros clientes, así como grupos formales o informales que organizan actividades relacionadas con el sexo.
alternative label: Clubes sexuales
broader: Sex industry
change note: Version 4.2.0
has top concept: Sex industry
in scheme: v3
preferred label: Clubs de sexo
related: Dark rooms
related: Gay saunas
related: Sex parties
related: Play spaces

Sexual abstinence
type: Concept
issued: 2019-05-14
modified: 2025-02-23
replaces: sexualAbstinence
comment: Practice of abstaining or not participating in some or all forms of sexual activity, whether for medical, psychological, social, moral, or religious reasons. Sexual abstinence may be voluntary or involuntary.
comment: Práctica de abstenerse o no participar en algunas o todas las formas de actividad sexual, ya sea por razones médicas, psicológicas, sociales, morales o religiosas. La abstinencia sexual puede ser voluntaria o involuntaria.
broader: Sex (Act)
change note: Version 4.2.0
has top concept: Sex (Act)
in scheme: v3
narrower: Virginity
preferred label: Abstinencia sexual
related: Asexuality
related: Celibacy
related: Sexuality

LGBTQ+ people with sexual addictions
type: Concept
issued: 2019-05-14
modified: 2025-02-23
replaces: sexualAddiction
comment: LGBTQ+ people experiencing addiction to or dependency upon sexual activities. Only use to refer to individuals who describe themselves as having sexual addictions, not individuals whose sexual practices are perceived as promiscuous or unsafe by others.
comment: Personas LGBTQ+ que experimentan una adicción o dependencia a actividades sexuales. Utilícese únicamente para referirse a personas que se describen a sí mismas como adictas sexuales, no a personas cuyas prácticas sexuales son percibidas como promiscuas o inseguras por otras personas.
alternative label: LGBTQ+ people with sex addictions
broader: LGBTQ+ people with addictions
change note: Version 4.2.0
has top concept: LGBTQ+ people
in scheme: v3
narrower: LGBTQ+ people with internet sex addictions
preferred label: Personas LGBTQ+ con adicciones sexuales
related: Exhibitionism
related: Hypersexuality
related: Erotomania

Soft butches
type: Concept
issued: 2019-05-14
modified: 2025-02-23
replaces: softButches
comment: People who are somewhat or slightly masculine in their appearance; commonly used in lesbian communities.
comment: Personas que tienen una apariencia algo o ligeramente masculina; comúnmente utilizado en comunidades de lesbianas.
broader: Sexual identity
change note: Version 4.2.0
has top concept: Sexual identity
in scheme: v3
preferred label: Marimachas suaves
related: Butches
related: Femmes
related: Lesbians
related: Masculine of center

Stone butches
type: Concept
issued: 2019-05-14
modified: 2025-02-23
replaces: stoneButches
comment: Individuals whose gender expression and/or identity is masculine-presenting and who usually do not like to be sexually touched, though they will still provide their partners with sexual pleasure; commonly used in lesbian communities.
comment: Personas cuya expresión y/o identidad de género es de presentación masculina y a quienes generalmente no les gusta que les toquen sexualmente, aunque sí brindarán placer sexual a sus parejas; comúnmente utilizado en comunidades de lesbianas.
broader: Sexual identity
change note: Version 4.2.0
has top concept: Sexual identity
in scheme: v3
preferred label: Marimachas fuertes
related: Butch-femme relationships
related: Butches
related: Femmes
related: Lesbians

Surrogacy
type: Concept
issued: 2019-05-14
modified: 2025-02-23
replaces: surrogacy
comment: A method or agreement whereby a person consents to carry a pregnancy for another person or people who will become the child's parent(s) after birth.
comment: Un método o acuerdo mediante el cual una persona consiente a llevar a cabo un embarazo para otra persona o personas que se convertirán en los padres del niño después del nacimiento.
alternative label: Vientre de alquiler
broader: Gestational parenthood
broader: Conception by LGBTQ+ people
broader: Assisted reproduction
change note: Version 4.2.0
has top concept: LGBTQ+ families
in scheme: v3
narrower: Gestational surrogacy
preferred label: Gestación subrogada
related: Egg donors

Tearooms (Gay culture)
type: Concept
issued: 2019-05-14
modified: 2025-02-23
replaces: tearooms
comment: U.S. slang term for public bathrooms that are used as locations for sexual encounters.
comment: Término de la jerga estadounidense para los baños públicos que se utilizan como lugar para encuentros sexuales.
alternative label: Tearooms
alternative label: Salones de té
broader: Sex locations
change note: Version 4.2.0
has top concept: Sex locations
in scheme: v3
narrower: Glory holes
preferred label: Tearooms (Cultura gay)
related: Cottages (Gay culture)
related: Public bathrooms
related: Tearoom sex

Testicle
type: Concept
issued: 2019-05-14
modified: 2025-02-23
replaces: testes
comment: Reproductive gland or gonad that produces sperm and androgens, primarily testosterone.
comment: Gónada o glándula reproductiva que produce espermatozoides y andrógenos, principalmente testosterona.
alternative label: Testicles
alternative label: Balls
alternative label: Nuts
alternative label: Testes
alternative label: Testis
alternative label: Bola
alternative label: Pelota
alternative label: Cojón
alternative label: Huevo
alternative label: Canica
alternative label: Coco
alternative label: Hueva
broader: Erogenous body parts
broader: Genitals
broader: Gonads
change note: Version 4.2.0
has top concept: Erogenous body parts
in scheme: v3
preferred label: Testículo
related: Metoidioplasty
related: Scrotoplasty

Transfeminine people
type: Concept
issued: 2019-05-14
modified: 2025-02-23
replaces: transfemininePeople
comment: People who identify partially or fully with a feminine gender identity and who were typically (but not always) assigned male at birth.
comment: Personas que se identifican parcial o totalmente con una identidad de género femenina y a quienes normalmente (pero no siempre) se les asignó al sexo masculino al nacer.
broader: Transgender people
change note: Version 4.2.0
has top concept: LGBTQ+ people
in scheme: v3
preferred label: Personas transfemeninas
related: Femininities
related: Demigirls
related: Transfemininity
related: Feminine of center

Transgender culture
type: Concept
issued: 2019-05-14
modified: 2025-02-23
replaces: transgenderCulture
comment: Cultural experiences shared by members of transgender communities or products of transgender culture (e.g., art and media created by and for transgender people, activism focused on transgender issues, slang commonly used in transgender communities, etc.).
comment: Experiencias culturales compartidas por miembros de comunidades transgénero o productos de la cultura transgénero (por ejemplo, arte y medios creados por y para personas transgénero, activismo centrado en cuestiones transgénero, jerga comúnmente utilizada en comunidades transgénero, etc.).
broader: LGBTQ+ culture
change note: Version 4.2.0
has top concept: Subcultures
in scheme: v3
narrower: Transgender slang
preferred label: Cultura transgénero
related: Sexual identity
related: Queer culture
related: Bisexual culture

Transgender relationships
type: Concept
issued: 2019-05-14
modified: 2025-02-23
replaces: transgenderRelationships
comment: Ongoing connections (romantic, sexual, or platonic) between two or more transgender people.
comment: Conexiones continuas (románticas, sexuales o platónicas) entre dos o más personas transgénero.
broader: Relationship satisfaction
change note: Version 4.2.0
has top concept: Relationship satisfaction
in scheme: v3
preferred label: Relaciones transgénero
related: Bisexual relationships
related: Gay relationships
related: Lesbian relationships
related: Queer relationships

Transvestites
type: Concept
issued: 2019-05-14
modified: 2025-02-23
replaces: transvestites
comment: U.S. historical term used to describe individuals who wear clothes associated with a gender other than their gender assigned at birth; generally considered to be a derogatory term; use only in historical contexts.
comment: Término histórico estadounidense utilizado para describir a personas que utilizan ropa asociada con un género distinto al asignado al nacer; generalmente se considera un término despectivo; utilícese únicamente en contextos históricos.
broader: LGBTQ+ historical terms
broader: Gender minorities
change note: Version 4.2.0
has top concept: LGBTQ+ historical terms
in scheme: v3
preferred label: Travestis
related: Crossdressers
related: Transgender people
related: Clocking (Gender)

Metamours
type: Concept
issued: 2020-06-03
modified: 2025-02-23
replaces: metamours
comment: In polyamory or open relationships, metamours are the partners of an individual's partner, with whom the individual does not have a direct sexual or romantic relationship.
comment: En el poliamor o las relaciones abiertas, los metamours son las parejas de la pareja de una persona, con quien la persona no tiene una relación sexual o romántica directa.
broader: Polyamory
broader: Non-monogamous people
change note: Version 4.2.0
has top concept: Relationship orientation
in scheme: v3
related: Secondary partners
related: Consensual non-monogamy
related: Paramours

Lesbian literary criticism
type: Concept
issued: 2020-06-03
modified: 2025-02-23
replaces: lesbianLiteraryCriticism
comment: The study, evaluation, and interpretation of literary works focusing on lesbian characters or themes; can also include interpretation of literature through the lens and frameworks of lesbian studies.
comment: El estudio, la evaluación y la interpretación de obras literarias centradas en personajes o temas lésbicos; también puede incluir la interpretación de la literatura a través del lente y los marcos teóricos de los estudios lésbicos.
broader: LGBTQ+ literary criticism
change note: Version 4.2.0
has top concept: LGBTQ+ literary criticism
in scheme: v3
preferred label: Crítica literaria lésbica
related: Lesbian authors
related: Aromantic literary criticism
related: Asexual literary criticism
related: Greyromantic literary criticism

Gay literary criticism
type: Concept
issued: 2020-06-03
modified: 2025-02-23
replaces: gayLiteraryCriticism
comment: The study, evaluation, and interpretation of literary works focusing on gay characters or themes; can also include interpretation of literature through the lens and frameworks of gay studies.
comment: El estudio, la evaluación y la interpretación de obras literarias centradas en personajes o temas gay; también puede incluir la interpretación de la literatura a través del lente y los marcos teóricos de los estudios gay.
broader: LGBTQ+ literary criticism
change note: Version 4.2.0
has top concept: LGBTQ+ literary criticism
in scheme: v3
preferred label: Crítica literaria gay
related: Gay authors
related: Aromantic literary criticism
related: Asexual literary criticism
related: Greyromantic literary criticism

Bisexual literary criticism
type: Concept
issued: 2020-06-03
modified: 2025-02-23
replaces: bisexualLiteraryCriticism
comment: The study, evaluation, and interpretation of literary works focusing on bisexual characters or themes; can also include interpretation of literature through the lens and frameworks of bisexuality.
comment: Bibliotecas que contienen materiales principalmente relacionados con personas bisexuales o destinados a personas bisexuales.
broader: LGBTQ+ literary criticism
change note: Version 4.2.0
has top concept: LGBTQ+ literary criticism
in scheme: v3
preferred label: Bibliotecas bisexuales
related: Bisexual authors
related: Aromantic literary criticism
related: Asexual literary criticism
related: Greyromantic literary criticism

Transgender literary criticism
type: Concept
issued: 2020-06-03
modified: 2025-02-23
replaces: transgenderLiteraryCriticism
comment: The study, evaluation, and interpretation of literary works focusing on transgender characters or themes; can also include interpretation of literature through the lens and frameworks of transgender studies.
comment: El estudio, la evaluación y la interpretación de obras literarias centradas en personajes o temas transgénero; también puede incluir la interpretación de la literatura a través del lente y los marcos teóricos de los estudios transgénero.
broader: LGBTQ+ literary criticism
change note: Version 4.2.0
has top concept: LGBTQ+ literary criticism
in scheme: v3
preferred label: Crítica literaria transgénero
related: Transgender authors
related: Aromantic literary criticism
related: Asexual literary criticism
related: Greyromantic literary criticism

Queer literary criticism
type: Concept
issued: 2020-06-03
modified: 2025-02-23
replaces: queerLiteraryCriticism
comment: The study, evaluation, and interpretation of literary works focusing on queer characters or themes; can also include interpretation of literature through the lens and frameworks of queer theory.
comment: El estudio, la evaluación y la interpretación de obras literarias centradas en personajes o temas queer; también puede incluir la interpretación de la literatura a través del lente y los marcos teóricos de la teoría queer.
broader: LGBTQ+ literary criticism
change note: Version 4.2.0
has top concept: LGBTQ+ literary criticism
in scheme: v3
preferred label: Crítica literaria queer
related: Queer authors
related: Aromantic literary criticism
related: Asexual literary criticism
related: Greyromantic literary criticism

Megasexual people
type: Concept
issued: 2020-12-11
modified: 2025-02-23
replaces: megasexualPeople
comment: People who do not experience strong emotional connections to other people unless they form strong sexual connections with them first.
comment: Personas que no experimentan fuertes conexiones emocionales con otras personas a menos que primero formen fuertes conexiones sexuales con ellas.
broader: Sexual minorities
change note: Version 4.2.0
has top concept: Sexual minorities
in scheme: v3
narrower: Megasexual college students
preferred label: Personas megasexuales
related: Asexual people
related: Sexual relationships
related: Megasexuality

Body part fetishes
type: Concept
issued: 2020-12-11
modified: 2025-02-23
replaces: partialism
comment: Any of various fetishes regarding a specific part of the body.
comment: Cualquiera de los diversos fetiches relacionados con una parte específica del cuerpo.
alternative label: Body part fetish
alternative label: Body part fetishism
alternative label: Partialism
alternative label: Partialisms
alternative label: Fetiche de partes del cuerpo
alternative label: Fetichismo de partes del cuerpo
alternative label: Parcialismos
preferred label: Parcialismo
broader: BDSM
change note: Version 4.2.0
has top concept: Eroticism
in scheme: v3
narrower: Breast fetish
narrower: Muscle worship
narrower: Boot fetish
related: Erogenous body parts

Secondary partners
type: Concept
issued: 2020-12-11
modified: 2025-02-23
replaces: secondaryPartners
comment: A term used in hierarchical polyamory to refer to partners whose interests and desires come second to those of the primary partner(s).
comment: Un término utilizado en el poliamor jerárquico para referirse a parejas cuyos intereses y deseos son secundarios a los de la(s) pareja(s) principal(es).
broader: Partners
change note: Version 4.2.0
has top concept: Partners
in scheme: v3
preferred label: Parejas secundarias
related: Metamours
related: Hierarchical non-monogamy
related: Primary partners
related: Paramours

Compulsory monogamy
type: Concept
issued: 2021-06-30
modified: 2025-02-23
replaces: compulsoryMonogamy
comment: The assumption that all people share a desire for monogamous relationships and that this is a preferential life goal.
comment: La suposición de que todas las personas comparten el deseo de tener relaciones monógamas y que este es un objetivo preferencial en la vida.
change note: Version 4.2.0
in scheme: v3
preferred label: Monogamia obligatoria
related: Amatonormativity
related: Compulsory sexuality
related: Relationship orientation
related: Monogamous people

Non-monogamy
type: Concept
issued: 2021-06-30
modified: 2025-02-23
replaces: nonMonogamy
comment: Practice of engaging in romantic or sexual relationships with more than one person simultaneously.
comment: Práctica de entablar relaciones románticas o sexuales con más de una persona simultáneamente.
alternative label: Nonmono
alternative label: Nonmonogamy
alternative label: Nomonogamia
broader: Relationship orientation
change note: Version 4.2.0
has top concept: Relationship orientation
in scheme: v3
narrower: Hierarchical non-monogamy
narrower: Consensual non-monogamy
narrower: Jealousy
preferred label: No monogamia
related: Polygamous people

Paramours
type: Concept
issued: 2021-06-30
modified: 2025-02-23
replaces: paramours
comment: In polyamory contexts, paramours are the partners of an individual's partner, typically as part of a relationship the primary partner is unaware of. In other contexts, this term is used broadly as a synonym for lovers.
comment: En contextos polyamoros, los paramours son lo
broader: Polyamory
broader: Non-monogamous people
change note: Version 4.2.0
has top concept: Relationship orientation
in scheme: v3
related: Metamours
related: Secondary partners
related: Consensual non-monogamy

Transgenderqueer people
type: Concept
issued: 2021-06-30
modified: 2025-02-23
replaces: transgenderqueerPeople
comment: Someone who is both trans and genderqueer and who identifies as transgenderqueer.
comment: Alguien que es transgénero y genderqueer y que se identifica como transgénero queer.
broader: Genderqueer people
broader: Transgender people
broader: Gender minorities
change note: Version 4.2.0
has top concept: LGBTQ+ people
in scheme: v3
preferred label: Personas transgenderqueer
related: Transgenderqueer identity
related: Genderqueer identity

Tribadism
type: Concept
issued: 2021-06-30
modified: 2025-02-23
replaces: tribadism
comment: A mostly antiquated term used either to refer to scissoring, to any sexual activity between women, or to the general concept of being a lesbian ("lesbianism").
comment: Un término mayoritariamente anticuado utilizado para referirse a hacer tijeras, a cualquier actividad sexual entre mujeres o al concepto general de ser lesbiana ("lesbianismo").
alternative label: Tribbing
alternative label: Hacer la tijera
alternative label: Tijereando
alternative label: Hacer la tortilla
alternative label: Untar
alternative label: Raspar
alternative label: Rastillar
alternative label: Restregarse
broader: LGBTQ+ historical terms
broader: Sex (Act)
change note: Version 4.2.0
has top concept: LGBTQ+ historical terms
in scheme: v3
preferred label: Tribadismo
related: Lesbianism
related: Tribades
related: Scissoring

Intersex authors
type: Concept
issued: 2021-11-09
modified: 2025-03-13
comment: Intersex creators of written works.
comment: Creadores de obras escritas conocidos por ser intersex.
alternative label: Intersex writers
preferred label: Autores intersex
alternative label: Escritores intersex
broader: LGBTQ+ authors
change note: Version 4.2.0
has top concept: LGBTQ+ people
in scheme: v3
related: Intersex fiction
related: Intersex literature
related: Intersex biographies
related: Intersex people's writings

Asexual parents
type: Concept
issued: 2021-11-23
modified: 2025-02-23
comment: Parents who are asexual.
comment: Padres y/o madres que son asexuales.
alternative label: Ace parents
alternative label: Padres ace
alternative label: Madres ace
alternative label: Padres asexuales
alternative label: Madres asexuales
broader: LGBTQ+ parents
change note: Version 4.2.0
has top concept: LGBTQ+ families
in scheme: v3
narrower: Asexual mothers
preferred label: Madres y padres asexuales
related: Asexual people
related: Asexual families
related: Children of asexual people

Two-Spirit parents
type: Concept
issued: 2021-11-23
modified: 2025-02-23
comment: Two-Spirit people who are parents.
comment: Padres y/o madres que son dos espíritus.
alternative label: 2S parents
alternative label: Two Spirit parents
alternative label: Two Spirited parents
alternative label: Two-Spirited parents
alternative label: Madres dos espíritus
alternative label: Padres dos espíritus
broader: Two-Spirit people
broader: Parents
change note: Version 4.2.0
has top concept: Gender
in scheme: v3
narrower: Two-Spirit fathers
narrower: Two-Spirit mothers
preferred label: Madres y padres dos espíritus
related: Children of Two-Spirit people

Children of asexual people
type: Concept
issued: 2021-11-23
modified: 2025-02-23
comment: Children who have one or more asexual parent.
comment: Hijos o hijas que tienen uno o más madres o padres asexuales.
alternative label: Children of ace people
alternative label: Hijos de personas ace
alternative label: Hijas de personas ace
alternative label: Hijas de personas asexuales
broader: Children of LGBTQ+ people
change note: Version 4.2.0
has top concept: Family members
in scheme: v3
narrower: Sons of asexual people
preferred label: Hijos de personas asexuales
related: Asexual people
related: Asexual families
related: Asexual parents

Children of intersex people
type: Concept
issued: 2021-11-23
modified: 2025-02-23
comment: Children who have one or more intersex parent.
comment: Hijos o hijas que tienen uno o más madres o padres intersexuales.
alternative label: Hijas de personas intersex
broader: Children of LGBTQ+ people
change note: Version 4.2.0
has top concept: Family members
in scheme: v3
preferred label: Hijos de personas intersexuales
related: Intersex people
related: Intersex families
related: Intersex parents
related: Sons of intersex people

Vers (Sex)
type: Concept
issued: 2021-12-07
modified: 2025-02-23
comment: Slang term for individuals who alternate between being the giving partner and the receiving partner in sexual encounters; typically used as an adjective (e.g., "They're vers.").
comment: Término de la jerga para personas que alternan entre ser la pareja que da y la que recibe en encuentros sexuales; normalmente se utiliza como adjetivo (por ejemplo, "Ella es vers").
preferred label: Vers
alternative label: Versatile
alternative label: Versátil
broader: Sexual identity
broader: Sexual roles
change note: Version 4.2.0
has top concept: Sexual identity
in scheme: v3
related: Bottoms (Sex)
related: Switches (Sex)
related: Tops (Sex)

Multiracial lesbians
type: Concept
issued: 2022-01-18
modified: 2025-02-23
comment: Lesbians who belong to two or more racial groups.
comment: Lesbianas que pertenecen a dos o más grupos raciales. Utilícese únicamente para personas que se autoidentifiquen como multirraciales.
alternative label: Multi-racial lesbians
preferred label: Lesbianas multirraciales
broader: Multiracial LGBTQ+ people
change note: Version 4.2.0
has top concept: LGBTQ+ people
in scheme: v3
related: Multiracial gay men
related: Multiracial bisexual people
related: Multiracial transgender people
related: Multiracial queer people

Multiracial gay men
type: Concept
issued: 2022-01-18
modified: 2025-02-23
comment: Gay men who belong to two or more racial groups.
comment: Hombres gay que pertenecen a dos o más grupos raciales. Utilícese únicamente para personas que se autoidentifiquen como multirraciales.
alternative label: Gay multi-racial men
alternative label: Gay multiracial men
alternative label: Multi-racial gay men
alternative label: Hombres multirraciales gay
broader: Multiracial LGBTQ+ people
change note: Version 4.2.0
has top concept: LGBTQ+ people
in scheme: v3
preferred label: Hombres gay multirraciales
related: Multiracial lesbians
related: Multiracial bisexual people
related: Multiracial transgender people
related: Multiracial queer people

Multiracial bisexual people
type: Concept
issued: 2022-01-18
modified: 2025-02-23
comment: Bisexual people who belong to two or more racial groups.
comment: Personas bisexuales que pertenecen a dos o más grupos raciales. Utilícese únicamente para personas que se autoidentifiquen como multirraciales.
alternative label: Bisexual multi-racial people
alternative label: Bisexual multiracial people
alternative label: Multi-racial bisexual people
alternative label: Personas multirraciales bisexuales
broader: Multiracial LGBTQ+ people
change note: Version 4.2.0
has top concept: LGBTQ+ people
in scheme: v3
preferred label: Personas bisexuales multirraciales
related: Multiracial lesbians
related: Multiracial gay men
related: Multiracial transgender people
related: Multiracial queer people

Multiracial transgender people
type: Concept
issued: 2022-01-18
modified: 2025-02-23
comment: Transgender people who belong to two or more racial groups.
comment: Personas transgénero que pertenecen a dos o más grupos raciales. Utilícese únicamente para personas que se autoidentifiquen como multirraciales.
alternative label: Multi-racial transgender people
alternative label: Transgender multi-racial people
alternative label: Transgender multiracial people
alternative label: Personas multirraciales transgénero
broader: Multiracial LGBTQ+ people
change note: Version 4.2.0
has top concept: LGBTQ+ people
in scheme: v3
preferred label: Personas transgénero multirraciales
related: Multiracial lesbians
related: Multiracial gay men
related: Multiracial bisexual people
related: Multiracial queer people

Multiracial queer people
type: Concept
issued: 2022-01-18
modified: 2025-02-23
comment: Queer people who belong to two or more racial groups.
comment: Personas queer que pertenecen a dos o más grupos raciales. Utilícese únicamente para personas que se autoidentifiquen como multirraciales.
alternative label: Multi-racial queer people
alternative label: Queer multi-racial people
alternative label: Queer multiracial people
alternative label: Personas multirraciales queer
broader: Multiracial LGBTQ+ people
change note: Version 4.2.0
has top concept: LGBTQ+ people
in scheme: v3
preferred label: Personas queer multirraciales
related: Multiracial lesbians
related: Multiracial gay men
related: Multiracial bisexual people
related: Multiracial transgender people

Transmasculinity
type: Concept
issued: 2022-02-14
modified: 2025-02-23
comment: Masculine-aligned identities or practices of trans people.
comment: Identidades o prácticas masculinas de personas trans.
broader: Gender expression
broader: Masculinities
change note: Version 4.2.0
has top concept: Gender
in scheme: v3
preferred label: Transmasculinidad
related: Transmasculine people
related: Trans men
related: Demiboys

Transfemininity
type: Concept
issued: 2022-02-14
modified: 2025-02-23
comment: Feminine-aligned identities or practices of trans people.
comment: Identidades o prácticas alineadas con lo femenino de personas trans.
broader: Femininities
broader: Gender expression
change note: Version 4.2.0
has top concept: Gender
in scheme: v3
preferred label: Transfeminidad
related: Transfeminine people
related: Trans women
related: Demigirls

Bisexual culture
type: Concept
issued: 2022-02-14
modified: 2025-02-23
comment: Use to describe cultural experiences shared by members of bisexual communities or products of bisexual culture (e.g., art and media created by and for bisexual people, activism focused on bisexual issues, slang commonly used in bisexual communities, etc.).
comment: Utilícese para describir experiencias culturales compartidas por miembros de comunidades bisexuales o productos de la cultura bisexual (p. ej., arte y medios creados por y para personas bisexuales, activismo centrado en cuestiones bisexuales, jerga comúnmente utilizada en comunidades bisexuales, etc.).
broader: LGBTQ+ culture
change note: Version 4.2.0
has top concept: Subcultures
in scheme: v3
preferred label: Cultura bisexual
related: Lesbian culture
related: Gay culture
related: Transgender culture
related: Queer culture

Detransitioning
type: Concept
issued: 2022-02-14
modified: 2026-02-23
comment: Ceasing or reversing the process of gender transition for any reason, including personal safety, stigma, costs associated with transitioning, health concerns, to regain fertility, etc.
comment: Cesar o revertir el proceso de transición de género por cualquier motivo, incluida la seguridad personal, el estigma, los costos asociados con la transición, problemas de salud, para recuperar la fertilidad, etc.
alternative label: Detransition
alternative label: Detransición
broader: Transitioning (Gender)
change note: Version 4.2.0
has top concept: Transitioning (Gender)
in scheme: v3
preferred label: Detransicionar
related: Transitioning status
related: Retransitioning
related: Desistance (Gender)
related: Detrans people

Retransitioning
type: Concept
issued: 2022-02-14
modified: 2026-02-23
comment: Restarting the process of gender transition after a period of detransitioning.
comment: Reiniciar el proceso de transición de género después de un período de detransición.
alternative label: Retransition
alternative label: Retransición
broader: Transitioning (Gender)
change note: Version 4.2.0
has top concept: Transitioning (Gender)
in scheme: v3
preferred label: Retransicionar
related: Transitioning status
related: Detransitioning
related: Desistance (Gender)
related: Detrans people

Desistance (Gender)
type: Concept
issued: 2022-02-14
modified: 2026-02-23
comment: No longer identifying as transgender, or, more broadly, no longer identifying as some particular gender.
comment: Ya no identificarse como transgénero o, en términos más generales, ya no identificarse con algún género en particular.
broader: Transitioning (Gender)
change note: Version 4.2.0
has top concept: Transitioning (Gender)
in scheme: v3
preferred label: Desistimiento (Género)
related: Transitioning status
related: Detransitioning
related: Retransitioning
related: Detrans people

Facial feminization surgery
type: Concept
issued: 2022-02-14
modified: 2025-02-23
comment: Any of various surgeries undertaken to feminize the face or facial features.
comment: Cualquiera de las diversas cirugías realizadas para feminizar el rostro o los rasgos faciales.
alternative label: FFS
alternative label: CFF
broader: Facial gender affirming surgery
change note: Version 4.2.0
has top concept: Medical care
in scheme: v3
narrower: Tracheal shave
preferred label: Cirugía de feminización facial
preferred label: Facial feminisation surgery
related: Transitioning status
related: Transitioning (Gender)
related: Facial masculinization surgery

Feminizing vocal surgery
type: Concept
issued: 2022-02-14
modified: 2025-02-23
comment: Any of various surgical procedures undertaken to feminize the voice.
comment: Cualquiera de los diversos procedimientos quirúrgicos realizados para feminizar la voz.
alternative label: VFS
alternative label: Vocal feminization surgery
alternative label: Voice feminization surgery
alternative label: Cirugía de feminización vocal
broader: Gender-affirming surgery
change note: Version 4.2.0
has top concept: Medical care
in scheme: v3
preferred label: Cirugía vocal feminizante
related: Transitioning (Gender)
related: Voice
related: Voice therapy (Gender)
related: Masculinizing vocal surgery

Masculinizing vocal surgery
type: Concept
issued: 2022-02-14
modified: 2025-02-23
comment: Any of various surgical procedures undertaken to masculinize the voice.
comment: Cualquiera de los diversos procedimientos quirúrgicos realizados para masculinizar la voz.
alternative label: Masculinization laryngoplasty
alternative label: Vocal masculinization surgery
alternative label: Voice masculinization surgery
alternative label: Cirugía vocal masculinizante
broader: Gender-affirming surgery
change note: Version 4.2.0
has top concept: Medical care
in scheme: v3
preferred label: Cirugía de masculinización de la voz
related: Transitioning (Gender)
related: Voice
related: Voice therapy (Gender)
related: Feminizing vocal surgery

Lesbian disabled people
type: Concept
issued: 2022-02-15
modified: 2025-02-23
comment: Lesbians who are disabled.
comment: Lesbianas con discapacidad.
alternative label: Disabled lesbians
alternative label: Lesbians with disabilities
alternative label: Discapacitadas lesbianas
alternative label: Lesbianas con discapacidades
broader: LGBTQ+ disabled people
change note: Version 4.2.0
has top concept: LGBTQ+ people
in scheme: v3
narrower: Lesbian hard of hearing people
narrower: Lesbian Deaf people
narrower: Lesbian blind people
preferred label: Lesbianas discapacitadas
related: Lesbians with chronic illnesses

Gay disabled men
type: Concept
issued: 2022-02-15
modified: 2025-02-23
comment: Gay men who are disabled.
comment: Hombres gay con discapacidad.
alternative label: Disabled gay men
alternative label: Gay men with disabilities
alternative label: Gay disabled people
alternative label: Disabled gay people
alternative label: Gay people with disabilities
alternative label: Hombres discapacitados gay
alternative label: Hombres gay con discapacidades
broader: LGBTQ+ disabled people
change note: Version 4.2.0
has top concept: LGBTQ+ people
in scheme: v3
narrower: Gay hard of hearing men
narrower: Gay Deaf men
narrower: Gay blind men
preferred label: Personas gay discapacitadas
related: Gay men with chronic illnesses

Bisexual disabled people
type: Concept
issued: 2022-02-17
modified: 2025-02-23
comment: Bisexual people who are disabled.
comment: Personas bisexuales con discapacidad.
alternative label: Bisexual people with disabilities
alternative label: Disabled bisexual people
alternative label: Personas discapacitadas bisexuales
alternative label: Personas bisexuales con discapacidades
broader: LGBTQ+ disabled people
change note: Version 4.2.0
has top concept: LGBTQ+ people
in scheme: v3
narrower: Bisexual hard of hearing people
narrower: Bisexual Deaf people
narrower: Bisexual blind people
preferred label: Personas bisexuales discapacitadas
related: Bisexual people with chronic illnesses

Transgender disabled people
type: Concept
issued: 2022-02-17
modified: 2025-02-23
comment: Transgender people who are disabled.
comment: Personas transgénero con discapacidad.
alternative label: Disabled transgender people
alternative label: Transgender people with disabilities
alternative label: Personas discapacitadas transgénero
alternative label: Personas transgénero con discapacidades
broader: LGBTQ+ disabled people
change note: Version 4.2.0
has top concept: LGBTQ+ people
in scheme: v3
narrower: Transgender hard of hearing people
narrower: Transgender Deaf people
narrower: Transgender blind people
preferred label: Personas transgénero discapacitadas
related: Transgender people with chronic illnesses

Queer disabled people
type: Concept
issued: 2022-02-17
modified: 2025-02-23
comment: Queer people who are disabled.
comment: Personas queer con discapacidad.
alternative label: Disabled queer people
alternative label: Queer people with disabilities
alternative label: Personas discapacitadas queer
alternative label: Personas queer con discapacidades
broader: LGBTQ+ disabled people
change note: Version 4.2.0
has top concept: LGBTQ+ people
in scheme: v3
narrower: Queer hard of hearing people
narrower: Queer Deaf people
narrower: Queer blind people
preferred label: Personas queer discapacitadas
related: Queer people with chronic illnesses

Anti-Two-Spirit discrimination
type: Concept
issued: 2022-02-17
modified: 2025-02-23
comment: The unjust or prejudicial treatment of Two-Spirit people due to their identity; may include the denial of legal rights, employment, and housing.
comment: El trato injusto o perjudicial hacia las personas Dos Espíritus por su identidad; puede incluir la negación de derechos legales, empleo y vivienda.
alternative label: Anti-2S discrimination
alternative label: Anti-Two Spirit discrimination
alternative label: Anti-Two Spirited discrimination
alternative label: Anti-Two-Spirited discrimination
alternative label: Discriminación dos espíritus
alternative label: Anti dos espiritus
alternative label: Discriminación anti-2S
alternative label: Anti 2S
alternative label: Discriminación hacia dos espíritus
broader: LGBTQ+ discrimination
change note: Version 4.2.0
has top concept: LGBTQ+ discrimination
in scheme: v3
preferred label: Discriminación anti dos espíritus
related: Intolerance towards LGBTQ+ people
related: LGBTQ+ phobia
related: Trans-exclusionary radical feminism
related: Anti-gender movement

Masquerading
type: Concept
issued: 2022-02-28
modified: 2025-02-23
comment: Term used in the 18th and 19th centuries to describe the act of dressing in disguise, often to emulate another gender. Only use in historical contexts.
comment: Término utilizado en los siglos XVIII y XIX para describir el acto de vestirse disfrazado, a menudo para emular a otro género. Utilícese únicamente en contextos históricos.
broader: LGBTQ+ historical terms
change note: Version 4.2.0
has top concept: LGBTQ+ historical terms
in scheme: v3
preferred label: Disfrazarte
related: Clothing
related: Crossdressing
related: Drag
related: Transvestism

Reading (LGBTQ+ culture)
type: Concept
issued: 2022-02-28
modified: 2025-02-23
comment: Slang term used in drag and ballroom communities to describe the act of playfully or wittily insulting someone's appearance or behavior; described by drag queen Dorian Corey as "the art form of the insult."
comment: Término de la jerga utilizado en las comunidades de drag y ballroom para describir el acto de insultar de manera jocosa o ingeniosa la apariencia o el comportamiento de alguien; descrito por la drag queen Dorian Corey como "el arte del insulto".
alternative label: Reading (cultura LGBTQ+)
change note: Version 4.2.0
in scheme: v3
preferred label: Lectura (cultura LGBTQ+)
related: Ball culture
related: Drag community
related: Reading (Gender)
related: Queer coding

Allosexual people
type: Concept
issued: 2022-03-31
modified: 2025-02-23
comment: Individuals who generally experience sexual attraction or the desire for partnered sexual experiences.
comment: Personas que generalmente experimentan atracción sexual o deseo de tener experiencias sexuales en pareja.
change note: Version 4.2.0
in scheme: v3
preferred label: Personas alosexuales
related: Sexual preference
related: Sexual relationships
related: Allosexuality
related: Compulsory sexuality

Genderqueer identity
type: Concept
issued: 2022-03-31
modified: 2025-02-23
comment: Gender identity that does not conform to the gender binary and emphasizes alignment with queer politics.
comment: Identidad de género que no se conforma al binario de género y enfatiza la alineación con la política queer.
alternative label: Genderqueerness
alternative label: Variante de género
alternative label: Género de amplia gama
broader: Gender identity
change note: Version 4.2.0
has top concept: Gender
in scheme: v3
preferred label: Identidad genderqueer
related: Genderqueer people
related: Queer people
related: Transgender people
related: Transgenderqueer people

Gender non-conforming identity
type: Concept
issued: 2022-03-31
modified: 2025-02-23
comment: Gender identity that does not conform to the gender binary, not to be confused with gender non-conforming practices engaged in by cisgender people.
comment: Identidad de género que no se conforma al binario de género, que no debe confundirse con las prácticas no conformes con el género que practican las personas cisgénero.
alternative label: Gender nonconforming identity
alternative label: Gender-nonconforming identity
alternative label: Identidad de género no conforme
broader: Gender identity
change note: Version 4.2.0
has top concept: Gender
in scheme: v3
preferred label: Identidad de género no conformista
related: Gender non-conforming people
related: Transgender people
related: Gender creative
related: Criminalization of gender non-conformity

Demigender identity
type: Concept
issued: 2022-03-31
modified: 2025-02-23
comment: Umbrella term for gender identities that emphasize a partial connection to a certain gender or concept of gender.
comment: Término general para identidades de género que enfatizan una conexión parcial con un determinado género o concepto de género.
broader: Gender identity
change note: Version 4.2.0
has top concept: Gender
in scheme: v3
preferred label: Identidad demigénero
related: Demigender people
related: Demisexuality
related: Demigirls
related: Demiboys

Cisgender identity
type: Concept
issued: 2022-03-31
modified: 2025-02-23
comment: Term used to describe the identity of people who identify with the sex or gender they were assigned at birth.
comment: Término utilizado para describir la identidad de las personas que se autoidentifican con el sexo o género que les fue asignado al nacer.
alternative label: Cis identity
alternative label: Identidad cis
broader: Gender identity
change note: Version 4.2.0
has top concept: Gender
in scheme: v3
preferred label: Identidad cisgénero
related: Cisgender men
related: Cisgender people
related: Cisgender women
related: Cissexuality

Two-Spirit victims of bullying
type: Concept
issued: 2022-05-11
modified: 2025-02-23
comment: Two-Spirit people who have experienced bullying due to their gender or sexual identity and may or may not have survived; follow the individual's preference for "victims" or "survivors" whenever possible.
comment: Personas dos espíritus que han sufrido acoso por su identidad sexual y pueden o no haber sobrevivido; siga la preferencia de la persona sobre el uso de "víctimas" o "supervivientes" siempre que sea posible.
alternative label: 2S victims of bullying
alternative label: Two Spirit victims of bullying
alternative label: Two Spirited victims of bullying
alternative label: Two-Spirited victims of bullying
broader: Two-Spirit people
change note: Version 4.2.0
has top concept: Gender
in scheme: v3
narrower: Two-Spirit youth victims of bullying
narrower: Two-Spirit survivors of bullying
preferred label: Víctimas dos espíritus de acoso
related: LGBTQ+ victims of bullying
related: Two-Spirit victims of crime

Fandom conventions
type: Concept
issued: 2022-07-04
modified: 2025-02-23
comment: Conventions dedicated to a particular fandom or fandom as a broad category.
comment: Convenciones dedicadas a un fandom en particular o al fandom como categoría amplia.
alternative label: Fan cons
alternative label: Fan conventions
alternative label: Fandom cons
alternative label: Cons de fans
alternative label: Convenciones fandom
broader: Fandom
change note: Version 4.2.0
has top concept: Subcultures
in scheme: v3
narrower: Furry conventions
narrower: Slash conventions
preferred label: Convenciones de fandom
related: Europride
related: LGBTQ+ meeting places

Fanworks
type: Concept
issued: 2022-07-04
modified: 2025-02-23
comment: Works, such as fanfiction or fanart, created by fans using characters, settings, and/or plots of other media properties.
comment: Obras, como fanfiction o fanart, creadas por fanáticos utilizando personajes, escenarios y/o tramas de otras propiedades mediáticas.
alternative label: Fan works
broader: Fandom
change note: Version 4.2.0
has top concept: Subcultures
in scheme: v3
narrower: Content warnings
narrower: Fanart
narrower: Fanfiction
narrower: Slash fanworks

Fursuits
type: Concept
issued: 2022-07-04
modified: 2025-02-23
comment: Costumes worn by furries that represent their fursonas (i.e., anthropomorphized animal versions of themselves).
comment: Disfraces utilizados por furros que representan sus fursonas (es decir, versiones animales antropomorfizadas de ellos mismos)
alternative label: Traje de furry
alternative label: Fursuit
broader: Furries
change note: Version 4.2.0
has top concept: Subcultures
in scheme: v3
preferred label: Traje de furro
related: Clothing
related: Role behavior
related: Roleplay
related: Costumes

Racism in fandom
type: Concept
issued: 2022-07-04
modified: 2025-02-23
comment: Issues and discussions about the presence of racism in fan spaces and works.
comment: Cuestiones y discusiones sobre la presencia del racismo en espacios y obras de fans.
broader: Racism
broader: Fandom
change note: Version 4.2.0
has top concept: Racism
in scheme: v3
preferred label: Racismo en fandom
related: Homophobia in fandom
related: Misogyny in fandom
related: Transphobia in fandom

Transgender people in fandom
type: Concept
issued: 2022-07-04
modified: 2025-02-23
comment: The participation and inclusion of transgender people in fan communities.
comment: La participación e inclusión de personas transgénero en las comunidades de fans.
alternative label: Trans people in fandom
alternative label: Personas trans en fandom
broader: Gender in fandom
broader: LGBTQ+ people in fandom
change note: Version 4.2.0
has top concept: Subcultures
in scheme: v3
preferred label: Personas transgénero en fandom
related: Transgender people
related: Transgender fiction
related: Transgender authors

Yuri fandom
type: Concept
issued: 2022-07-04
modified: 2025-02-23
comment: The fan community that focuses on, incorporates, or details the romantic or sexual relationships between female characters from anime and manga.
comment: La comunidad de fans que se centra sobre, incorpora o detalla las relaciones románticas o sexuales entre personajes femeninos del anime y manga.
broader: Anime and manga fandom
broader: Girls’ Love (Genre)
change note: Version 4.2.0
has top concept: Subcultures
in scheme: v3
narrower: Yuri
preferred label: Fandom yuri
related: Femslash
related: Slash fandom

LGBTQ+ people who use substances for medical purposes
type: Concept
issued: 2022-07-19
modified: 2025-04-24
comment: LGBTQ+ people who use substances (that are typically deemed harmful or are subject to legal restriction, such as drugs or alcohol) in order to manage pain and other symptoms related to a medical condition or disability.
comment: Personas LGBTQ+ que utilizan sustancias (que suelen ser consideradas nocivas o están sujetas a restricciones legales, como las drogas o el alcohol) para controlar el dolor y otros síntomas relacionados con una enfermedad o discapacidad.
alternative label: People who use substances for medical purposes (LGBTQ)
alternative label: Personas que utilizan sustancias con fines médicos (LGBTQ)
broader: LGBTQ+ people who use substances
change note: Version 4.2.0
has top concept: LGBTQ+ people
in scheme: v3
preferred label: Personas LGBTQ+ que utilizan sustancias con fines médicos
related: Cocaine
related: LGBTQ+ disabled people
related: LGBTQ+ people with chronic illnesses
related: Two-Spirit people who use substances for medical purposes

Fairies (Gay culture)
type: Concept
issued: 2022-07-20
modified: 2025-03-20
comment: Pejorative term used chiefly in North America to describe gay men (or men assumed to be gay) and insult their perceived femininity. Some gay men have reclaimed this term and use it to describe themselves. Not to be confused with Faeries, the queer spiritual group.
comment: Término peyorativo utilizado principalmente en Norteamérica para describir a los hombres gay (o a los hombres que se asume que son gay) e insultar su feminidad percibida. Algunos hombres gay han recuperado este término y lo utilizan para describirse a sí mismos. No debe confundirse con "Faeries", el grupo espiritual queer.
alternative label: Fairy (Gay culture)
alternative label: Hadas
broader: LGBTQ+ historical terms
broader: Reclaimed terms
broader: Slurs
change note: Version 4.2.0
has top concept: LGBTQ+ historical terms
in scheme: v3
preferred label: Faeries (cultura gay)
related: Gay culture
related: Gay slang

AIDS death and dying
type: Concept
issued: 2022-11-08
modified: 2025-02-23
comment: Experiences related to people with AIDS approaching or having reached the end of their lives.
comment: Experiencias relacionadas a personas con SIDA que se acercan o han llegado al final de sus vidas.
change note: Version 4.2.0
in scheme: v3
preferred label: Morir y la muerte por SIDA
related: LGBTQ+ death and dying
related: LGBTQ+ death notices
related: LGBTQ+ obituaries
related: Terminal care (AIDS)

Black feminism
type: Concept
issued: 2022-11-08
modified: 2025-02-23
comment: A form of feminism that developed in response to the failures of mainstream feminist and civil rights efforts to acknowledge the ways white supremacy and the patriarchy interact to inform the particular experiences of Black women.
comment: Una forma de feminismo que se desarrolló en respuesta a los fracasos de los esfuerzos feministas y de derechos civiles dominantes para reconocer las formas en que la supremacía blanca y el patriarcado interactúan para informar las experiencias particulares de las mujeres negras.
alternative label: Afro feminism
alternative label: Afro-feminism
alternative label: Afro feminismo
alternative label: Afro-feminismo
broader: Feminism
change note: Version 4.2.0
has top concept: Feminism
in scheme: v3
preferred label: Feminismo negro
related: Intersectionality
related: Racism
related: Womanism
related: Black feminists

White feminism
type: Concept
issued: 2022-11-08
modified: 2025-02-23
comment: Term used to describe (and criticize) forms of feminism that focus on the needs of white women at the expense of women of color.
comment: Término utilizado para describir (y criticar) formas de feminismo que se centran en las necesidades de las mujeres blancas a expensas de las mujeres de color.
broader: Feminism
change note: Version 4.2.0
has top concept: Feminism
in scheme: v3
preferred label: Feminismo blanco
related: Intersectionality
related: Social privilege
related: Racism
related: Womanism

MLM (Men Loving Men)
type: Concept
issued: 2022-11-08
modified: 2025-02-23
comment: Slang term used to describe men who have romantic and/or sexual relationships with other men; often used as an alternative to the term "Men who have sex with men." Can be used to describe men who are exclusively or primarily interested in men, as well as men who are also interested in people of other or all genders. Only use to describe people who self-identify as MLM.
comment: Término de la jerga utilizado para describir a hombres que tienen relaciones románticas y/o sexuales con otros hombres; a menudo se utiliza como alternativa al término "Hombres que tienen sexo con hombres". Puede utilizarse para describir a hombres que están interesados ​​exclusiva o principalmente en hombres, así como a hombres que también están interesados ​​en personas de otros o todos los géneros. Utilícese únicamente para describir a las personas que se autoidentifiquen como MLM.
alternative label: Man loving man
alternative label: Men loving men
alternative label: Hombres que aman hombres
broader: LGBTQ+ people
broader: Males
broader: Sexual minorities
change note: Version 4.2.0
has top concept: LGBTQ+ people
in scheme: v3
related: Down-low
related: Same-gender-loving

WLW (Women Loving Women)
type: Concept
issued: 2022-11-08
modified: 2025-02-23
comment: Slang term used to describe women who have romantic and/or sexual relationships with other women. Can be used to describe women who are exclusively or primarily interested in women, as well as women who are also interested in people of other or all genders. Only use to describe people who self-identify as WLW.
comment: Término de la jerga utilizado para describir a mujeres que tienen relaciones románticas y/o sexuales con otras mujeres. Puede utilizarse para describir a mujeres que están exclusiva o principalmente interesadas en mujeres, así como a mujeres que también están interesadas en personas de otros o todos los géneros. Utilícese únicamente para describir a personas que se identifiquen como WLW.
alternative label: Woman loving woman
alternative label: Women loving women
alternative label: Mujeres amando mujeres
alternative label: Mujeres amando a mujeres
broader: LGBTQ+ people
broader: Sexual minorities
broader: Females
change note: Version 4.2.0
has top concept: LGBTQ+ people
in scheme: v3
preferred label: WLW (Mujeres que aman mujeres)
related: Same-gender-loving
related: Women's sexuality

Cisgender youth
type: Concept
issued: 2022-11-10
modified: 2025-02-23
comment: Cisgender people who are between the ages of childhood and adulthood.
comment: Personas cisgénero que se encuentran entre las edades de la niñez y la edad adulta.
alternative label: Cis youth
alternative label: Cisgender adolescents
alternative label: Cisgender teenagers
alternative label: Cisgender teens
alternative label: Juventud cis
alternative label: Adolescentes cisgénero
alternative label: Adolescentes cis
alternative label: Jóvenes cis
broader: Cisgender people
broader: Youth
change note: Version 4.2.0
has top concept: Cisgender people
in scheme: v3
narrower: Cisgender children
narrower: Cisgender boys
narrower: Cisgender girls
preferred label: Juventud cisgénero

Cisgender children
type: Concept
issued: 2022-11-10
modified: 2025-02-23
comment: Children younger than 18 years who identify as cisgender.
comment: Niños menores de 18 años que se autoidentifican como cisgénero.
alternative label: Cis children
alternative label: Cis kids
alternative label: Cisgender kids
alternative label: Niños cis
alternative label: Niñas cis
broader: Children
broader: Cisgender people
broader: Cisgender youth
change note: Version 4.2.0
has top concept: Family members
in scheme: v3
narrower: Cisgender boys
narrower: Cisgender girls
preferred label: Niños cisgénero

Heterosexual children
type: Concept
issued: 2022-11-10
modified: 2025-02-23
comment: Children younger than 18 years who identify as heterosexual.
comment: Niños menores de 18 años que se autoidentifican como heterosexuales.
alternative label: Heterosexual kids
alternative label: Straight children
alternative label: Straight kids
broader: Children
broader: Heterosexuals
broader: Heterosexual youth
change note: Version 4.2.0
has top concept: Family members
in scheme: v3
narrower: Heterosexual boys
narrower: Heterosexual girls
preferred label: Niños heterosexuales

Inclusivity
type: Concept
issued: 2022-11-10
modified: 2026-02-26
comment: The practice or policy of providing equal access and support to groups of people who might otherwise be excluded or marginalized, such as LGBTQ+ people, people of color, disabled people, etc.
comment: La práctica o política de brindar igualdad de acceso y apoyo a grupos de personas que, de otro modo, podrían quedar excluidas o marginadas, como las personas LGBTQ+, las personas de color, las personas discapacitadas, etc.
alternative label: Inclusion
alternative label: Inclusive
alternative label: Inclusión
alternative label: Inclusivo
change note: Version 4.2.0
in scheme: v3
narrower: Trans inclusivity
narrower: Trans exclusivity
preferred label: Inclusividad
related: Libraries and LGBTQ+ people

Black asexual people
type: Concept
issued: 2022-12-13
modified: 2025-02-23
comment: Black people who are asexual. Use only for individuals who self-identity as Black. Follow the individual’s preference for African American or Black whenever possible.
comment: Personas negras que son asexuales. Utilícese únicamente para personas que se autoidentifiquen como negras. Siga la preferencia de la persona sobre el uso de "afroamericanos" o "negros" siempre que sea posible.
alternative label: Asexual Black people
alternative label: Black ace people
alternative label: Personas negras asexuales
alternative label: Personas negras ace
broader: Black LGBTQ+ people
change note: Version 4.2.0
has top concept: LGBTQ+ people
in scheme: v3
narrower: Afro-Canadian asexual people
narrower: Afro-Caribbean asexual people
narrower: Afro-European asexual people
narrower: Afro-Latin American asexual people
preferred label: Personas asexuales negras

Asexual literature
type: Concept
issued: 2023-03-23
modified: 2025-02-23
comment: Written literary works about asexuality, asexual characters, or asexual themes.
comment: Obras literarias escritas sobre la asexualidad, personajes asexuales o temas asexuales.
broader: LGBTQ+ literature
change note: Version 4.2.0
has top concept: Subcultures
in scheme: v3
preferred label: Literatura asexual
related: Asexual authors
related: Asexual fiction
related: Asexual poetry
related: Asexual drama

Demisexual literature
type: Concept
issued: 2023-03-26
modified: 2025-02-23
comment: Written literary works about demisexuality, demisexual characters, or demisexual themes.
comment: Obras literarias escritas sobre la demisexualidad, los personajes demisexuales o los temas demisexuales.
broader: LGBTQ+ literature
change note: Version 4.2.0
has top concept: Subcultures
in scheme: v3
preferred label: Literatura demisexual
related: Demisexual fiction
related: Demisexual poetry
related: Demisexual drama
related: Demisexual authors

Megasexual literature
type: Concept
issued: 2023-04-11
modified: 2025-02-23
comment: Written literary works about megasexuality, megasexual characters, or megasexual themes.
comment: Obras literarias escritas sobre la megasexualidad, personajes megasexuales o temas megasexuales.
broader: LGBTQ+ literature
change note: Version 4.2.0
has top concept: Subcultures
in scheme: v3
preferred label: Literatura megasexual
related: Megasexual drama
related: Megasexual authors
related: Megasexual fiction
related: Megasexual poetry

Greyromantic literature
type: Concept
issued: 2023-04-11
modified: 2025-02-23
comment: Written literary works about greyromanticism, greyromantic characters, or greyromantic themes.
comment: Obras literarias escritas sobre el grisromanticismo, personajes grisrománticos o temas grisrománticos.
broader: LGBTQ+ literature
change note: Version 4.2.0
has top concept: Subcultures
in scheme: v3
preferred label: Literatura grisromántica
related: Greyromantic drama
related: Greyromantic authors
related: Greyromantic fiction
related: Greyromantic poetry

Queerspawn
type: Concept
issued: 2023-04-14
modified: 2025-02-23
comment: People with one or more queer parent or caregiver, usually for self-identification. Queerspawn is believed to have been coined in 1995 or 1996 by Stefan Lynch for use in zine published by COLAGE, a U.S. based organization dedicated to supporting people with one or more LGBTQ+ caregiver.
comment: Personas con uno o más padres o cuidadores queer, generalmente utilizado para autoidentificarse. Se cree que Queerspawn fue acuñado en 1995 o 1996 por Stefan Lynch para utilizarlo en un zine publicado por COLAGE, una organización con sede en EE. UU. dedicada a apoyar a las personas con uno o más cuidadores LGBTQ+.
broader: Children of LGBTQ+ people
broader: LGBTQ+ slang
change note: Version 4.2.0
has top concept: Family members
in scheme: v3
related: Children of queer people
related: Queer families
related: Queer parents

LGBTQ+ family generations
type: Concept
issued: 2023-04-14
modified: 2025-02-23
comment: Refers to families with LGBTQ+ individuals in multiple generations.
comment: Se refiere a familias con personas LGBTQ+ en varias generaciones.
broader: LGBTQ+ families
change note: Version 4.2.0
has top concept: LGBTQ+ families
in scheme: v3
preferred label: Generaciones familiares LGBTQ+
related: Children of LGBTQ+ people
related: LGBTQ+ parents
related: Transgender parents
related: LGBTQ+ grandparents

Two-Spirit art
type: Concept
issued: 2023-04-14
modified: 2025-04-23
comment: Term for different forms of creative activity, including visual, material, and performing arts, by Two-Sprit artists or about Two-Spirit topics and communities.
comment: Término para diferentes formas de actividad creativa, incluidas las artes visuales, materiales y escénicas, realizadas por artistas dos espíritus o sobre temas y comunidades dos espíritus.
alternative label: 2S art
alternative label: Two Spirit art
alternative label: Two Spirited art
alternative label: Two-Spirited art
change note: Version 4.2.0
in scheme: v3
narrower: Two-Spirit erotic art
preferred label: Arte dos espíritus
related: LGBTQ+ arts
related: Two-Spirit people in visual art

Assisted reproductive technology
type: Concept
issued: 2023-04-14
modified: 2025-02-23
comment: An umbrella term used to describe all methods of conception beyond sexual intercourse, including but not limited to donor insemination, artificial insemination, surrogacy, egg donation, and IVF.
comment: Término general utilizado para describir todos los métodos de concepción más allá de las relaciones sexuales, incluidos, pero no limitados a, la inseminación de une donante, la inseminación artificial, la maternidad subrogada, la donación de óvulos y la FIV.
alternative label: ART
alternative label: Assisted reproductive technologies
alternative label: TRA
alternative label: Tecnología asistida de reproducción
change note: Version 4.2.0
in scheme: v3
narrower: Assisted reproduction
preferred label: Tecnología de reproducción asistida

Gestational surrogacy
type: Concept
issued: 2023-04-14
modified: 2025-02-23
comment: The process by which a person becomes pregnant using a donated egg.
comment: El proceso por el cual una persona queda embarazada a partir de un óvulo donado.
alternative label: Subrogancia gestacional
broader: Surrogacy
change note: Version 4.2.0
has top concept: LGBTQ+ families
in scheme: v3
preferred label: Subrogación gestacional
related: Egg donors
related: Gestational parenthood
related: Egg donation
related: Surro babies

Gender dysphoria in children
type: Concept
issued: 2023-06-27
modified: 2025-02-23
comment: A psychological diagnosis (replacing the outdated and offensive "gender identity disorder") used to describe the sense of unease or dissatisfaction an individual feels as a result of incongruence between their gender identity and their assigned gender, gender expression, and/or the way their gender is perceived by others. This term is also used colloquially by individuals to describe the discomfort and distress they experience as a result of this incongruence. Though gender dysphoria is often associated with trans people, people of any identity may experience gender dysphoria when they do not feel "right" in their body or the way their gender is being expressed. Use this particular term for works about children who experience or have experienced gender dysphoria.
comment: Un diagnóstico psicológico (que reemplaza al término anticuado y ofensivo de "trastorno de identidad de género") utilizado para describir la sensación de malestar o insatisfacción que siente una persona como resultado de la incongruencia entre su identidad de género y su género asignado, su expresión de género y/o la forma en que su género es percibido por otras personas. Este término también se utiliza coloquialmente por personas para describir el malestar y la angustia que experimentan como resultado de esta incongruencia. Aunque la disforia de género a menudo se asocia con las personas trans, las personas de cualquier identidad pueden experimentar disforia de género cuando no se sienten "bien" con su cuerpo o con la forma en que se expresan su género. Utilícese este término particular para trabajos sobre niños que experimentan o han experimentado disforia de género.
broader: Gender dysphoria
change note: Version 4.2.0
has top concept: Gender dysphoria
in scheme: v3
preferred label: Disforia de género en niños
related: LGBTQ+ children
related: Gender expression
related: Gender identity
related: Gender euphoria

Gender dysphoria in youth
type: Concept
issued: 2023-06-27
modified: 2025-02-23
comment: A psychological diagnosis (replacing the outdated and offensive "gender identity disorder") used to describe the sense of unease or dissatisfaction an individual feels as a result of incongruence between their gender identity and their assigned gender, gender expression, and/or the way their gender is perceived by others. This term is also used colloquially by individuals to describe the discomfort and distress they experience as a result of this incongruence. Though gender dysphoria is often associated with trans people, people of any identity may experience gender dysphoria when they do not feel "right" in their body or the way their gender is being expressed. Use this particular term for works about adolescents (people between the ages of childhood and adulthood) who experience or have experience gender dysphoria.
comment: Un diagnóstico psicológico (que reemplaza al término anticuado y ofensivo de "trastorno de identidad de género") utilizado para describir la sensación de malestar o insatisfacción que siente una persona como resultado de la incongruencia entre su identidad de género y su género asignado, su expresión de género y/o la forma en que su género es percibido por otras personas. Este término también se utiliza coloquialmente por personas para describir el malestar y la angustia que experimentan como resultado de esta incongruencia. Aunque la disforia de género a menudo se asocia con las personas trans, las personas de cualquier identidad pueden experimentar disforia de género cuando no se sienten "bien" con su cuerpo o con la forma en que se expresan su género. Utilícese este término particular para trabajos sobre adolescentes (personas entre la niñez y la edad adulta) que experimentan o han experimentado disforia de género
alternative label: Gender dysphoria in adolescence
alternative label: Gender dysphoria in adolescents
alternative label: Disforia de género en la adolescencia
alternative label: Disforia de género en los adolescentes
broader: Gender dysphoria
change note: Version 4.2.0
has top concept: Gender dysphoria
in scheme: v3
preferred label: Disforia de género en jóvenes
related: Gender expression
related: Gender identity
related: LGBTQ+ youth
related: Gender euphoria

Two-Spirit youth
type: Concept
issued: 2023-06-27
modified: 2025-02-23
comment: Two-Spirit people who are between the ages of childhood and adulthood.
comment: Personas dos espíritus que se encuentran entre la infancia y la adultez.
alternative label: 2S adolescents
alternative label: 2S teenagers
alternative label: 2S teens
alternative label: 2S youth
alternative label: Two Spirit adolescents
alternative label: Two Spirit teenagers
alternative label: Two Spirit teens
alternative label: Two Spirit youth
alternative label: Two Spirited adolescents
alternative label: Two Spirited teenagers
alternative label: Two Spirited teens
alternative label: Two Spirited youth
alternative label: Two-Spirited adolescents
alternative label: Two-Spirited teenagers
alternative label: Two-Spirited teens
alternative label: Two-Spirited youth
preferred label: Juventud dos espíritus
alternative label: Adolescentes dos espíritus
alternative label: Jóvenes dos espíritus
broader: Youth
change note: Version 4.2.0
has top concept: Youth
in scheme: v3
narrower: Two-Spirit youth survivors of bullying
narrower: Two-Spirit youth victims of bullying
related: LGBTQ+ youth
related: Two-Spirit youth literature

Black intersex people
type: Concept
issued: 2023-06-27
modified: 2025-02-23
comment: Black people who are intersex. Use only for individuals who self-identity as Black. Follow the individual’s preference for African American or Black whenever possible.
comment: Personas negras que son intersexuales. Utilícese únicamente para personas que seautoidentificancomo negras. Siga la preferencia del individuo para el uso de afroamericanos o negros siempre que sea posible.
alternative label: Intersex Black people
alternative label: Personas negras intersex
alternative label: Personas intersex negras
broader: Black LGBTQ+ people
change note: Version 4.2.0
has top concept: LGBTQ+ people
in scheme: v3
narrower: Afro-Canadian intersex people
narrower: Afro-Caribbean intersex people
narrower: Afro-European intersex people
narrower: Afro-Latin American intersex people
preferred label: Personas intersexuales negras

Temperature play
type: Concept
issued: 2023-12-15
modified: 2025-02-23
comment: Any of various forms of sensual or sexual play in which objects and substances are used to stimulate the body with heat or cold.
comment: Cualquiera de las diversas formas de juego sensual o sexual en las que se utilizan objetos y sustancias para estimular el cuerpo con calor o frío.
broader: BDSM
change note: Version 4.2.0
has top concept: Eroticism
in scheme: v3
narrower: Wax play
narrower: Fire play
narrower: Ice play
narrower: Cigar play
preferred label: Juego de temperatura

Boot fetish
type: Concept
issued: 2023-12-18
modified: 2025-02-23
comment: Eroticization of boots through wearing and incorporating into sexual play.
comment: Erotización de las botas mediante su uso e incorporación al juego sexual.
alternative label: Boot kink
broader: Body part fetishes
broader: Shoe fetish
change note: Version 4.2.0
has top concept: Eroticism
in scheme: v3
preferred label: Fetichismo de botas
related: Bootblacking
related: Uniform fetish
related: High heel fetish

Body modification
type: Concept
issued: 2023-12-18
modified: 2025-02-23
comment: Modification of the body, such as tattooing, piercing, branding, or cutting.
comment: Modificación del cuerpo como tatuajes, perforaciones, marcas o cortes.
change note: Version 4.2.0
in scheme: v3
narrower: Piercings
narrower: Tattoos
preferred label: Modificación corporal
related: Body adornment
related: Corsets

Play spaces
type: Concept
issued: 2023-12-18
modified: 2025-02-23
comment: A area or room designated for kink and sexual activities.
comment: Un área o habitación designada para actividades sexuales y kink.
alternative label: Dungeons
alternative label: Calabozos
broader: Sex locations
change note: Version 4.2.0
has top concept: Sex locations
in scheme: v3
preferred label: Espacios de juego
related: Dark rooms
related: Gay saunas
related: Sex clubs
related: Leather and kink conventions

Leather and kink conventions
type: Concept
issued: 2023-12-18
modified: 2025-02-23
comment: Leather and kink conventions typically take place annually at a hotel, resort, or other venue. They usually include parties, performances, title contests, vendors, play spaces, and classes and workshops on kink, sex, relationships, activism, and related topics.
comment: Las convenciones de cuero y kink suelen celebrarse anualmente en un hotel, centro turístico u otro lugar. Suelen incluir fiestas, actuaciones, concursos de títulos, vendedores, espacios de juego y clases y talleres sobre kink, sexo, relaciones, activismo y temas relacionados.
broader: Europride
change note: Version 4.2.0
has top concept: Europride
in scheme: v3
preferred label: Convenciones leather y kink
related: Leather community
related: Sex parties
related: Play spaces
related: Title contests

Gags
type: Concept
issued: 2023-12-18
modified: 2025-06-03
comment: An item or device used to prevent speech, usually by blocking or filling the mouth. Often used in some forms of bondage play.
comment: Un artículo o dispositivo utilizado para impedir el habla.
alternative label: Ball gags
alternative label: Ballgags
broader: Kink accessories
change note: Version 4.2.0
has top concept: Eroticism
in scheme: v3
preferred label: Mordaza
related: Bondage
related: Restraints
related: Gas masks (Erotic)
related: Hoods (Erotic)

Sex swings
type: Concept
issued: 2023-12-20
modified: 2025-02-23
comment: A type of reclining seat suspended from a stand or ceiling, typically used to position the body for sexual activity.
comment: Un tipo de asiento reclinable suspendido de un soporte o del techo, que generalmente se utiliza para posicionar el cuerpo para la actividad sexual.
alternative label: Sex slings
alternative label: Slings
alternative label: Swings
broader: Sex accessories
change note: Version 4.2.0
has top concept: Sex accessories
in scheme: v3
preferred label: Columpios sexuales
related: Ass fucking
related: Fisting
related: Fucking
related: Kink accessories

Breath control
type: Concept
issued: 2023-12-20
modified: 2025-02-23
comment: Controlling or restricting the ability to breathe in order to achieve heightened pleasure or stimulation.
comment: Controlar o restringir la capacidad de respirar para lograr mayor placer o estimulación.
alternative label: Breath control play
alternative label: Breath play
alternative label: Breathplay
alternative label: Suffocation
alternative label: Control de respiración
alternative label: Juego de respiración
alternative label: Juego de control de respiración
alternative label: Sofocación
broader: Sexual practices
change note: Version 4.2.0
has top concept: Sexual practices
in scheme: v3
narrower: Autoerotic asphyxiation
preferred label: Control de la respiración
related: Corsets
related: BDSM
related: Gas masks (Erotic)

Cuffs
type: Concept
issued: 2023-12-20
modified: 2025-03-20
comment: Any of various restraint devices designed to secure an individual’s wrists or ankles in bondage play.
comment: Cualquiera de los diversos dispositivos de sujeción diseñados para asegurar las muñecas o los tobillos de una persona en un juego de bondage.
alternative label: Cuff restraints
alternative label: Marrocas
alternative label: Chachas
broader: Restraints
broader: LGBTQ+ fashion
change note: Version 4.2.0
has top concept: Sex accessories
in scheme: v3
narrower: Handcuffs
preferred label: Esposas
related: Bondage
related: Hogtie

Nipple torture
type: Concept
issued: 2023-12-20
modified: 2025-02-23
comment: A kink activity where intense sensation, pain, or constriction is applied to the nipples.
comment: Una actividad kink en la que se aplica una sensación intensa, dolor o constricción en los pezones.
alternative label: Nip torture
alternative label: Tortura de pezon
broader: Sadomasochism
broader: Nipple play
change note: Version 4.2.0
has top concept: Eroticism
in scheme: v3
preferred label: Tortura de pezones
related: Nipple
related: Breast play

Two-Spirit operas
type: Concept
issued: 2024-01-09
modified: 2025-02-23
comment: Operas created by Two-Spirit directors, depicting Two-Spirit individuals, or that are regarded as important within Two-Spirit culture.
comment: Óperas creadas por directores dos espíritus, que representan a personas dos espíritus, o que se consideran importantes dentro de la cultura dos espíritus.
alternative label: 2S operas
alternative label: Two Spirit operas
alternative label: Two Spirited operas
alternative label: Two-Spirited operas
change note: Version 4.2.0
in scheme: v3
preferred label: Óperas dos espíritus
related: LGBTQ+ operas
related: Transgender operas
related: Intersex operas
related: Queer operas

Polycules
type: Concept
issued: 2024-05-24
modified: 2025-03-20
comment: Networks of polyamorous people who are connected by their or their partners' romantic and/or sexual relationships. Polycule members are not necessarily romantically and/or sexually involved with every member of the group. For example, Member A might be connected to Member B in that Member B is in a relationship with Member A's partner.
change note: Version 4.2.0
in scheme: v3
related: Relationship orientation
related: Non-monogamous people
related: Polyamorous people
related: Polyamorous families

Abortion
type: Concept
issued: 2024-06-19
modified: 2026-03-03
comment: The termination of a pregnancy by removal or expulsion of an embryo or fetus. Generally refers to induced abortion or deliberate actions to end a pregnancy. Most common forms are in-clinic abortion (also known as a surgical abortion) and medication abortion (also referred to as the abortion pill, which uses two different medicines called mifepristone and misoprostol). Abortion occurring without intervention is known as spontaneous abortion or "miscarriage".
alternative label: Pregnancy termination
alternative label: Termination of pregnancy
broader: Reproductive health care for LGBTQ+ people
change note: Version 4.2.0
has top concept: Health care for LGBTQ+ people
in scheme: v3
related: Abortion access for LGBTQ+ people
related: Reproductive rights
related: LGBTQ+ abortion seekers
related: Abortion funds

Reproductive rights
type: Concept
issued: 2024-07-11
modified: 2025-02-23
comment: Legal, social, or ethical principles of freedom around reproductive healthcare and decision-making. Often used to refer to an individual's right to bodily autonomy and access to legal and safe birth control, abortion, assisted reproduction, and prenatal and obstetric care.
change note: Version 4.2.0
in scheme: v3
related: Reproductive health care for LGBTQ+ people
related: Abortion
related: Bodily autonomy
related: Reproductive justice

Transgender health care bans
type: Concept
issued: 2024-07-31
modified: 2026-02-26
comment: Laws or policies instituted to prevent trans and non-binary individuals from seeking medical treatment or gender-affirming care, including but not limited to surgery, hormone treatment, and mental health care.
broader: Anti-transgender legislation
change note: Version 4.2.0
has top concept: Law
in scheme: v3
related: Gender-affirming surgery
related: Health care for LGBTQ+ people
related: Detrans people
related: Barriers to gender-affirming care

Two-Spirit students
type: Concept
issued: 2024-09-19
modified: 2025-02-23
comment: Two-Spirit people who are formally engaged in learning at an educational institution of some kind.
alternative label: 2S students
alternative label: Two Spirited students
alternative label: Two-Spirited students
alternative label: Two Spirit students
broader: Two-Spirit people
change note: Version 4.2.0
has top concept: Gender
in scheme: v3
narrower: Two-Spirit high school students
narrower: Two-Spirit middle school students
narrower: Two-Spirit elementary school students
related: LGBTQ+ students

LGBTQ+ elementary school students
type: Concept
issued: 2024-10-22
modified: 2025-02-23
comment: LGBTQ+ people who attend elementary school, generally consisting of grades k through 5 with students between the ages of 4 and 10.
alternative label: Elementary school students (LGBTQ)
alternative label: LGBTQ+ primary school students
alternative label: Primary school students (LGBTQ)
broader: LGBTQ+ students
change note: Version 4.2.0
has top concept: LGBTQ+ people
in scheme: v3
narrower: Transgender elementary school students
narrower: Intersex elementary school students
narrower: Non-binary elementary school students
related: Two-Spirit elementary school students

LGBTQ+ music
type: Concept
issued: 2024-10-22
modified: 2025-02-23
comment: Music created by LGBTQ+ artists, for LGBTQ+ audiences, and/or that expresses an LGBTQ+ sensibility.
alternative label: Music (LGBTQ)
broader: LGBTQ+ arts
change note: Version 4.2.0
has top concept: Subcultures
in scheme: v3
narrower: LGBTQ+ country music
narrower: LGBTQ+ rap music
narrower: LGBTQ+ pop music
related: LGBTQ+ musicians

Gender-affirming care
type: Concept
issued: 2024-10-22
modified: 2026-02-23
comment: Social, psychological, behavioral, and medical interventions designed to support and affirm an individual's gender identity. Gender-affirming care includes but is not limited to equal access to health care facilities, counseling, puberty blockers, hormone therapy, and gender-affirming surgeries. It can also include resources to aid in social transition, such as affirming policies regarding name and pronoun changes, access to non-gendered restrooms and facilities, etc.
alternative label: Gender affirming care
broader: Health care for LGBTQ+ people
change note: Version 4.2.0
has top concept: Health care for LGBTQ+ people
in scheme: v3
narrower: Gender-affirming surgery
narrower: Intersex-affirming care
narrower: Transgender-affirming care
related: Barriers to gender-affirming care

Human trafficking
type: Concept
issued: 2024-10-30
modified: 2025-02-23
comment: The trade and exploitation of human beings through force, fraud, and/or coercion, often with the intention of compelling the individual to provide sexual services or other forms of labor against their will.
alternative label: People trafficking
change note: Version 4.2.0
in scheme: v3
narrower: Sex trafficking
narrower: Labor trafficking

LGBTQ+ victims of human trafficking
type: Concept
issued: 2024-10-30
modified: 2025-02-23
comment: LGBTQ+ people who have experienced and may or may not have survived human trafficking. Follow the individual's preference for "victims" or "survivors" whenever possible.
alternative label: Victims of human trafficking (LGBTQ)
alternative label: LGBTQ+ trafficking victims
alternative label: Trafficking victims (LGBTQ)
broader: LGBTQ+ victims of crime
change note: Version 4.2.0
has top concept: LGBTQ+ people
in scheme: v3
narrower: LGBTQ+ survivors of human trafficking
narrower: LGBTQ+ victims of sex trafficking
narrower: LGBTQ+ victims of labor trafficking
related: Two-Spirit victims of human trafficking

Two-Spirit victims of human trafficking
type: Concept
issued: 2024-10-30
modified: 2025-02-23
comment: Two-Spirit people who have experienced and may or may not have survived human trafficking. Follow the individual's preference for "victims" or "survivors" whenever possible.
alternative label: Two Spirit victims of human trafficking
alternative label: Two-Spirited victims of human trafficking
alternative label: Two Spirited victims of human trafficking
alternative label: 2S victims of human trafficking
alternative label: Two-Spirit human trafficking victims
broader: Two-Spirit victims of crime
change note: Version 4.2.0
has top concept: Gender
in scheme: v3
narrower: Two-Spirit survivors of human trafficking
narrower: Two-Spirit victims of sex trafficking
narrower: Two-Spirit victims of labor trafficking
related: LGBTQ+ victims of human trafficking

Sex work legislation
type: Concept
issued: 2024-10-30
modified: 2025-02-23
comment: Laws and regulations addressing the practice, solitiation, and/or facilitation of sex work, including its legality. Legislation may variously address the actions of sex workers, their clients, third parties, and/or other individuals who work in proximity to or seek to aid sex workers.
alternative label: Sex work laws
alternative label: Prostitution legislation
alternative label: Prostitution laws
broader: Law
change note: Version 4.2.0
has top concept: Law
in scheme: v3
narrower: Legalization of sex work
narrower: Nordic model (Sex work)
related: Criminalization of sex work
related: Decriminalization of sex work

Anti-sex worker violence
type: Concept
issued: 2024-10-30
modified: 2025-02-23
comment: Behavior involving physical force intended to harm or kill sex workers on the basis of their work or identity as a sex worker.
alternative label: Violence against sex workers
alternative label: Anti sex worker violence
alternative label: Anti-prostitute violence
alternative label: Anti prostitute violence
alternative label: Violence against prostitutes
change note: Version 4.2.0
in scheme: v3
narrower: Murder of sex workers
related: Hate crimes
related: Anti-sex worker discrimination

Neurogender
type: Concept
issued: 2024-12-12
modified: 2026-02-23
comment: Term used to describe the identity of neurodivergent people whose neurodivergence(s) greatly affect and cannot be unlinked from their gender. Only use to describe neurodivergent people who describe themselves as neurogender.
broader: Gender
change note: Version 4.2.0
has top concept: Gender
in scheme: v3
narrower: Autigender
narrower: Neurotrans
related: LGBTQ+ neurodivergent people
related: Neuroqueer

Sensory deprivation (Erotic)
type: Concept
issued: 2025-01-09
modified: 2025-02-23
comment: Stifling of one or more physical senses with the use of blindfolds, ear plugs, hoods, or bondage for erotic or sensual pleasure.
alternative label: Sensory isolation (Erotic)
alternative label: Stimulus deprivation (Erotic)
broader: BDSM
change note: Version 4.2.0
has top concept: Eroticism
in scheme: v3
related: Body bags (Erotic)
related: Blindfolds
related: Hoods (Erotic)
related: Mummification (Erotic)

Dehumanization (Erotic)
type: Concept
issued: 2025-01-09
modified: 2025-03-20
comment: Acts or practices in which one person behaves or is treated as an object (e.g., a table) for erotic enjoyment, sometimes as a form of humiliation.
broader: BDSM
change note: Version 4.2.0
has top concept: Eroticism
in scheme: v3
related: Power exchange
related: Animal roleplay
related: Dollification
related: Erotic hypnosis

Two-Spirit people with addictions
type: Concept
issued: 2025-04-24
modified: 2025-04-24
comment: Umbrella term for Two-Spirit people experiencing addictions, dependencies, or use disorders of some kind. Only use to refer to individuals who describe themselves as having addictions. Apply more specific terms if possible.
alternative label: Two-Spirit addicts
alternative label: Two Spirit people with addictions
alternative label: Two-Spirited people with addictions
alternative label: Two Spirited people with addictions
alternative label: 2S people with addictions
broader: Two-Spirit people
broader: Two-Spirit people who use substances
change note: Version 4.2.0
has top concept: Gender
in scheme: v4
narrower: Two-Spirit people with alcohol use disorders
narrower: Two-Spirit people with substance use disorders
related: LGBTQ+ people with addictions

Social work with LGBTQ+ youth
type: Concept
issued: 2025-04-29
modified: 2025-04-29
comment: Work carried out between trained professionals and LGBTQ+ youth, involving providing affirming, supportive, and culturally competent services to address their unique needs and experiences. This includes supporting their emotional, mental, and physical well-being, as well as advocating for their rights and needs within various systems, including schools, families, and communities.
alternative label: LGBTQ+ youth social work
alternative label: Social work for LGBTQ+ youth
change note: Version 4.2.0
in scheme: v4
preferred label: eng
related: LGBTQ+ youth
related: LGBTQ+ youth centers
related: LGBTQ+ youth survivors of bullying
related: LGBTQ+ youth victims of bullying

Metadata for LGBTQ+ resources
type: Concept
issued: 2026-02-23
modified: 2026-02-23
comment: Works dealing with best practices and issues around cataloging and other descriptive metadata for resources by and/or about LGBTQ+ people, issues, or cultures, in repositories such as libraries, archives, and museums.
alternative label: LGBTQ+ metadata
change note: Version 4.2.0
in scheme: v4
related: LGBTQ+ libraries
related: LGBTQ+ archives
related: LGBTQ+ special collections
related: LGBTQ+ museums

Libraries and LGBTQ+ people
type: Concept
issued: 2026-02-23
modified: 2026-02-26
comment: The relationship between libraries and LGBTQ+ people. Includes discussions of the treatment of LGBTQ+ people by library organizations, the inclusion and representation of LGBTQ+ people in libraries, and LGBTQ+ people's experiences in libraries (as patrons, employees, volunteers, etc.).
alternative label: Libraries and LGBTQ people
change note: Version 4.2.0
in scheme: v4
related: LGBTQ+ libraries
related: LGBTQ+ librarians
related: LGBTQ+ discrimination
related: Inclusivity

Neurotrans
type: Concept
issued: 2026-02-23
modified: 2026-02-23
comment: Term used to describe individuals who are both neurodivergent and trans or for those whose neurodivergence greatly affects and cannot be unlinked from their experiences or identity as trans people. Only use to describe neurodivergent people who describe themselves as neurotrans.
broader: Neurogender
change note: Version 4.2.0
has top concept: Gender
in scheme: v4
related: Transgender neurodivergent people
related: Transgender autistic people
related: Autigender
related: Neuroqueer

Neuroqueer
type: Concept
issued: 2026-02-23
modified: 2026-02-23
comment: Term used to describe individuals who are both neurodivergent and queer or for those whose neurodivergence greatly affects and cannot be unlinked from their experiences or identity as queer people. Can also refer to the practice of queering neuronormativity and heteronormativity. Note that the usage of the word queer in this term refers more to one's social identity and behavior rather than one's gender or sexual orientation. Only use to describe neurodivergent people who describe themselves as neuroqueer.
broader: LGBTQ+ neurodivergent people
change note: Version 4.2.0
has top concept: LGBTQ+ people
in scheme: v4
related: Neurotrans
related: Neurogender
related: Queer neurodivergent people
related: Queer autistic people

Homophile movement
type: Concept
issued: 2026-02-24
modified: 2026-02-24
comment: A collective term used to describe the philosophy and activities of many North American and European gay and lesbian publications and organizations of the 1950s and 1960s. The term "homophile," which was coined in 1924, emphasized the romantic rather than sexual aspect of same-gender relationships. The earliest organization in the Homophile Movement was the COC Netherlands, founded in 1946. Other examples include the RFSL (Sweden), Campaign for Homosexual Equality (UK), the Mattachine Society (US), ONE (US), and the Daughters of Bilitis (US).
broader: LGBTQ+ movement
change note: Version 4.2.0
has top concept: Social movements
in scheme: v4
related: Homophiles
related: Gay press
related: Lesbian press
related: Gay liberation

AIDS organizations
type: Concept
issued: 2019-05-14
modified: 2025-02-23
replaces: AIDSOrganisations
comment: Community-based groups or institutions that provide support and advocacy for people affected by HIV/AIDS.
comment: Grupos o instituciones comunitarias que brindan apoyo y defensa a las personas afectadas por el VIH/SIDA.
change note: Version 4.2.0
in scheme: v3
preferred label: Organizaciones contra SIDA
preferred label: AIDS organisations
related: HIV/AIDS
related: AIDS activists
related: AIDS periodicals
related: Health care for LGBTQ+ people
related: LGBTQ+ clubs and organizations

Allies
type: Concept
issued: 2019-05-14
modified: 2025-02-23
replaces: allies
comment: Individuals of a privileged social identity who support, stand in solidarity with, and work to advance the interests of marginalized groups they do not belong to.
comment: Personas de una identidad social privilegiada que apoyan, se solidarizan con y trabajan para promover los intereses de grupos marginados a los que no pertenecen.
broader: Heterosexuals
change note: Version 4.2.0
has top concept: Heterosexuals
in scheme: v3
preferred label: Aliados
related: LGBTQ+ activism
related: Gay-straight alliances
related: LGBTQ+ friendliness
related: LGBTQ+ solidarity
related: LGBTQ+ safe spaces

Insemination
type: Concept
issued: 2019-05-14
modified: 2025-02-23
replaces: insemination
comment: The act of using sperm to induce pregnancy by natural or artificial means, especially in the context of LGBTQ+ family planning with sperm donors.
comment: El acto de utilizar esperma para inducir el embarazo por medios naturales o artificiales, especialmente en el contexto de la planificación familiar LGBTQ+ con donantes de esperma.
alternative label: Fertilisation
alternative label: Fertilization
alternative label: Fertilización
broader: Conception by LGBTQ+ people
change note: Version 4.2.0
has top concept: LGBTQ+ family planning
in scheme: v3
narrower: Self-insemination
narrower: Artificial insemination
narrower: Donor insemination
preferred label: Inseminación
related: Sperm donors
related: Assisted reproduction

Ass fucking
type: Concept
issued: 2019-05-14
modified: 2025-02-23
replaces: assFucking
comment: The sexual act of penetrating an individual's anus with a penis or dildo.
comment: Acto sexual que consiste en penetrar el ano de una persona con un pene o un consolador.
alternative label: Butt fucking
alternative label: Coger por el culo
alternative label: Coger por culo
preferred label: Dar por culo
alternative label: Tomar por culo
alternative label: Culear
broader: Anal sex
broader: Fucking
change note: Version 4.2.0
has top concept: Sex (Act)
in scheme: v3
narrower: Barebacking
related: Enemas
related: Sex swings
related: Douching

Dark rooms
type: Concept
issued: 2019-05-14
modified: 2025-02-23
replaces: darkRooms
comment: Rooms in nightclubs, sex clubs, or bathhouses where patrons can discretely engage in sexual activity. Dark rooms were common features in gay bars and clubs in the 1960-80s and remain common among swingers today.
comment: Habitaciones en clubes nocturnos, clubes sexuales o baños públicos donde los clientes pueden participar discretamente en actividades sexuales. Los cuartos oscuros figuraban con frecuencia en los bares y clubes gay entre las décadas de 1960 y 1980, y siguen siendo comunes entre los swingers en la actualidad.
alternative label: Backrooms
broader: Sex locations
change note: Version 4.2.0
has top concept: Sex locations
in scheme: v3
preferred label: Cuartos oscuros
related: Gay bars
related: Sex clubs
related: Sex parties
related: Leather bars
related: Play spaces

Bi+ people
type: Concept
issued: 2019-05-14
modified: 2025-02-23
replaces: bi+People
comment: Individuals who are not exclusively sexually and/or romantically attracted to individuals of a single biological sex (includes bisexual, queer, pansexual, and fluid identities).
comment: Personas que no sienten una atracción sexual y/o romántica exclusiva por personas de un único sexo biológico (incluye las identidades bisexuales, queer, pansexuales y fluidas).
broader: LGBTQ+ people
change note: Version 4.2.0
has top concept: LGBTQ+ people
in scheme: v3
narrower: Bisexual people
narrower: Pansexual people
narrower: Queer people
narrower: Polysexual people
preferred label: Personas bi+
related: Sexual minorities

Essentialism
type: Concept
issued: 2019-05-14
modified: 2025-02-23
replaces: essentialism
comment: The practice of defining certain categories through a set of supposed universal or fixed characteristics or traits (e.g., defining women in terms of "female" genitalia).
comment: La práctica de definir ciertas categorías a través de un conjunto de características o rasgos supuestamente universales o fijos (por ejemplo, definir a las mujeres en términos de genitales "femeninos").
alternative label: Biological essentialism
alternative label: Esencialismo biológico
broader: Theories
change note: Version 4.2.0
has top concept: Theories
in scheme: v3
narrower: Trans-exclusionary radical feminism
preferred label: Esencialismo
related: Queer theory
related: Sexual identity
related: Social constructionism
related: Patriarchy

Biphobia
type: Concept
issued: 2019-05-14
modified: 2025-02-23
replaces: biphobia
comment: Antagonism or disgust directed toward bisexuality as an identity or bisexual people due to their sexuality. Biphobia can include denial of the existence of bisexuality, stereotypes, verbal harassment, and physical violence.
comment: Antagonismo o repugnancia dirigida hacia la bisexualidad como identidad o hacia las personas bisexuales por su sexualidad. La bifobia puede incluir la negación de la existencia de la bisexualidad, los estereotipos, el acoso verbal y la violencia física.
broader: LGBTQ+ phobia
change note: Version 4.2.0
has top concept: LGBTQ+ phobia
in scheme: v3
narrower: Internalized biphobia
preferred label: Bifobia
related: Anti-bisexual discrimination
related: Anti-bisexual violence
related: Bisexual people
related: Heterosexism

Black bisexual people
type: Concept
issued: 2019-05-14
modified: 2025-02-23
replaces: bisexualBlackPeople
comment: Black people who are bisexual. Use only for individuals who self-identity as Black. Follow the individual’s preference for African American or Black whenever possible.
comment: Personas negras que son bisexuales. Utilícese únicamente para personas que se autoidentifiquen como negras. Siga la preferencia de la persona sobre el uso de "afroamericanos" o "negros" siempre que sea posible.
alternative label: Bisexual Black people
alternative label: Personas negras bisexuales
broader: Black LGBTQ+ people
change note: Version 4.2.0
has top concept: LGBTQ+ people
in scheme: v3
narrower: African American bisexual people
narrower: Afro-Canadian bisexual people
narrower: Afro-Caribbean bisexual people
narrower: Afro-European bisexual people
narrower: Afro-Latin American bisexual people
preferred label: Personas bisexuales negras

Bisexual children
type: Concept
issued: 2019-05-14
modified: 2025-02-23
replaces: bisexualChildren
comment: Bisexual people who have not yet reached the age of adolescence.
comment: Niños menores de 18 años que se autoidentifican como bisexuales.
alternative label: Niñas bisexuales
alternative label: Niñxs bisexuales
broader: Bisexual people
broader: LGBTQ+ children
change note: Version 4.2.0
has top concept: LGBTQ+ people
in scheme: v3
narrower: Bisexual boys
narrower: Bisexual girls
preferred label: Niños bisexuales
related: Bisexual characters
related: Bisexual identity

Bisexual clergy
type: Concept
issued: 2019-05-14
modified: 2025-02-23
replaces: bisexualClergy
comment: Bisexual people who are ordained for religious duties, particularly in the Christian Church.
comment: Personas bisexuales que son ordenadas para deberes religiosos, particularmente en la Iglesia cristiana.
broader: LGBTQ+ clergy
change note: Version 4.2.0
has top concept: LGBTQ+ clergy
in scheme: v3
preferred label: Clero bisexual
related: Celibacy
related: Gay clergy
related: Lesbian clergy
related: Queer clergy
related: Transgender clergy

Bisexual relationships
type: Concept
issued: 2019-05-14
modified: 2025-02-23
replaces: bisexualRelationships
comment: Ongoing connections (romantic, sexual, or platonic) between two or more bisexual people.
comment: Empresas y organizaciones que publican materiales para comunidades bisexuales o que abordan asuntos bisexuales.
broader: Relationship satisfaction
change note: Version 4.2.0
has top concept: Relationship satisfaction
in scheme: v3
preferred label: Editoriales bisexuales
related: Bisexual couples
related: Gay relationships
related: Lesbian relationships
related: Queer relationships
related: Transgender relationships

Bisexual studies
type: Concept
issued: 2019-05-14
modified: 2026-02-24
replaces: bisexualStudies
comment: Academic field of research and study about bisexual people, bisexual identity, and bisexual communities.
comment: Lenguaje coloquial o informal relacionado con la bisexualidad o utilizado por personas bisexuales.
alternative label: Argot bisexual
alternative label: Habla bisexual
alternative label: Modismos bisexuales
broader: Gender studies
broader: LGBTQ+ studies
change note: Version 4.2.0
has top concept: Gender studies
in scheme: v3
preferred label: Jerga bisexual
related: Gay studies
related: Lesbian studies
related: Queer studies
related: Transgender studies

Fellatio
type: Concept
issued: 2019-05-14
modified: 2025-02-23
replaces: fellatio
comment: A sexual act involving the use of the mouth and tongue to stimulate another person's external genitalia (typically the penis or clitoris).
comment: Un acto sexual que implica el uso de la boca y la lengua para estimular los genitales externos de otra persona (normalmente el pene o el clítoris).
alternative label: Blow jobs
alternative label: Cocksucking
alternative label: Penilingus
alternative label: Mamar
alternative label: Coito per os
alternative label: Chupar
broader: Oral sex
broader: Phallic sex
broader: Sex (Act)
broader: Sexual practices
change note: Version 4.2.0
has top concept: Sex (Act)
in scheme: v3
preferred label: Felación
related: Penis
related: 69ing

Censorship
type: Concept
issued: 2019-05-14
modified: 2025-02-23
replaces: censorship
comment: Suppression of speech, public communication, images, ideas, or other information by institutions, authorities, or other controlling bodies, typically because the material has been deemed objectionable, harmful, or sensitive.
comment: Supresión de expresiones, comunicaciones públicas, imágenes, ideas u otra información por parte de instituciones, autoridades u otros organismos de control, generalmente porque el material se ha considerado objetable, dañino o sensible.
change note: Version 4.2.0
in scheme: v3
narrower: LGBTQ+ censorship
preferred label: Censura

Children of queer people
type: Concept
issued: 2019-05-14
modified: 2025-02-23
replaces: childrenOfQueerPeople
comment: Children who have one or more queer parent.
comment: Hijos o hijas que tienen uno o más madres o padres queer.
alternative label: Hijas de personas queer
broader: Children of LGBTQ+ people
change note: Version 4.2.0
has top concept: Family members
in scheme: v3
narrower: Sons of queer people
preferred label: Hijos de personas queer
related: Queer families
related: Queer parents
related: Queerspawn
related: Culturally queer

LGBTQ+ victims of crime
type: Concept
issued: 2019-05-14
modified: 2025-02-23
replaces: LGBTQVictimsOfCrime
comment: LGBTQ+ people who have experienced crimes and may or may not have survived; follow the individual's preference for “victims” or “survivors” whenever possible.
comment: Personas LGBTQ+ que han sufrido crímenes y pueden o no haber sobrevivido; siga la preferencia de la persona sobre el uso de "víctimas" o "sobrevivientes" siempre que sea posible.
alternative label: Crime victims (LGBTQ)
alternative label: LGBTQ victims of crime
broader: LGBTQ+ people
change note: Version 4.2.0
has top concept: LGBTQ+ people
in scheme: v3
narrower: LGBTQ+ victims of hate crimes
narrower: LGBTQ+ victims of rape
narrower: LGBTQ+ victims of sexual abuse
narrower: LGBTQ+ victims of human trafficking
preferred label: Víctimas LGBTQ+ de crimen
related: LGBTQ+ victims' rights

Criminalization
type: Concept
issued: 2019-05-14
modified: 2025-02-23
replaces: criminalisation
comment: The process by which behaviors and individuals are framed as and come to be known as criminal.
comment: El proceso mediante el cual conductas y personas son concebidas y llegan a ser conocidas como delictivas.
broader: Criminal law
change note: Version 4.2.0
has top concept: Law
in scheme: v3
narrower: LGBTQ+ criminalization
narrower: Criminalization of gender non-conformity
narrower: Criminalization of sex work
preferred label: Criminalización
preferred label: Criminalisation
related: Decriminalization
related: Bathroom bans
related: Anti-transgender legislation

Demigender people
type: Concept
issued: 2019-05-14
modified: 2025-02-23
replaces: demigenderPeople
comment: People who have a partial connection to a certain gender or concept of gender.
comment: Personas que tienen una conexión parcial con un determinado género o concepto de género.
broader: Transgender people
broader: Gender minorities
change note: Version 4.2.0
has top concept: LGBTQ+ people
in scheme: v3
narrower: Demigirls
narrower: Demiboys
preferred label: Personas demigénero
related: Gender identity
related: Demigender identity

Denial of sexual orientation
type: Concept
issued: 2019-05-14
modified: 2025-02-23
replaces: denialOfSexualOrientation
comment: Refusal to acknowledge or affirm one's own sexual identity, or the sexual identity of another individual.
comment: Negarse a reconocer o afirmar la identidad sexual propia o la identidad sexual de otra persona.
change note: Version 4.2.0
in scheme: v3
preferred label: Negación de la orientación sexual
related: Internalized homophobia
related: Latent homosexuality
related: LGBTQ+ self-repression
related: Sexual orientation
related: Internalized oppression

Dildo harnesses
type: Concept
issued: 2019-05-14
modified: 2025-02-23
replaces: dildoHarnesses
comment: Devices worn to attach a dildo to a person's body, typically so they can penetrate a partner's vagina or anus.
comment: Dispositivos que se utilizan para sujetar un consolador al cuerpo de una persona, generalmente para que pueda penetrar la vagina o el ano de una pareja.
alternative label: Strap-ons
broader: Harnesses
broader: Sex accessories
change note: Version 4.2.0
has top concept: Sex accessories
in scheme: v3
preferred label: Arneses para consoladores
related: Dildos
related: Packing (Phallus)
related: Strap-on sex
related: Thigh harnesses

Drag bars
type: Concept
issued: 2019-05-14
modified: 2025-02-23
replaces: dragBars
comment: Establishments (typically serving alcohol) that host drag shows or other events featuring drag performers.
comment: Establecimientos (que usualmente sirven alcohol) que presentan espectáculos de drag u otros eventos con artistas drag.
broader: LGBTQ+ bars
change note: Version 4.2.0
has top concept: LGBTQ+ meeting places
in scheme: v3
preferred label: Bares drag
related: Drag
related: Drag community
related: LGBTQ+ pubs
related: Drag shows
related: Drag pageants

Dutch boys
type: Concept
issued: 2019-05-14
modified: 2025-02-23
replaces: dutchBoys
comment: Slang for heterosexual men who are friends with lesbians and socialize in lesbian spaces.
alternative label: Lesbros
broader: Heterosexual men
change note: Version 4.2.0
has top concept: Heterosexuals
in scheme: v3
related: Fag hags
related: Friendships
related: Goldilocks (Gay culture)
related: Social privilege
related: Beards (Gay culture)

Dykes
type: Concept
issued: 2019-05-14
modified: 2025-02-23
replaces: dykes
comment: A largely reclaimed slur common in the U.S. that may be used to refer to lesbians who embrace a masculine style of presentation or lesbian political activists in general. Only use for individuals who self-identify as dykes.
comment: Un insulto ampliamente reclamado y común en los EE. UU. que puede utilizarse para referirse a lesbianas que adoptan un estilo de presentación masculino o a activistas políticas lesbianas en general. Utilícese únicamente para personas que se autoidentifiquen como dykes.
broader: Reclaimed terms
broader: Slurs
change note: Version 4.2.0
has top concept: LGBTQ+ slang
in scheme: v3
preferred label: Bolleras
related: Butches
related: Femmes
related: Lesbians
related: Dyke bars

Erotic massage
type: Concept
issued: 2019-05-14
modified: 2025-02-23
replaces: eroticMassage
comment: Massage intended to enhance sexual arousal.
comment: Masaje destinado a potenciar la excitación sexual.
broader: Massage
broader: Sex (Act)
broader: Sexual practices
change note: Version 4.2.0
has top concept: Massage
in scheme: v3
preferred label: Masaje erótico
related: Happy endings
related: Manual sex
related: Erotic massage businesses

Fag hags
type: Concept
issued: 2019-05-14
modified: 2025-02-23
replaces: fagHags
comment: Slang for heterosexual women who are friends with gay men and socialize in gay spaces.
comment: Jerga para mujeres heterosexuales que son amigas de hombres gay y socializan en espacios gay.
alternative label: Mariliendra (Spain)
alternative label: Mosca de la fruta
broader: Heterosexual women
change note: Version 4.2.0
has top concept: Heterosexuals
in scheme: v3
preferred label: Mariliendre (Spain)
related: Dutch boys
related: Friendships
related: Goldilocks (Gay culture)
related: Social privilege
related: Beards (Gay culture)

Fathers
type: Concept
issued: 2019-05-14
modified: 2025-02-23
replaces: fathers
comment: People who are fathers.
comment: Personas que son padres.
alternative label: Papás
broader: Family members
change note: Version 4.2.0
has top concept: Family members
in scheme: v3
narrower: LGBTQ+ fathers
narrower: Fathers of LGBTQ+ people
narrower: Two-Spirit fathers
preferred label: Padres
related: LGBTQ+ fatherhood
related: Fatherhood

Gay bars
type: Concept
issued: 2019-05-14
modified: 2025-02-23
replaces: gayBars
comment: Drinking establishments that primarily cater to gay men.
comment: Establecimientos de bebidas que atienden principalmente a hombres gay.
broader: LGBTQ+ bars
change note: Version 4.2.0
has top concept: LGBTQ+ meeting places
in scheme: v3
narrower: Bear bars
preferred label: Bares gay
related: Dark rooms
related: Gay community
related: LGBTQ+ pubs
related: Leather bars

Gay boys
type: Concept
issued: 2019-05-14
modified: 2025-02-23
replaces: gayBoys
comment: Boys (typically children younger than 18) who are gay.
comment: Niños (normalmente menores de 18 años) que son gay.
broader: Boys
broader: Gay and lesbian youth
change note: Version 4.2.0
has top concept: Family members
in scheme: v3
preferred label: Niños gay
related: Gay characters
related: Gay identity
related: Gay men
related: Gay children

Gay studies
type: Concept
issued: 2019-05-14
modified: 2026-02-24
replaces: gayStudies
comment: Academic field of research and study about gay men, gay identity, and gay communities.
comment: Campo académico de investigación y estudio sobre los hombres gay, la identidad gay y las comunidades gay.
broader: Gender studies
broader: LGBTQ+ studies
change note: Version 4.2.0
has top concept: Gender studies
in scheme: v3
preferred label: Estudios gay
related: Bisexual studies
related: Lesbian studies
related: Queer studies
related: Transgender studies

Gay and lesbian youth
type: Concept
is replaced by: homoit0000544
issued: 2019-05-14
modified: 2022-06-27
modified: 2025-02-23
replaces: gayAndLesbianYouth
replaces: gayYouth
comment: Younger gay men and lesbians, typically between the ages of childhood and adulthood or adolescence
comment: Gay people between the ages of childhood and adulthood.
comment: Hombres gay entre las edades de la niñez y la edad adulta.
alternative label: Lesbian and gay youth
alternative label: Gay teenagers
alternative label: Gay adolescents
alternative label: Gay teens
alternative label: Adolescentes gay
alternative label: Jóvenes gay
broader: Queer youth
broader: LGBTQ+ youth
change note: Version 4.2.0
has top concept: LGBTQ+ people
has top concept: Youth
in scheme: v3
narrower: Gay boys
narrower: Lesbian girls
narrower: Pups (Roleplay)
narrower: Twinks (Gay culture)
preferred label: Gay youth
preferred label: Juventud gay
related: Gay characters
related: Gay identity
related: Gay men
related: Gay youth literature

Genderism
type: Concept
issued: 2019-05-14
modified: 2025-02-23
replaces: genderism
comment: The systematic belief that there are only two genders (men and women) and that individuals must conform to the gender they were assigned at or shortly after birth.
comment: La creencia sistemática de que solo existen dos géneros (hombres y mujeres) y que las personas deben adaptarse al género que les fue asignado al nacer o poco después.
alternative label: Gender discrimination
alternative label: Discriminación de género
broader: LGBTQ+ phobia
change note: Version 4.2.0
has top concept: LGBTQ+ phobia
in scheme: v3
narrower: Trans-exclusionary radical feminism
preferred label: Generismo
related: Gender
related: Gender identity
related: Sexism
related: Patriarchy

Urine play
type: Concept
issued: 2019-05-14
modified: 2025-02-23
replaces: waterSports
comment: Use of urine and urination for sexual or erotic pleasure.
comment: Uso de la orina y la micción para placer sexual o erótico.
alternative label: Golden showers
alternative label: Pissing sex
alternative label: Undinism
alternative label: Urolagnia
alternative label: Clothes wetting
alternative label: Omorashi
alternative label: Piss play
alternative label: Urophilia
alternative label: Water sports
alternative label: Watersports
alternative label: Juego con orina
broader: BDSM
broader: Sex (Act)
broader: Sexual practices
change note: Version 4.2.0
has top concept: Eroticism
in scheme: v3
preferred label: Juego de orina
related: Scat play
related: Body fluids
related: Diapers (Erotic)

Handkerchief codes
type: Concept
issued: 2019-05-14
modified: 2025-02-23
replaces: handkerchiefCodes
comment: A color-coded system to indicate preferred sexual fetishes and identify whether a person is a top/dominant or bottom/submissive.
comment: Un sistema codificado por colores para indicar fetiches sexuales preferidos e identificar si una persona es activa/dominante o pasiva/sumisa.
alternative label: Hanky codes
alternative label: Hanky code
broader: LGBTQ+ symbols
change note: Version 4.2.0
has top concept: LGBTQ+ symbols
in scheme: v3
preferred label: Códigos de pañuelos
related: BDSM
related: Sex (Act)
related: Sexual practices
related: Sexual roles
related: Queer coding

Heteronormativity
type: Concept
issued: 2019-05-14
modified: 2025-04-23
replaces: heteronormativity
comment: The notion or belief that heterosexuality is the normal or preferred sexual orientation.
comment: La noción o creencia de que la heterosexualidad es la orientación sexual normal o preferida.
alternative label: Heterosexual norms
alternative label: Normas heteronormativas
broader: Social norms
change note: Version 4.2.0
has top concept: Social norms
in scheme: v3
preferred label: Heteronormatividad
related: Normalization
related: Heterosexism
related: Homonormativity
related: Bicuriosity
related: Compulsory heterosexuality

Heterosexual youth
type: Concept
issued: 2019-05-14
modified: 2025-02-23
replaces: heterosexualYouth
comment: Heterosexual people between the ages of childhood and adulthood.
comment: Personas heterosexuales entre las edades de la infancia y la edad adulta.
alternative label: Straight youth
alternative label: Heterosexual adolescents
alternative label: Heterosexual teenagers
alternative label: Heterosexual teens
alternative label: Straight adolescents
alternative label: Straight teenagers
alternative label: Straight teens
alternative label: Adolescentes heterosexuales
alternative label: Jóvenes heterosexuales
alternative label: Juventud hétero
alternative label: Adolescentes hétero
broader: Heterosexuals
broader: Youth
change note: Version 4.2.0
has top concept: Heterosexuals
in scheme: v3
narrower: Heterosexual boys
narrower: Heterosexual girls
narrower: Heterosexual children
preferred label: Juventud heterosexual
related: LGBTQ+ youth

Heterosexuality
type: Concept
issued: 2019-05-14
modified: 2025-02-23
replaces: heterosexuality
comment: Romantic and sexual attraction to members of the opposite sex or gender, typically in a culture that understands sex and gender through the binary opposition of male/female or man/woman.
comment: Atracción romántica y sexual hacia miembros del sexo o género opuesto, típicamente en una cultura que entiende el sexo y el género a través de la oposición binaria de masculino/femenino u hombre/mujer.
broader: Sexual orientation
broader: Monosexuality
change note: Version 4.2.0
has top concept: Sexual orientation
in scheme: v3
preferred label: Heterosexualidad
related: Heterosexism
related: Heterosexuals
related: Homosexuality
related: Bicuriosity

HIV-negative people
type: Concept
issued: 2019-05-14
modified: 2025-02-23
replaces: HIV-negativePeople
comment: Individuals who have not contracted HIV.
comment: Personas que no han contraído el VIH.
alternative label: HIV-seronegative people
alternative label: Personas seronegativas
change note: Version 4.2.0
in scheme: v3
preferred label: Personas negativas al VIH
related: HIV/AIDS
related: HIV-positive people
related: Serodiscordant couples
related: Serostatus
related: HIV-undetectable people

Hypersexuality
type: Concept
issued: 2019-05-14
modified: 2025-02-23
replaces: hypersexuality
comment: Term used to describe a level or frequency of sexual desire that is perceived as excessive within a given culture. Though the medical community has not reached a consensus as to whether hypersexuality should be included as a clinical diagnosis, doctors and psychologists have historically diagnosed LGBTQ+ people with hypersexuality (or other related labels) in order to wrongly treat their identities and desires as medical disorders. Should only be used in a historical context or if an individual self-identifies with the term.
comment: Término utilizado para describir un nivel o una frecuencia de deseo sexual que se percibe como excesiva dentro de una cultura determinada. Aunque la comunidad médica no ha llegado a un consenso sobre si la hipersexualidad debe incluirse como diagnóstico clínico, históricamente los médicos y psicólogos han diagnosticado a personas LGBTQ+ con hipersexualidad (u otras etiquetas relacionadas) para tratar erróneamente sus identidades y deseos como trastornos médicos. Utilícese únicamente en un contexto histórico o si una persona se identifica con el término.
alternative label: Nymphomania
alternative label: Satyriasis
alternative label: Andromania
alternative label: Clitoromania
alternative label: Don Juan syndrome
alternative label: Don Juanism
alternative label: Estromania
alternative label: Excessive sex drive
alternative label: Furor amatorius
alternative label: Furor uterinus
alternative label: Hyper-sexuality
alternative label: Hyperactive sexual desire disorder
alternative label: Hyperaesthesia
alternative label: Hypereroticism
alternative label: Hyperlibido
alternative label: Hyperphilia
alternative label: Hypersensuality
alternative label: Hypersexual disorder
alternative label: Messalina syndrome
alternative label: Œstromania
alternative label: Oversexuality
alternative label: Satyrism
alternative label: Satyromania
alternative label: Sexual hyperesthesia
alternative label: Sexual hyperversion
change note: Version 4.2.0
in scheme: v3
narrower: Sexual excitement
preferred label: Hipersexualidad
related: LGBTQ+ people with sexual addictions
related: Sexuality
related: Erotomania

Lesbian clergy
type: Concept
issued: 2019-05-14
modified: 2025-02-23
replaces: lesbianClergy
comment: Lesbians who are ordained for religious duties, particularly in the Christian Church.
comment: Lesbianas que son ordenadas para deberes religiosos, particularmente en la Iglesia cristiana.
alternative label: Lesbian pastors
alternative label: Pastoras lesbianas
broader: LGBTQ+ clergy
change note: Version 4.2.0
has top concept: LGBTQ+ clergy
in scheme: v3
preferred label: Clero lésbico
related: Bisexual clergy
related: Celibacy
related: Gay clergy
related: Queer clergy
related: Transgender clergy

Lesbian separatism
type: Concept
issued: 2019-05-14
modified: 2025-02-23
replaces: lesbianSeparatism
comment: Ideological, social, cultural, and physical separation between men and women or between lesbians and heterosexual women.
comment: Separación ideológica, social, cultural y física entre hombres y mujeres o entre lesbianas y mujeres heterosexuales.
change note: Version 4.2.0
in scheme: v3
narrower: Lesbian land
narrower: Lesbian nation
preferred label: Separatismo lesbiana
related: Gender relations

Lesbian studies
type: Concept
issued: 2019-05-14
modified: 2026-02-24
replaces: lesbianStudies
comment: Academic field of research and study about lesbians, lesbian identity, and lesbian communities.
comment: Campo académico de investigación y estudio sobre la identidad lésbica y comunidades lésbicas.
broader: Gender studies
broader: LGBTQ+ studies
change note: Version 4.2.0
has top concept: Gender studies
in scheme: v3
preferred label: Estudios lésbicos
related: Bisexual studies
related: Gay studies
related: Queer studies
related: Transgender studies

Lesbian youth
type: Concept
issued: 2019-05-14
modified: 2025-02-23
replaces: lesbianYouth
comment: Lesbians who are between the ages of childhood and adulthood.
comment: Lesbianas que se encuentran entre las edades de la niñez y la edad adulta.
alternative label: Lesbian teenagers
alternative label: Lesbian adolescents
alternative label: Lesbian teens
broader: Lesbians
broader: LGBTQ+ youth
change note: Version 4.2.0
has top concept: LGBTQ+ people
in scheme: v3
narrower: Lesbian girls
preferred label: Juventud lésbica
related: Lesbian characters
related: Lesbian identity
related: Lesbian youth literature

Lesbophobia
type: Concept
issued: 2019-05-14
modified: 2025-02-23
replaces: lesbophobia
comment: Antagonism or disgust directed towards lesbianism as an identity or lesbians due to their sexuality, perceived or actual. Lesbophobia can include denial of the existence of lesbianism, stereotypes, verbal harassment, and physical violence.
comment: Antagonismo o repugnancia hacia el lesbianismo como identidad o hacia las lesbianas por su sexualidad, percibida o real. La lesbofobia puede incluir la negación de la existencia del lesbianismo, estereotipos, acoso verbal y violencia física.
broader: LGBTQ+ phobia
change note: Version 4.2.0
has top concept: LGBTQ+ phobia
in scheme: v3
narrower: Internalized lesbophobia
preferred label: Lesbofobia
related: Anti-lesbian discrimination
related: Anti-lesbian violence
related: Lesbians
related: Heterosexism

LGBTQ+ adoptive families
type: Concept
issued: 2019-05-14
modified: 2025-02-23
replaces: LGBTQAdoptiveFamilies
comment: Families including adopted children in which one or more individuals identify as LGBTQ+.
comment: Familias que incluyen niños adoptados en las que una o más personas se autoidentifican como LGBTQ+.
alternative label: LGBTQ adoptive families
alternative label: Familias adoptivas (LGBTQ)
broader: LGBTQ+ families
change note: Version 4.2.0
has top concept: LGBTQ+ families
in scheme: v3
narrower: LGBTQ+ adoptive parenthood
narrower: LGBTQ+ fatherhood
narrower: LGBTQ+ motherhood
preferred label: Familias adoptivas LGBTQ+
related: LGBTQ+ adoption
related: LGBTQ+ adoptive parents

LGBTQ+ memorials
type: Concept
issued: 2019-05-14
modified: 2025-02-23
replaces: LGBTQMemorials
comment: Projects, events, monuments, and sculptures created to memorialize or celebrate LGBTQ+ people, communities, or events.
comment: Proyectos, eventos, monumentos y esculturas creadas para conmemorar o celebrar a personas, comunidades o eventos LGBTQ+.
alternative label: LGBTQ memorials
alternative label: Memoriales LGBTQ
change note: Version 4.2.0
in scheme: v3
narrower: Transgender Day of Remembrance
preferred label: Memoriales LGBTQ+
related: AIDS memorial quilts
related: AIDS memorials
related: LGBTQ+ history

LGBTQ+ migrants
type: Concept
issued: 2019-05-14
modified: 2025-02-23
replaces: LGBTQMigrants
comment: LGBTQ+ people who temporarily or permanently move away from their place of residence within a country or across an international border.
comment: Personas LGBTQ+ que se mudan temporal o permanentemente de su lugar de residencia dentro de un país o a través de una frontera internacional.
alternative label: Migrants (LGBTQ)
alternative label: LGBTQ migrants
alternative label: Migrantes LGBTQ
alternative label: Migrantes (LGBTQ)
broader: LGBTQ+ people
change note: Version 4.2.0
has top concept: LGBTQ+ people
in scheme: v3
preferred label: Migrantes LGBTQ+
related: LGBTQ+ people of shared ethnic or national identities
related: LGBTQ+ refugees
related: Undocumented LGBTQ+ residents
related: LGBTQ+ immigrants
related: LGBTQ+ asylum seekers

LGBTQ+ musicians
type: Concept
issued: 2019-05-14
modified: 2026-02-24
replaces: LGBTQMusicians
comment: LGBTQ+ people who create and/or perform music.
comment: Personas LGBTQ+ que crean y/o interpretan música.
alternative label: Musicians (LGBTQ)
alternative label: LGBTQ musicians
alternative label: Músicos LGBTQ
alternative label: Músicos (LGBTQ)
broader: LGBTQ+ people
change note: Version 4.2.0
has top concept: LGBTQ+ people
in scheme: v3
narrower: LGBTQ+ composers
preferred label: Músicos LGBTQ+
related: LGBTQ+ arts
related: LGBTQ+ choruses
related: Bandslash
related: LGBTQ+ music

Macho men
type: Concept
issued: 2019-05-14
modified: 2025-02-23
replaces: machoMen
comment: Subculture of gay men who display characteristics associated with machismo (e.g., masculine pride, self-reliance, physical strength). Though "macho men" can be used more broadly, this term refers to gay men who embrace machismo and traditional masculinity through their dress and behavior.
comment: Subcultura de hombres gay que muestran características asociadas con el machismo (por ejemplo, el orgullo masculino, la autosuficiencia, la fuerza física). Aunque "hombres machos" puede utilizarse de forma más amplia, este término se refiere a hombres gay que abrazan el machismo y la masculinidad tradicional a través de su vestimenta y comportamiento.
alternative label: Machos
broader: Gay men
change note: Version 4.2.0
has top concept: LGBTQ+ people
in scheme: v3
preferred label: Hombres macho
related: Banjees
related: Machismo
related: Masculinities
related: Bara
related: Bara fandom

Medical practitioners' statements
type: Concept
issued: 2019-05-14
modified: 2025-02-23
replaces: medicalPractitionersStatements
comment: Official documents from medical practitioners (e.g., doctors, nurses, therapists) diagnosing a patient's gender dysphoria and, typically, recommending gender-affirming healthcare; sometimes required for an individual's gender-affirming healthcare to be covered under insurance or for an individual to legally change their name or gender marker.
comment: Documentos oficiales de profesionales médicos (por ejemplo, doctores, enfermeras, terapeutas) que diagnostican la disforia de género de un paciente y, por lo general, recomiendan atención médica de afirmación de género; a veces es requerido para que el seguro cubra la atención médica de afirmación de género de una persona o para que una persona cambie legalmente su nombre o marcador de género.
broader: Official documentation
change note: Version 4.2.0
has top concept: Legal status
in scheme: v3
preferred label: Declaraciones de los médicos
related: Birth certificates
related: Driver's licenses
related: Gender markers
related: Medical care
related: Transitioning (Gender)

Monogamy
type: Concept
issued: 2019-05-14
modified: 2025-02-23
replaces: monogamy
comment: Relationship orientation in which individuals are exclusively committed to one partner at a time.
comment: Orientación relacional en la que las personas se comprometen exclusivamente con una pareja a la vez.
broader: Partner preference
broader: Sexual relationships
broader: Relationship orientation
change note: Version 4.2.0
has top concept: Sexual preference
in scheme: v3
preferred label: Monogamia
related: Sexual identity
related: Mononormativity
related: Monogamous people

No hormone identity
type: Concept
issued: 2019-05-14
modified: 2025-02-23
replaces: noHormoneIdentity
comment: Individuals who have not undergone hormone treatment; typically used to describe trans people who have not undergone and/or do not plan to undergo hormone treatment.
comment: Personas que no se han sometido a tratamiento hormonal; normalmente se utiliza para describir a personas trans que no se han sometido y/o no planean someterse a tratamiento hormonal.
broader: Transitioning status
change note: Version 4.2.0
has top concept: Transitioning (Gender)
in scheme: v3
preferred label: Identidad sin hormonas
related: Hormone therapy (Gender)
related: Herbal treatments
related: Non-operative
related: Transgender people
related: Transsexual people

Non-operative
type: Concept
issued: 2019-05-14
modified: 2025-02-23
replaces: nonOperative
comment: The medical status of individuals who do not plan to undertake a surgical procedure. Commonly used to describe trans people who have not and do not plan to undertake gender affirming surgery.
comment: El estado médico de las personas que no planean someterse a un procedimiento quirúrgico. Se utiliza comúnmente para describir a personas trans que no se han sometido ni planean someterse a una cirugía de afirmación de género.
broader: Transitioning status
change note: Version 4.2.0
has top concept: Transitioning (Gender)
in scheme: v3
preferred label: No quirúrgico
related: Gender-affirming surgery
related: Herbal treatments
related: No hormone identity
related: Transgender people
related: Transsexual people

Pansexual people
type: Concept
issued: 2019-05-14
modified: 2025-02-23
replaces: pansexualPeople
comment: Individuals who self-identify as pansexual, meaning that they are sexually attracted to people of all genders. Some but not all pansexual people also identify as "gender-blind" because gender is insignificant or irrelevant in determining their attraction.
comment: Personas que se identifican como pansexuales, lo que significa que se sienten atraídas sexualmente por personas de todos los géneros. Algunas personas pansexuales, pero no todas, también se identifican como "ciegas al género", porque el género les es insignificante o irrelevante para determinar su atracción.
alternative label: Omnisexual
broader: Bi+ people
broader: LGBTQ+ people
change note: Version 4.2.0
has top concept: LGBTQ+ people
in scheme: v3
preferred label: Personas pansexuales
related: Bisexual people
related: Transsexual people
related: Allosexuality
related: Pansexuality

Phallic sex
type: Concept
issued: 2019-05-14
modified: 2025-02-23
replaces: phallicSex
comment: Sexual stimulation or sexual practices involving penises or phallic objects (e.g., dildos).
comment: Estimulación sexual o prácticas sexuales que involucran penes u objetos fálicos (por ejemplo, consoladores).
broader: Sex (Act)
broader: Sexual practices
change note: Version 4.2.0
has top concept: Sex (Act)
in scheme: v3
narrower: Fellatio
narrower: Fucking
narrower: Wacking off
narrower: Wanking
preferred label: Sexo fálico

Queer clergy
type: Concept
issued: 2019-05-14
modified: 2025-02-23
replaces: queerClergy
comment: Queer people who are ordained for religious duties, particularly in the Christian Church.
comment: Personas queer que son ordenadas para deberes religiosos, particularmente en la Iglesia cristiana.
broader: LGBTQ+ clergy
change note: Version 4.2.0
has top concept: LGBTQ+ clergy
in scheme: v3
preferred label: Clero queer
related: Bisexual clergy
related: Celibacy
related: Gay clergy
related: Lesbian clergy
related: Transgender clergy

Queer families
type: Concept
issued: 2019-05-14
modified: 2025-02-23
replaces: queerFamilies
comment: Families, whether biological, adoptive, or chosen, in which one or more individuals identify as queer.
comment: Familias, ya sean biológicas, adoptivas o elegidas, en las que una o más personas se autoidentifican como queer.
broader: LGBTQ+ families
change note: Version 4.2.0
has top concept: LGBTQ+ families
in scheme: v3
preferred label: Familias queer
related: Children of queer people
related: LGBTQ+ parenthood
related: Queer people
related: Queerspawn
related: Culturally queer

Queer relationships
type: Concept
issued: 2019-05-14
modified: 2025-02-23
replaces: queerRelationships
comment: Ongoing connections (romantic, sexual, or platonic) between two or more queer people.
comment: Conexiones continuas (románticas, sexuales o platónicas) entre dos o más personas queer.
broader: Relationship satisfaction
change note: Version 4.2.0
has top concept: Relationship satisfaction
in scheme: v3
preferred label: Relaciones queer
related: Bisexual relationships
related: Gay relationships
related: Lesbian relationships
related: Transgender relationships
related: Queer desire

Queerphobia
type: Concept
issued: 2019-05-14
modified: 2025-02-23
replaces: queerphobia
comment: Antagonism or disgust directed towards queerness as an identity or queer people due to their identity, perceived or actual. Queerphobia can include denial of the existence of queerness, stereotypes, verbal harassment, and physical violence.
comment: Antagonismo o disgusto dirigido hacia lo queer como identidad o hacia las personas queer debido a su identidad, percibida o real. La queerfobia puede incluir la negación de la existencia de lo queer, estereotipos, acoso verbal y violencia física.
broader: LGBTQ+ phobia
change note: Version 4.2.0
has top concept: LGBTQ+ phobia
in scheme: v3
narrower: Internalized queerphobia
preferred label: Queerfobia
related: Anti-queer discrimination
related: Anti-queer violence
related: Heterosexism
related: Queer people

Reading (Gender)
type: Concept
issued: 2019-05-14
modified: 2025-02-23
replaces: readingTransgender
comment: Slang term for the act of identifying (or reading) someone in public as trans, non-binary, crossdressing, or in drag. Unlike Clocking (Gender), which is typically understood as a threat (of violence or outing) against the person being clocked or read, Reading (Gender) refers to shared identification or recognized kinship between two individuals who are both gender minorities.
comment: Término del argot para el acto de identificar (o leer) a alguien en público como trans, no binario, transformista o en drag. A diferencia del fichaje (género), que normalmente se entiende como una amenaza (de violencia o sacar del armario) contra la persona que está siendo fichada o leída, la lectura (género) se refiere a la identificación compartida o el vínculo reconocido entre dos personas que pertenecen a minorías de género.
alternative label: Reading (Transgender)
alternative label: Lectura (transgénero)
alternative label: Reading (género)
change note: Version 4.2.0
in scheme: v3
preferred label: Lectura (género)
related: Crossdressing
related: Passing (Gender)
related: Transgender people
related: Reading (LGBTQ+ culture)
related: Queer coding

Risk behaviors
type: Concept
issued: 2019-05-14
modified: 2025-02-23
replaces: riskBehaviours
comment: Behaviors that may put someone at increased risk of contracting HIV or STIs.
comment: Comportamientos que pueden poner a alguien en mayor riesgo de contraer VIH o ITS.
change note: Version 4.2.0
in scheme: v3
narrower: Barebacking
narrower: Bugchasing
preferred label: Conductas de riesgo
preferred label: Risk behaviours
related: Safer sex
related: Sexual behavior change

Same-gender-loving
type: Concept
issued: 2019-05-14
modified: 2025-02-23
replaces: sameGenderLoving
comment: Culturally affirming term for sexual identity that is often used to describe African American homosexual people.
comment: Término culturalmente afirmativo para la identidad sexual que se utiliza a menudo para describir a las personas homosexuales afroamericanas.
alternative label: SGL
broader: Sexual identity
change note: Version 4.2.0
has top concept: Sexual identity
in scheme: v3
preferred label: Amor del mismo género
related: African American LGBTQ+ people
related: Men who have sex with men
related: Women who have sex with women
related: MLM (Men Loving Men)
related: WLW (Women Loving Women)

Secondary sex characteristics
type: Concept
issued: 2019-05-14
modified: 2025-02-23
replaces: secondarySexCharacteristics
comment: Features that appear during puberty that are not directly related to reproduction, like changes in the voice and the development of body hair.
comment: Características que aparecen durante la pubertad que no están directamente relacionadas con la reproducción, como cambios en la voz y el desarrollo del vello corporal.
broader: Sex (Body)
change note: Version 4.2.0
has top concept: Sex (Body)
in scheme: v3
narrower: Breast
narrower: Fat distribution
narrower: Hair
narrower: Stature
narrower: Voice
preferred label: Características sexuales secundarias

Sexual climax
type: Concept
issued: 2019-05-14
modified: 2025-03-20
replaces: sexualClimax
comment: The most intense or highest point of pleasure in sexual activities; the peak of an orgasm.
comment: El punto de placer más intenso o más alto en las actividades sexuales; el pico de un orgasmo.
change note: Version 4.2.0
in scheme: v3
preferred label: Clímax sexual
related: Cum
related: Getting off
related: Happy endings
related: Jizz
related: Sexual excitement

Sexual inversion
type: Concept
issued: 2019-05-14
modified: 2025-02-23
replaces: sexualInversion
comment: Historical term for homosexuality used by sexologists to refer to an inborn reversal of gender traits or roles. Only use in historical contexts.
comment: Término histórico para la homosexualidad utilizado por sexólogos para referirse a una inversión innata de rasgos o roles de género. Utilícese únicamente en contextos históricos.
broader: LGBTQ+ historical terms
broader: Medicalization
change note: Version 4.2.0
has top concept: LGBTQ+ historical terms
in scheme: v3
preferred label: Inversión sexual
related: Eonism
related: Inverts
related: Sexual preference
related: Uranism

STDs
type: Concept
issued: 2019-05-14
modified: 2025-02-23
replaces: STDs
comment: Diseases or infections that are transmitted via sexual contact or activity.
comment: Enfermedades o infecciones que se transmiten por contacto o actividad sexual.
alternative label: Sexually transmitted diseases
alternative label: VD
alternative label: Venereal diseases
alternative label: STIs
alternative label: Sexually transmitted infections
alternative label: Enfermedades de transmisión sexual
alternative label: ITS
alternative label: Infecciones de transmisión sexual
alternative label: Enfermedades venéreas
change note: Version 4.2.0
in scheme: v3
narrower: HIV/AIDS
preferred label: ETS
related: Partner notification

Siblings
type: Concept
issued: 2019-05-14
modified: 2025-02-23
replaces: siblings
comment: Individuals who share the same parent or parents.
comment: Personas que comparten el mismo padre(s) y o madre(s).
alternative label: Hermanas
alternative label: Hermanxs
broader: Family members
change note: Version 4.2.0
has top concept: Family members
in scheme: v3
narrower: LGBTQ+ siblings
narrower: Siblings of LGBTQ+ people
narrower: Donor siblings
narrower: Half-siblings
preferred label: Hermanos
related: LGBTQ+ families

Situational sexual behavior
type: Concept
issued: 2019-05-14
modified: 2025-02-23
replaces: situationalSexualBehaviour
comment: Sexual behaviors that depart from an individual's typical behaviors or preferences as a result of social pressures that permit, encourage, or compel certain behaviors.
comment: Comportamientos sexuales que se desvían de los comportamientos o las preferencias típicas de una persona como resultado de presiones sociales que permiten, alientan u obligan a ciertos comportamientos.
alternative label: Situational homosexuality
alternative label: Homosexualidad situacional
change note: Version 4.2.0
in scheme: v3
preferred label: Comportamiento sexual situacional
preferred label: Situational sexual behaviour
related: Sex (Act)
related: Sexual practices
related: Sexual preference
related: Sexuality
related: Sexual fluidity

Social security cards
type: Concept
issued: 2019-05-14
modified: 2025-02-23
replaces: socialSecurityCards
comment: Official documents issued by governments that ascribe unique numeral identifiers to citizens to track their income and determine retirement benefits.
comment: Documentos oficiales emitidos por gobiernos que atribuyen identificadores numéricos únicos a los ciudadanos para realizar un seguimiento de sus ingresos y determinar los beneficios de jubilación.
broader: Official documentation
change note: Version 4.2.0
has top concept: Legal status
in scheme: v3
preferred label: Tarjetas de seguro social
related: Birth certificates
related: Legal name change
related: Driver's licenses
related: Gender markers
related: Transitioning (Gender)

Sodomy
type: Concept
issued: 2019-05-14
modified: 2025-02-23
replaces: sodomy
comment: Historical term for "unnatural" sexual acts unrelated to procreation, including oral sex and anal sex.
comment: Término histórico para actos sexuales "antinaturales" no relacionados con la procreación, incluido el sexo oral y el sexo anal.
broader: LGBTQ+ historical terms
change note: Version 4.2.0
has top concept: LGBTQ+ historical terms
in scheme: v3
preferred label: Sodomía
related: Sodomites
related: Pederasty
related: Sex (Act)
related: Sexual practices
related: Sodomy laws

Sperm donors
type: Concept
issued: 2019-05-14
modified: 2025-02-23
replaces: spermDonors
comment: Individuals of any gender who donate their own sperm for the purpose of inducing pregnancy.
comment: Personas de cualquier género que donan su propio esperma con el fin de inducir el embarazo.
broader: Donors
broader: Donor insemination
change note: Version 4.2.0
has top concept: Donors
in scheme: v3
preferred label: Donantes de esperma
related: Insemination
related: LGBTQ+ family planning
related: Artificial insemination
related: Sperm donation

Strap-on sex
type: Concept
issued: 2019-05-14
modified: 2025-02-23
replaces: strapOnSex
comment: Sexual intercourse in which a dildo attached to a harness is used for either vaginal or anal penetration.
comment: Relaciones sexuales en las que se utiliza un consolador sujeto a un arnés para la penetración vaginal o anal.
broader: Sex (Act)
change note: Version 4.2.0
has top concept: Sex (Act)
in scheme: v3
preferred label: Sexo con arnés
related: Dildo harnesses
related: Dildos
related: Sexual intercourse
related: Penis
related: Women who have sex with women

Tearoom sex
type: Concept
issued: 2019-05-14
modified: 2025-02-23
replaces: tearoomSex
comment: U.S. slang term that refers to anonymous sex in a public bathroom or the practice of cruising for sexual partners in public bathrooms.
comment: Término de la jerga estadounidense que se refiere al sexo anónimo en un baño público o la práctica de buscar parejas sexuales en baños públicos.
broader: Sexual practices
change note: Version 4.2.0
has top concept: Sexual practices
in scheme: v3
related: Anonymous sex
related: Cottaging (Gay culture)
related: Cruising (LGBTQ+ culture)
related: Public sex
related: Tearooms (Gay culture)

Transgender clergy
type: Concept
issued: 2019-05-14
modified: 2025-02-23
replaces: transgenderClergy
comment: Transgender people who are ordained for religious duties, particularly in the Christian Church.
comment: Personas transgénero que están ordenadas para deberes religiosos, particularmente en la Iglesia cristiana.
broader: LGBTQ+ clergy
change note: Version 4.2.0
has top concept: LGBTQ+ clergy
in scheme: v3
preferred label: Clero transgénero
related: Bisexual clergy
related: Celibacy
related: Gay clergy
related: Lesbian clergy
related: Queer clergy

Transgender movement
type: Concept
issued: 2019-05-14
modified: 2025-04-17
replaces: transgenderMovement
comment: Umbrella term for activism focused on the rights of transgender people and issues faced by transgender communities.
comment: Término general para el activismo centrado en los derechos de las personas transgénero y los problemas que enfrentan las comunidades transgénero.
alternative label: Transgender Movement
broader: LGBTQ+ movement
change note: Version 4.2.0
has top concept: Social movements
in scheme: v3
preferred label: Movimiento transgénero
related: Transgender information centers
related: Transgender press
related: Transgender television
related: Transgenderism
related: Transgender demonstrations

Transgender press
type: Concept
issued: 2019-05-14
modified: 2025-02-23
replaces: transgenderPress
comment: Newspapers, magazines, or other publishing outlets aimed at transgender audiences and/or operated by transgender people.
comment: Periódicos, revistas u otros medios editoriales dirigidos a audiencias transgénero y/o operados por personas transgénero.
broader: LGBTQ+ press
change note: Version 4.2.0
has top concept: LGBTQ+ press
in scheme: v3
narrower: Transgender newsletters
narrower: Transgender newspapers
narrower: Transgender zines
preferred label: Prensa transgénero
related: LGBTQ+ magazines
related: Transgender movement

Transgender youth
type: Concept
issued: 2019-05-14
modified: 2025-02-23
replaces: transgenderYouth
comment: Transgender people who are between the ages of childhood and adulthood.
comment: Personas transgénero que se encuentran entre las edades de la niñez y la edad adulta.
alternative label: Transgender teenagers
alternative label: Transgender adolescents
alternative label: Transgender teens
alternative label: Adolescentes transgénero
alternative label: Jóvenes transgénero
broader: Transgender people
broader: LGBTQ+ youth
change note: Version 4.2.0
has top concept: LGBTQ+ people
in scheme: v3
narrower: Transgender children
preferred label: Juventud transgénero
related: Transgender youth literature
related: Transgender health care bans for children and youth
related: Health care for transgender children and youth

Transmasculine people
type: Concept
issued: 2019-05-14
modified: 2025-02-23
replaces: transmasculinePeople
comment: Trans people assigned female at birth who identify partially or fully with a masculine gender.
comment: Personas trans asignadas al sexo femenino al nacer que se autoidentifican parcial o totalmente con un género masculino.
broader: Transgender people
change note: Version 4.2.0
has top concept: LGBTQ+ people
in scheme: v3
preferred label: Personas transmasculinas
related: Bois
related: Masculinities
related: Demiboys
related: Transmasculinity
related: Masculine of center

Transvestism
type: Concept
issued: 2019-05-14
modified: 2025-02-23
replaces: transvestism
comment: U.S. historical term used to describe the practices of individuals who wear clothes associated with a gender other than their gender assigned at birth; generally considered to be a derogatory term; use only in historical contexts.
comment: Término histórico estadounidense utilizado para describir las prácticas de personas que utilizan ropa asociada con un género distinto al asignado al nacer; generalmente se considera un término despectivo; utilícese únicamente en contextos históricos.
broader: Gender expression
broader: Medicalization
change note: Version 4.2.0
has top concept: Gender
in scheme: v3
preferred label: Travestismo
related: Crossdressing
related: Eonism
related: Trans
related: Masquerading

Twinks (Gay culture)
type: Concept
issued: 2019-05-14
modified: 2025-02-23
replaces: twinks
comment: U.S. slang term for young gay men who are typically small in stature, hairless, and considered effeminate.
comment: Término de la jerga estadounidense para referirse a hombres gay jóvenes que suelen ser de baja estatura, lampiños y considerados afeminados.
alternative label: Twinkies
alternative label: Twinks
alternative label: Yogurín
broader: Gay culture
broader: Gay men
broader: Gender roles
broader: Sexual identity
change note: Version 4.2.0
has top concept: Subcultures
in scheme: v3
preferred label: Twinks (Cultura gay)
related: Gender expression

Voice therapy (Gender)
type: Concept
issued: 2019-05-14
modified: 2025-02-23
replaces: voiceTherapyTransgender
comment: Any non-surgical technique used to make the human voice sound either more feminine or masculine.
comment: Cualquier técnica no quirúrgica utilizada para hacer que la voz humana suene más femenina o masculina.
alternative label: Voice therapy (Transgender)
alternative label: Voice therapy
alternative label: Terapia vocal (Transgénero)
alternative label: Terapia vocal
broader: Gender expression
broader: Therapies
change note: Version 4.2.0
has top concept: Gender
in scheme: v3
preferred label: Terapia vocal (género)
related: Transitioning (Gender)
related: Transsexualism
related: Feminizing vocal surgery
related: Masculinizing vocal surgery

Mononormativity
type: Concept
issued: 2020-06-03
modified: 2025-02-23
replaces: mononormativity
comment: The belief that all people share a desire for monogamous relationships and that this is a preferential life goal.
comment: La creencia de que todas las personas comparten el deseo de tener relaciones monógamas y que este es un objetivo preferencial en la vida.
broader: Social norms
change note: Version 4.2.0
has top concept: Social norms
in scheme: v3
preferred label: Mononormatividad
related: LGBTQ+ discrimination
related: Monogamy
related: Monosexuality
related: Monosexual people
related: Monogamous people

Breast fetish
type: Concept
issued: 2020-12-11
modified: 2025-02-23
replaces: breastFetishism
comment: Eroticization of the breasts.
comment: Erotización de los senos.
alternative label: Mazophilia
alternative label: Breast partialism
alternative label: Mastofact
alternative label: Breast fetishism
alternative label: Breast kink
alternative label: Fetiche de mamas
alternative label: Fetichismo de mamas
preferred label: Fetiche de senos
alternative label: Fetichismo de senos
alternative label: Masofilia
alternative label: Mastofacto
alternative label: Kink de senos
alternative label: Kink de mamas
broader: Body part fetishes
change note: Version 4.2.0
has top concept: Eroticism
in scheme: v3
related: Breast
related: Nipple play
related: Chest
related: Breast torture
related: Breast play

Breast size
type: Concept
issued: 2020-12-11
modified: 2025-02-23
replaces: breastSize
comment: The dimensions of an individual's breast tissue; can be used as an approximation (e.g., large breasts, small breasts) or to reference to standards of measurement for bras and other support garments.
comment: Las dimensiones del tejido mamario de una persona; se puede utilizar como una aproximación (p. ej., senos grandes, senos pequeños) o como referencia a estándares de medidas para sujetadores y otras prendas de soporte.
change note: Version 4.2.0
in scheme: v3
narrower: Large breasts
narrower: Small breasts
preferred label: Tamaño de los senos
related: Breast

Anchor partners
type: Concept
issued: 2021-06-30
modified: 2025-02-23
replaces: anchorPartners
comment: A term used in non-monogamous communities to refer to a long-term partner with multiple commitments. Often used in place of language that is seen as hierarchical (e.g., primary/secondary partner).
comment: Término utilizado en comunidades no monógamas para referirse a una pareja a largo plazo con múltiples compromisos. A menudo se utiliza en lugar de un lenguaje que se considera jerárquico (por ejemplo, pareja principal/secundaria).
alternative label: Vínculos ancla
broader: Non-monogamous people
broader: Partners
change note: Version 4.2.0
has top concept: Relationship minorities
in scheme: v3
preferred label: Parejas anclas
related: Polyamory
related: Hierarchical non-monogamy
related: Nesting partners
related: Polyamorous people

Assigned sex
type: Concept
issued: 2021-06-30
modified: 2025-02-23
replaces: assignedSex
comment: An individual's sex as determined by a medical practitioner or provider. Determination is usually based on the appearance of external genitalia but may use other methodologies. In practice, sex assigned at birth is often culturally variable; the term "assigned gender" is often more applicable or accurate.
comment: El sexo de una persona determinado por un médico. La determinación suele basarse en la apariencia de los genitales externos, pero pueden utilizarse otras metodologías. En la práctica, el sexo asignado al nacer suele variar culturalmente; el término "género asignado" suele ser más aplicable o preciso.
broader: Sex (Body)
change note: Version 4.2.0
has top concept: Sex (Body)
in scheme: v3
narrower: Sex assigned at birth
preferred label: Sexo asignado
related: Assigned gender
related: Chromosomes
related: Endosex
related: Endosex people

Gym subculture
type: Concept
issued: 2021-06-30
modified: 2025-02-23
replaces: gymSubculture
comment: Gay subculture popularized in the 1970s via homoerotic bodybuilder magazines. Often includes aesthetics modeled after ancient Greek gymnasiums. Especially popular in San Francisco, West Hollywood, and New York City.
comment: Subcultura gay que se popularizó en la década de 1970 a través de revistas fisicoculturistas homoeróticas. A menudo, incluye una estética inspirada en los antiguos gimnasios griegos. Particularmente popular en San Francisco, West Hollywood y la ciudad de Nueva York.
alternative label: Subcultura de gimnasio
alternative label: Subcultura gym
broader: Subcultures
change note: Version 4.2.0
has top concept: Subcultures
in scheme: v3
preferred label: Subcultura del gimnasio
related: Gay culture
related: Bara
related: Bara fandom
related: Muscle worship
related: Body worship

Nesting partners
type: Concept
issued: 2021-06-30
modified: 2025-02-23
replaces: nestingPartners
comment: A term used in non-monogamous communities to refer to partners an individual lives with. Often used in place of language that is seen as hierarchical (e.g., primary partner, secondary partner).
comment: Término utilizado en comunidades no monógamas para referirse a las parejas con las que vive una persona. A menudo, se utiliza en lugar de un lenguaje que se considera jerárquico (por ejemplo, "pareja principal", "pareja secundaria").
broader: Non-monogamous people
broader: Partners
change note: Version 4.2.0
has top concept: Relationship minorities
in scheme: v3
preferred label: Compañeros de anidación
related: Polyamory
related: Hierarchical non-monogamy
related: Anchor partners
related: Polyamorous people

Lesbian employment
type: Concept
issued: 2021-11-02
modified: 2025-02-23
comment: Employment of lesbians.
comment: El empleo de lesbianas.
broader: LGBTQ+ employment
change note: Version 4.2.0
has top concept: LGBTQ+ employment
in scheme: v3
preferred label: Empleo lésbico
related: Gay employment
related: Bisexual employment
related: Transgender employment
related: Queer employment
related: Lesbian chefs

Gay employment
type: Concept
issued: 2021-11-02
modified: 2025-02-23
comment: Employment of gay men.
comment: El empleo de hombres gay.
broader: LGBTQ+ employment
change note: Version 4.2.0
has top concept: LGBTQ+ employment
in scheme: v3
preferred label: Empleo gay
related: Lesbian employment
related: Bisexual employment
related: Transgender employment
related: Queer employment
related: Gay chefs

Bisexual employment
type: Concept
issued: 2021-11-02
modified: 2025-02-23
comment: Employment of bisexual people.
comment: Obras de ficción escritas para ser puestas en escena; utilícese en referencia a obras dramáticas que se centran en personajes o temas bisexuales.
broader: LGBTQ+ employment
change note: Version 4.2.0
has top concept: LGBTQ+ employment
in scheme: v3
preferred label: Drama bisexual
related: Lesbian employment
related: Gay employment
related: Transgender employment
related: Queer employment
related: Bisexual chefs

Transgender employment
type: Concept
issued: 2021-11-02
modified: 2025-02-23
comment: Employment of transgender people.
comment: Empleo de personas transgénero.
broader: LGBTQ+ employment
change note: Version 4.2.0
has top concept: LGBTQ+ employment
in scheme: v3
preferred label: Empleo transgénero
related: Lesbian employment
related: Gay employment
related: Bisexual employment
related: Queer employment
related: Transgender chefs

Queer employment
type: Concept
issued: 2021-11-02
modified: 2025-02-23
comment: Employment of queer people.
comment: Empleo de personas queer.
broader: LGBTQ+ employment
change note: Version 4.2.0
has top concept: LGBTQ+ employment
in scheme: v3
preferred label: Empleo queer
related: Lesbian employment
related: Gay employment
related: Bisexual employment
related: Transgender employment
related: Queer chefs

Intersex parents
type: Concept
issued: 2021-11-23
modified: 2025-02-23
comment: Parents who are intersex.
comment: Padres y/o madres que son intersex.
alternative label: Madres intersex
alternative label: Padres intersex
broader: LGBTQ+ parents
change note: Version 4.2.0
has top concept: LGBTQ+ families
in scheme: v3
narrower: Intersex mothers
preferred label: Madres y padres intersex
related: Intersex people
related: Intersex families
related: Children of intersex people
related: Intersex fathers

LGBTQ+ special collections
type: Concept
issued: 2022-01-24
modified: 2026-02-23
comment: Special collections that hold materials primarily pertaining to LGBTQ+ people or intended for use by LGBTQ+ people. Special collections tend to be a blend of institutional types (e.g., an archives with a museum component). This term should be applied to institutions that refer to themselves as special collections; otherwise, use the term "LGBTQ+ cultural heritage institutions."
comment: Colecciones especiales que contienen materiales principalmente relacionados con personas LGBTQ+ o destinados a ser utilizados por personas LGBTQ+. Las colecciones especiales tienden a ser una combinación de tipos institucionales (por ejemplo, archivos con un componente de museo). Este término debe aplicarse a instituciones que se refieran a sí mismas como colecciones especiales; de lo contrario, utilícese el término "instituciones de patrimonio cultural LGBTQ+".
alternative label: Hidden collections (LGBTQ)
alternative label: LGBTQ+ hidden collections
alternative label: Special collections (LGBTQ)
alternative label: Colecciones especiales LGBTQ
alternative label: Colecciones especiales (LGBTQ)
alternative label: Colecciones ocultas (LGBTQ)
broader: LGBTQ+ cultural heritage institutions
change note: Version 4.2.0
has top concept: LGBTQ+ cultural heritage institutions
in scheme: v3
preferred label: Colecciones especiales LGBTQ+
related: LGBTQ+ libraries
related: LGBTQ+ museums
related: LGBTQ+ theater
related: LGBTQ+ archivists
related: Metadata for LGBTQ+ resources

Trans exclusivity
type: Concept
issued: 2022-02-14
modified: 2025-02-23
comment: The practice or policy of denying equal access and support to trans people.
comment: La práctica o política de negar la igualdad de acceso y apoyo a las personas trans.
alternative label: Trans exclusion
alternative label: Trans exclusive
alternative label: Trans-exclusive
broader: Anti-transgender discrimination
broader: Inclusivity
change note: Version 4.2.0
has top concept: LGBTQ+ discrimination
in scheme: v3
preferred label: Exclusión trans
related: Bathroom bans
related: Transphobia
related: Womyn
related: Anti-transgender legislation
related: Anti-gender movement

Heteroromantic people
type: Concept
issued: 2022-02-14
modified: 2025-02-23
comment: Individuals who experience romantic attraction or romantic desire in a frequent and consistent manner toward members of the opposite sex or gender.
comment: Personas que experimentan atracción romántica o deseo romántico de manera frecuente y consistente hacia miembros del sexo o género opuesto.
broader: Alloromantic people
change note: Version 4.2.0
has top concept: Alloromantic people
in scheme: v3
preferred label: Personas heterorománticas
related: Aromantic people
related: Heteroromanticism
related: Biromantic people
related: Homoromantic people
related: Panromantic people

Queer culture
type: Concept
issued: 2022-02-14
modified: 2025-02-23
comment: Cultural experiences shared by members of queer communities or products of queer culture (e.g., art and media created by and for queer people, activism focused on queer issues, slang commonly used in queer communities, etc.).
comment: Experiencias culturales compartidas por miembros de comunidades queer o productos de la cultura queer (por ejemplo, arte y medios creados por y para personas queer, activismo centrado en cuestiones queer, jerga comúnmente utilizada en comunidades queer, etc.).
broader: LGBTQ+ culture
change note: Version 4.2.0
has top concept: Subcultures
in scheme: v3
narrower: Culturally queer
preferred label: Cultura queer
related: Lesbian culture
related: Gay culture
related: Transgender culture
related: Bisexual culture

Facial gender affirming surgery
type: Concept
issued: 2022-02-14
modified: 2025-02-23
comment: Any of various surgeries that involve modifying the face or facial features to affirm the patient's gender.
comment: Cualquiera de las diversas cirugías que implican modificar el rostro o los rasgos faciales para afirmar el género del paciente.
alternative label: Facial gender affirmation surgery
alternative label: Facial gender confirmation surgery
alternative label: Facial gender confirming surgery
alternative label: Cirugía facial de confirmación de género
broader: Gender-affirming surgery
change note: Version 4.2.0
has top concept: Medical care
in scheme: v3
narrower: Facial masculinization surgery
narrower: Facial feminization surgery
preferred label: Cirugía facial de afirmación de género
related: Transitioning status
related: Transitioning (Gender)
related: Tracheal shave

Clitoroplasty
type: Concept
issued: 2022-02-14
modified: 2025-02-23
comment: Surgical construction of the clitoris, often undertaken as a form of gender affirming surgery.
comment: Construcción quirúrgica del clítoris, a menudo realizada como una forma de cirugía de afirmación de género.
alternative label: Reducción de clitoris
broader: Bottom surgery
change note: Version 4.2.0
has top concept: Medical care
in scheme: v3
preferred label: Clitoroplastia
related: Clitoris
related: Neovagina
related: Transitioning (Gender)
related: Labiaplasty
related: Vaginoplasty

Critical race theory
type: Concept
issued: 2022-03-29
modified: 2025-04-23
comment: A multidiscplinary field of study and intellectual framework used by scholars and activists to examine the intersections of race, class, and law in the United States, as well as to challenge mainstream U.S. liberal approaches to racial justice. Key concepts of CRT include the argument that race is a social construct with no biological basis and that racism and disparate racial outcomes are the result of complex, changing, and often subtle social and institutional dynamics, rather than individuals' explicit and intentional prejudices.
comment: Un campo de estudio multidisciplinario y un marco teórico intelectual utilizado por académicos y activistas para examinar las intersecciones de la raza, la clase y el derecho en los Estados Unidos, así como para desafiar los principales enfoques liberales estadounidenses sobre la justicia racial. Los conceptos claves del CRT incluyen el argumento de que la raza es una construcción social sin base biológica y que el racismo y los resultados raciales dispares son el resultado de dinámicas sociales e institucionales complejas, cambiantes y a menudo sutiles, en lugar de prejuicios explícitos e intencionales de los individuos.
alternative label: CRT
broader: Theories
change note: Version 4.2.0
has top concept: Theories
in scheme: v3
preferred label: Teoría crítica de la raza
related: Transmisogynoir
related: Racism
related: Anti-Blackness
related: Anti-racism
related: White time

Misogynoir
type: Concept
issued: 2022-03-29
modified: 2025-02-23
comment: Term coined by scholar Moya Bailey to describe the intersection of misogyny and anti-Black racism as directed toward Black women.
comment: El término original en inglés "misogynoir" fue acuñado por la académica Moya Bailey para describir la intersección de la misoginia y el racismo anti-negro dirigido hacia las mujeres negras.
alternative label: Misoginia hacia las mujeres negras
change note: Version 4.2.0
in scheme: v3
preferred label: Misoginia negra
related: Misogyny
related: Transmisogyny
related: Transmisogynoir
related: Racism
related: Anti-Blackness

Feminine of center
type: Concept
issued: 2022-06-15
modified: 2025-02-23
comment: Term used to describe individuals whose gender expression is more feminine than androgynous. Generally used as a self-descriptor within LGBTQ+ communities.
alternative label: FOC
alternative label: Fem of center
alternative label: Femme of center
broader: Femininities
change note: Version 4.2.0
has top concept: Gender
in scheme: v3
related: Femmes
related: Transfeminine people
related: Trans women
related: Demigirls
related: Masculine of center

Bara fandom
type: Concept
issued: 2022-07-04
modified: 2025-02-23
comment: The fan community that focuses on, incorporates, or details the relationships of characters from bara manga and anime.
comment: La comunidad de fans que se centra sobre, incorpora o detalla las relaciones de personajes del manga y del anime bara.
broader: Anime and manga fandom
change note: Version 4.2.0
has top concept: Subcultures
in scheme: v3
narrower: Bara
preferred label: Fandom bara
related: Bears (Gay culture)
related: Macho men
related: Gym subculture
related: Gay men in fandom

Fanfiction tropes and genres
type: Concept
issued: 2022-07-04
modified: 2025-02-23
comment: Tropes and genres commonly used in fanfiction. Examples include "there was only one bed" and "enemies to lovers" romance plots.
comment: Tropos y géneros comúnmente utilizados en el fanfiction. Los ejemplos incluyen tramas románticas de "solo había una cama" y de "enemigos a amantes".
alternative label: Fanfic tropes and genres
alternative label: Tropos y géneros de fanfic
broader: Fanfiction
change note: Version 4.2.0
has top concept: Subcultures
in scheme: v3
narrower: Alternate universe settings (Fanfiction)
narrower: Bury your gays
narrower: Kink in fandom
preferred label: Tropos y géneros del fanficcion
related: Gender swapping
related: One true pairing

Femslash
type: Concept
issued: 2022-07-04
modified: 2025-02-23
comment: A genre of fanworks in which two or more women are placed in a sexual or romantic situation with one another. Works of femslash are commonly erotic or pornographic. In recognition of the fact that the term "slash" has recently been broadened to include LGBTQ+ relationships other than those between two men, slash terms (e.g., Slash art, Slash roleplay, Slash vidding) should be used to describe specific types of femslash.
comment: Género de fanworks en el que dos o más mujeres se encuentran en una situación sexual o romántica. Las obras de femslash suelen ser eróticas o pornográficas. En reconocimiento del hecho de que el término "slash" se ha ampliado recientemente para incluir relaciones LGBTQ+ más allá de las relaciones entre dos hombres, los términos "slash" (por ejemplo, "slash art", "slash roleplay", "slash vidding") deben utilizarse para describir tipos específicos de femslash.
alternative label: Altfic
alternative label: F/F slash
alternative label: Femmeslash
alternative label: Girlslash
alternative label: Ladyslash
broader: Slash (Genre)
change note: Version 4.2.0
has top concept: Subcultures
in scheme: v3
narrower: Lesbian fiction
narrower: Lesbian erotic literature
related: Gender swapping
related: Yuri
related: Yuri fandom

Gay men in fandom
type: Concept
issued: 2022-07-04
modified: 2025-02-23
comment: The participation and inclusion of gay men in fan communities.
comment: Hombres que se autoidentifican como gay y pertenecen a comunidades gay. Se utiliza predominantemente para describir a hombres que se sienten exclusiva o principalmente atraídos romántica y/o sexualmente a otros hombres. Si bien "gay" se utiliza a menudo como identificador para personas de todos los géneros, este término se refiere específicamente a los hombres gay.
alternative label: Gays
broader: LGBTQ+ people in fandom
broader: Men in fandom
change note: Version 4.2.0
has top concept: LGBTQ+ people
in scheme: v3
preferred label: Hombres gay
related: Gay fiction
related: Gay men
related: Gay authors
related: Bara fandom

Hentai
type: Concept
issued: 2022-07-04
modified: 2025-02-23
comment: A genre of anime and manga characterized by explicit sexual content; can also include hentai video games.
comment: Un género de anime y manga caracterizado por contenido sexual explícito; también puede incluir videojuegos hentai.
broader: Pornography
broader: Hentai fandom
change note: Version 4.2.0
has top concept: Sex industry
in scheme: v3
related: LGBTQ+ cartoons
related: LGBTQ+ erotic literature
related: LGBTQ+ manga
related: Yaoi

Queer coding
type: Concept
issued: 2022-07-04
modified: 2025-02-23
comment: Purposeful subtextual coding of a character or relationship in a piece of media as queer. Queer coding is distinct from the practice of queerbaiting in that the queer codes are intentionally present rather than falsely implied and are not typically used as a marketing tactic.
comment: Codificación subtextual intencionada de un personaje o de una relación en una pieza mediática como queer. La codificación queer se diferencia de la práctica del queerbaiting en que los códigos queer están presentes intencionalmente en lugar de implícitos falsamente y no suelen utilizarse como táctica de marketing.
alternative label: Queercoding
change note: Version 4.2.0
in scheme: v3
preferred label: Codificación queer
related: Handkerchief codes
related: LGBTQ+ literature
related: Reading (Gender)
related: Reading (LGBTQ+ culture)
related: Queerbaiting

Slash fiction
type: Concept
issued: 2022-07-04
modified: 2025-02-23
comment: Fanfiction focusing on sexual or romantic relationships between characters of the same sex or gender that is typically erotic or pornographic in nature. Historically used for male-male couples only, but is now used more broadly; includes femslash fiction.
comment: Fanficción que se centra en relaciones sexuales o románticas entre personajes del mismo sexo o género y que suele ser de naturaleza erótica o pornográfica. Históricamente se utilizaba únicamente para parejas de hombres, pero ahora se utiliza de forma más amplia; incluye ficción femslash.
alternative label: Slash fan fics
alternative label: Slash fan fiction
alternative label: Slash fanfiction
alternative label: Slash fic
alternative label: Fan ficción slash
alternative label: Fan fic slash
alternative label: Fanfiction slash
alternative label: Fanfic slash
broader: Fanfiction
broader: Slash fandom
broader: Slash fanworks
change note: Version 4.2.0
has top concept: Subcultures
in scheme: v3
narrower: Original slash fiction
narrower: Real person fiction
preferred label: Ficción slash
related: LGBTQ+ erotic literature

Polygamous people
type: Concept
issued: 2022-09-09
modified: 2025-02-23
comment: Individuals who engage in relationships in which the dominant partner has multiple spouses, though the marriages are not typically recognized by society or law.
comment: Personas que entablan relaciones en las que la pareja dominante tiene múltiples cónyuges, aunque los matrimonios no suelen ser reconocidos por la sociedad o la ley.
broader: Relationship minorities
change note: Version 4.2.0
has top concept: Relationship minorities
in scheme: v3
preferred label: Personas polígamas
related: Partner preference
related: Polyamory
related: Polygamy
related: Hierarchical non-monogamy
related: Non-monogamy

Womanism
type: Concept
issued: 2022-11-08
modified: 2025-02-23
comment: A social theory based on the history and everyday experiences of Black women. Womanism grew out of the perceived indifference of the feminist movement towards the needs of Black women, who are often excluded from the categories of "female" and "femininity" as understood by white feminists. At the core of womanism is the idea that mainstream feminism is a movement led by white women to serve white women's goals, which can be indifferent or even oppositional to the needs of Black women.
comment: Una teoría social basada en la historia y las experiencias cotidianas de las mujeres negras. El mujerismo surgió de la indiferencia percibida del movimiento feminista hacia las necesidades de las mujeres negras, que a menudo están excluidas de las categorías de "femenino" y "feminidad" tal como las entienden las feministas blancas. Al centro del mujerismo está la idea de que el feminismo dominante es un movimiento liderado por mujeres blancas para servir a los objetivos de las mujeres blancas, que pueden ser indiferentes o incluso opuestos a las necesidades de las mujeres negras.
alternative label: Womanist theory
alternative label: Teoria mujerista
broader: Theories
change note: Version 4.2.0
has top concept: Theories
in scheme: v3
preferred label: Mujerismo
related: Intersectionality
related: Racism
related: Black feminism
related: White feminism
related: Womanists

Megasexual fiction
type: Concept
issued: 2023-04-11
modified: 2025-02-23
comment: Written works describing imagined events or people; use in reference to fictional works focusing on megasexual characters or themes.
comment: Obras escritas que describen eventos o personas imaginadas; utilícese en referencia a obras de ficción que se centran en personajes o temas megasexuales.
broader: LGBTQ+ fiction
change note: Version 4.2.0
has top concept: Subcultures
in scheme: v3
preferred label: Ficción megasexual
related: Bisexual literature
related: Bisexual people in fandom
related: Megasexual authors
related: Megasexual literature
related: Megasexual poetry

Queercrip
type: Concept
issued: 2023-04-12
modified: 2025-02-23
comment: A portmanteau of two reclaimed terms (queer and crip) used to indicate that a person or a thing belongs to both queer and crip communities, often used to indicate unity or shared struggles. This term may also appear as "cripqueer" to emphasize the crip identity before the queer one.
comment: La unión de dos términos reclamados ("queer" y "crip") utilizados para indicar que una persona o cosa pertenece tanto a comunidades queer como crip, a menudo utilizado para indicar unidad o luchas compartidas. Este término también puede aparecer como "cripqueer" para enfatizar la identidad crip antes que la queer.
alternative label: Cripqueer
broader: Reclaimed terms
change note: Version 4.2.0
has top concept: LGBTQ+ slang
in scheme: v3
related: Queer (Verb)
related: Queer people
related: LGBTQ+ disabled people
related: LGBTQ+ people with chronic illnesses
related: Crip

Two-Spirit activism
type: Concept
issued: 2023-06-26
modified: 2025-04-23
comment: Direct action and organizing to achieve political or social change and acceptance for Two-Spirit people.
comment: Acción directa y organización para lograr cambio político o social y la aceptación de las personas dos espíritus.
alternative label: 2S activism
alternative label: Two Spirit activism
alternative label: Two Spiritied activism
alternative label: Two-Spirited activism
change note: Version 4.2.0
in scheme: v3
narrower: Two-Spirit demonstrations
preferred label: Activismo dos espíritus
related: LGBTQ+ activism
related: Two-Spirit political activists
related: Two-Spirit political groups

Two-Spirit artists
type: Concept
issued: 2023-06-26
modified: 2025-04-23
comment: Two-Spirit people who practice any of various creative arts.
comment: Artistas que son dos espíritus.
alternative label: 2S artists
alternative label: Two Spirit artists
alternative label: Two Spirited artists
alternative label: Two-Spirited artists
broader: Two-Spirit people
change note: Version 4.2.0
has top concept: Gender
in scheme: v3
narrower: Two-Spirit painters
narrower: Two-Spirit photographers
narrower: Two-Spirit cartoonists
narrower: Two-Spirit makeup artists
preferred label: Artistas dos espíritus
related: LGBTQ+ artists

Indigenous asexual people
type: Concept
issued: 2023-06-30
modified: 2025-02-23
comment: Asexual people who are part of an Indigenous people, or culturally distinct ethnic group whose members are directly descended from the earliest known inhabitants of a particular region and, to some extent, maintain the language and culture of those people. Only use to describe people who identify as Indigenous; use more specific terms whenever possible.
comment: Personas asexuales que forman parte de un pueblo indígena o grupo étnico culturalmente distinto cuyos miembros descienden directamente de los primeros habitantes conocidos de una región en particular y, hasta cierto punto, mantienen el idioma y la cultura de ese pueblo. Utilícese únicamente para describir a personas que se autoidentifiquen como indígenas; utilícese términos más específicos siempre que sea posible.
alternative label: Asexual Indigenous people
alternative label: Personas indígenas asexuales
broader: Indigenous LGBTQ+ people
change note: Version 4.2.0
has top concept: LGBTQ+ people
in scheme: v3
narrower: Inuit asexual people
narrower: Kānaka Maoli asexual people
narrower: Native American asexual people
narrower: Pacific Islander American asexual people
narrower: Papuan asexual people
preferred label: Personas asexuales indígenas

Pup play
type: Concept
issued: 2023-12-18
modified: 2025-02-23
comment: The act of roleplaying as a canine, sometimes with someone acting as a trainer, handler or pet owner, for fun or erotic enjoyment.
comment: El acto de jugar a un rol como un canino, a veces con una persona que actúa como entrenadora, cuidadora o dueña de una mascota, por diversión o disfrute erótico.
alternative label: Leatherpups
broader: Leather community
broader: Animal roleplay
broader: Leather people
change note: Version 4.2.0
has top concept: LGBTQ+ communities
in scheme: v3
preferred label: Juego de cachorros
related: Pups (Roleplay)
related: Gas masks (Erotic)
related: Masks (Erotic)

Shoe fetish
type: Concept
issued: 2023-12-20
modified: 2025-02-23
comment: Eroticization of shoes such as high heels and boots.
comment: Erotización de zapatos, tales como tacones y botas.
alternative label: Shoe kink
alternative label: Fetiche de zapatos
broader: BDSM
change note: Version 4.2.0
has top concept: Eroticism
in scheme: v3
narrower: Boot fetish
narrower: High heel fetish
preferred label: Retifismo
related: Bootblacking
related: Uniform fetish
related: Foot fetish

Dollification
type: Concept
issued: 2023-12-20
modified: 2025-02-23
comment: A practice of dressing and acting like a living doll (through makeup, dressing, etc.) for aesthetic or sexual gratification.
alternative label: Rubber dolling
change note: Version 4.2.0
in scheme: v3
related: Crossdressing
related: Gender expression
related: Rubber and latex fetish
related: Erotic hypnosis
related: Dehumanization (Erotic)

Breast torture
type: Concept
issued: 2023-12-20
modified: 2025-02-23
comment: A kink activity where intense sensation, pain, or constriction is applied to the breasts.
comment: Una actividad kink en la que se aplica sensación, dolor o constricción intensa a los senos.
alternative label: Boob torture
alternative label: Tit torture
alternative label: Tortura de mamas
alternative label: Torturas de pechos
broader: Sadomasochism
broader: Breast play
change note: Version 4.2.0
has top concept: Eroticism
in scheme: v3
preferred label: Tortura de senos
related: Breast
related: Nipple play
related: Breast fetish

Chest play
type: Concept
issued: 2023-12-20
modified: 2025-02-23
comment: A gender-inclusive term for any sexual activity involving the the upper area of the torso, including fondling/groping, kissing, licking, rubbing, pinching, or squeezing/constricting.
comment: Un término inclusivo de género para cualquier actividad sexual que involucre el área superior del torso, incluyendo acariciar/manosear, besar, lamer, frotar, pellizcar o apretar/constreñir.
broader: Sex (Act)
broader: Sexual practices
change note: Version 4.2.0
has top concept: Sex (Act)
in scheme: v3
narrower: Nipple play
preferred label: Juego de pecho
related: Breast
related: Chest
related: Breast play

Drag shows
type: Concept
issued: 2024-06-19
modified: 2025-02-23
comment: Performances by a single drag performer or a group of drag performers, which often include singing or lip syncing, dance routines, and comedy skits.
alternative label: Drag performances
broader: Europride
change note: Version 4.2.0
has top concept: Europride
in scheme: v3
related: Drag
related: Drag bars
related: Drag performers
related: Female impersonation shows
related: Male impersonation shows

Reproductive health care for Two-Spirit people
type: Concept
issued: 2024-06-19
modified: 2026-03-05
comment: Access to and experiences with reproductive health care for Two-Spirit people. Reproductive health care includes birth control, abortion, assisted reproduction, and prenatal and obstetric care.
alternative label: 2S reproductive health care
alternative label: Reproductive health care for 2S people
alternative label: Reproductive health care for Two Spirit people
alternative label: Reproductive health care for Two Spirited people
alternative label: Reproductive health care for Two-Spirited people
alternative label: Two Spirit reproductive health care
alternative label: Two Spirited reproductive health care
alternative label: Two-Spirited reproductive health care
change note: Version 4.2.0
in scheme: v3
related: Reproductive health care for LGBTQ+ people
related: Abortion access for LGBTQ+ people
related: Abortion counseling for LGBTQ+ people
related: Abortion services for LGBTQ+ people
related: LGBTQ+ abortion seekers

Gentrification
type: Concept
issued: 2024-10-22
modified: 2025-02-23
comment: A process of economic and demographic change within a historically disinvested neighborhood by means of real estate investment and an influx of new, higher-income residents, typically resulting in the displacement of long-time, lower-income residents.
change note: Version 4.2.0
in scheme: v3
related: LGBTQ+ discrimination
related: Anti-Blackness
related: Anti-kink discrimination
related: Racism
related: Redlining

Criminalization of sex work
type: Concept
issued: 2024-10-30
modified: 2025-02-23
comment: The process by which the practice and solicitation of sex work is made criminal, typically by introducing laws, regulations, and criminal penalties. Efforts to criminalize sex work often target street sex work and other forms of "direct," visible sex work.
alternative label: Sex work criminalization
alternative label: Criminalization of prostitution
alternative label: Prostitution criminalization
broader: Criminalization
change note: Version 4.2.0
has top concept: Law
in scheme: v3
preferred label: Criminalisation of sex work
related: Sex work legislation
related: Decriminalization of sex work
related: Legalization of sex work
related: Nordic model (Sex work)
related: Sex work abolition

Decriminalization of sex work
type: Concept
issued: 2024-10-30
modified: 2025-02-23
comment: The process of lessening or removing laws, regulations, and/or criminal penalties targeting the practice, solicitation, and/or facilitation of sex work. Decriminalization efforts may variously address the actions of sex workers, their clients, third parties, and/or other individuals who work in proximity to or seek to aid sex workers.
alternative label: Sex work decriminalization
alternative label: Decriminalization of prostitution
alternative label: Prostitution decriminalization
broader: Decriminalization
change note: Version 4.2.0
has top concept: Law
in scheme: v3
preferred label: Decriminalisation of sex work
related: Sex work legislation
related: Criminalization of sex work
related: Legalization of sex work
related: Nordic model (Sex work)
related: Sex work abolition

Sex work abolition
type: Concept
issued: 2024-10-30
modified: 2025-02-23
comment: A movement to abolish sex work through a variety of different means, including supporting "end demand" laws, the Nordic model, or the broader criminalization of sex work; organizing and speaking vocally against sex work as inherently exploitative; and rejecting efforts to recognize sex work as labor.
alternative label: Abolition movement (Sex work)
alternative label: Sex work abolitionism
alternative label: Sex work abolition movement
change note: Version 4.2.0
in scheme: v3
narrower: Nordic model (Sex work)
related: Criminalization of sex work
related: Decriminalization of sex work
related: Anti-sex work feminism
related: Legalization of sex work

LGBTQ+ abortion seekers
type: Concept
issued: 2026-02-24
modified: 2026-03-03
comment: LGBTQ+ people seeking abortion services including both in-clinic abortion (also known as a surgical abortion) and medication abortion (also referred to as the abortion pill).
alternative label: LGBTQ+ abortion applicants
broader: LGBTQ+ people
change note: Version 4.2.0
has top concept: LGBTQ+ people
in scheme: v4
related: Abortion access for LGBTQ+ people
related: Reproductive health care for LGBTQ+ people
related: Reproductive health care for Two-Spirit people
related: Abortion
related: Abortion funds

Androgyny
type: Concept
issued: 2019-05-14
modified: 2025-02-23
replaces: androgyny
comment: The combination of masculine and feminine characteristics.
comment: La combinación de características masculinas y femeninas.
broader: Gender expression
change note: Version 4.2.0
has top concept: Gender
in scheme: v3
preferred label: Androginia
related: Androgynous people
related: Femininities
related: Gender bending
related: Gender roles
related: Masculinities
related: Gender creative

Rimming
type: Concept
issued: 2019-05-14
modified: 2025-02-23
replaces: rimming
comment: Sexual stimulation of the anus by the tongue or mouth.
comment: Acto sexual que implica el uso de la boca y la lengua para estimular el ano y el recto.
alternative label: Analingus
alternative label: Anilingus
broader: Anal play
broader: Licking
broader: Sex (Act)
broader: Sexual practices
change note: Version 4.2.0
has top concept: Sex (Act)
in scheme: v3
preferred label: Beso negro
related: Anal fisting
related: Anal sex
related: Oral sex

Kink community
type: Concept
issued: 2019-05-14
modified: 2025-02-23
replaces: BDSMCommunity
comment: A broad term including all communities of people interested in kinks and fetishes, including or overlapping with certain subcultures such as the leather community and rubber and latex communities.
comment: Un término general que incluye a todas las comunidades de personas interesadas en kinks y fetiches, incluyendo o coincidiendo con ciertas subculturas tales como la comunidad de cuero y las comunidades de goma y latex.
alternative label: Comunidad de kink
broader: LGBTQ+ communities
change note: Version 4.2.0
has top concept: LGBTQ+ communities
in scheme: v3
preferred label: Comunidad kink
related: LGBTQ+ dominatrices
related: BDSM
related: Leather community
related: Switches (Sex)
related: Tops (Sex)
related: Kinky people

LGBTQ+ beaches
type: Concept
issued: 2019-05-14
modified: 2025-02-23
replaces: beachesLGBTQ
comment: Beaches set aside for use by LGBTQ+ people or beaches known to be frequented by LGBTQ+ people.
comment: Playas reservadas para el uso de personas LGBTQ+ o playas conocidas por ser frecuentadas por personas LGBTQ+.
alternative label: Beaches (LGBTQ)
alternative label: Playas (LGBTQ)
broader: LGBTQ+ meeting places
change note: Version 4.2.0
has top concept: LGBTQ+ meeting places
in scheme: v3
narrower: Bisexual beaches
narrower: Gay beaches
narrower: Lesbian beaches
narrower: Nude beaches
narrower: Queer beaches
narrower: Transgender beaches
preferred label: Playas LGBTQ+

Bisexuality
type: Concept
issued: 2019-05-14
modified: 2025-02-23
replaces: bisexuality
comment: Sexual identity that is defined as attraction to more than one gender; follow the individual's preference for bisexuality, pansexuality, or polysexuality whenever possible.
comment: Identidad sexual que se define como atracción hacia más de un género; siga la preferencia de la persona sobre el uso de bisexualidad, pansexualidad o polisexualidad siempre que sea posible
broader: Sexual orientation
broader: Polysexuality
change note: Version 4.2.0
has top concept: Sexual orientation
in scheme: v3
narrower: Bicuriosity
preferred label: Bisexualidad
related: Bisexual people
related: Homosexuality
related: Lesbianism
related: Polysexual people

Body adornment
type: Concept
issued: 2019-05-14
modified: 2025-02-23
replaces: bodyAdornments
comment: Decoration or alteration of the human body for aesthetic or cultural purposes; includes body paint, tattooing, piercing, and scarification.
comment: Decoración o alteración del cuerpo humano con fines estéticos o culturales; incluye la pintura corporal, los tatuajes, las perforaciones y las escarificaciones.
alternative label: Body decoration
alternative label: Body alteration
alternative label: Body modification
alternative label: Alteraciones corporales
alternative label: Decoración corporal
alternative label: Modificaciones corporales
alternative label: Adornos corporales
alternative label: Ornamentación corporal
change note: Version 4.2.0
in scheme: v3
narrower: Piercings
narrower: Tattoos
preferred label: Adornamentos del cuerpo
related: Collars
related: Body modification

Bois
type: Concept
issued: 2019-05-14
modified: 2025-03-20
replaces: bois
comment: Slang for young masculine or transmasculine people. The term is commonly used in lesbian communities.
comment: Jerga para jóvenes masculinos o transmasculinos. El término se utiliza comúnmente en comunidades lesbianas.
change note: Version 4.2.0
in scheme: v3
related: Butches
related: Female masculinity
related: Lesbians
related: Lesbian slang
related: Transmasculine people
related: Masculine of center

Butch-femme relationships
type: Concept
issued: 2019-05-14
modified: 2025-02-23
replaces: butchFemmeRelationships
comment: Romantic, sexual, or play relationships between a masculine-identifying or -presenting person and a feminine-identifying or -presenting person. Though the terms "butch" and "femme" are most commonly used in lesbian communities, they are also used by other LGBTQ+ people. Only use to describe relationships between individuals who self-identify as butch and femme.
comment: Relaciones románticas, sexuales o de juego entre una persona que se autoidentifica o presenta como masculina y una persona que se autoidentifica o presenta como femenina. Aunque los términos "butch" y "femme" se utilizan con mayor frecuencia en las comunidades de lesbianas, también los utilizan otras personas LGBTQ+. Utilícese únicamente para describir relaciones entre personas que se autoidentifiquen como marimacho y mujer.
alternative label: Relaciones bucha-femme
alternative label: Relaciones butch-femme
broader: Lesbian culture
broader: Relationship satisfaction
change note: Version 4.2.0
has top concept: Subcultures
in scheme: v3
preferred label: Relaciones marimacha-femme
related: Butches
related: Femmes
related: Role behavior
related: Sexual identity
related: Stone butches

Child custody
type: Concept
issued: 2019-05-14
modified: 2025-02-23
replaces: childCustody
comment: Legal term for the guardianship of a child, or the legal and practical relationship between a parent and a child in their care. Typically used to describe legal custody, which is the right to make decisions about the child, as well as physical custody, which is the right and duty to house, provide, and care for the child.
comment: Término legal para la tutela de un niño, o la relación legal y práctica entre un padre y un niño bajo su cuidado. Normalmente se utiliza para describir la custodia legal, que es el derecho a tomar decisiones sobre el niño, así como la custodia física, que es el derecho y el deber de albergar, proveer y cuidar del niño.
alternative label: Guardianship
alternative label: Parental custody
alternative label: Tutelage
alternative label: Tutela
alternative label: Custodia parental
change note: Version 4.2.0
in scheme: v3
preferred label: Custodia de niños
related: Children
related: LGBTQ+ adoption
related: LGBTQ+ divorce
related: LGBTQ+ foster families
related: LGBTQ+ personal and family law
related: LGBTQ+ separation

Clitoral sex
type: Concept
issued: 2019-05-14
modified: 2025-02-23
replaces: clitoralSex
comment: Sexual acts involving the clitoris.
comment: Actos sexuales que involucran el clítoris.
broader: Sex (Act)
broader: Sexual practices
change note: Version 4.2.0
has top concept: Sex (Act)
in scheme: v3
narrower: Cunnilingus
narrower: Fucking
narrower: Clit twisting
preferred label: Sexo clitoriano
related: Clitoris
related: Vaginal sex

Cottaging (Gay culture)
type: Concept
issued: 2019-05-14
modified: 2025-02-23
replaces: cottaging
comment: UK slang term commonly used in gay communities to describe the practice of engaging in anonymous sex in a public bathroom or cruising for sexual partners there.
comment: Término de la jerga británica comúnmente utilizado en las comunidades gay para describir la práctica de tener relaciones sexuales anónimas en un baño público o buscar parejas sexuales allí.
alternative label: Cottaging
broader: Sex (Act)
broader: Sexual practices
change note: Version 4.2.0
has top concept: Sex (Act)
in scheme: v3
preferred label: Cottaging (Cultura gay)
related: Anonymous sex
related: Cottages (Gay culture)
related: Cruising (LGBTQ+ culture)
related: Public sex
related: Tearoom sex

Cum
type: Concept
issued: 2019-05-14
modified: 2025-03-20
replaces: cum
comment: Body fluids produced by sexual arousal and orgasm.
comment: Término coloquial para referirse al semen (o, con menos frecuencia, al fluido vaginal) eyaculado durante el orgasmo.
preferred label: Semen
alternative label: Leche
alternative label: Lefa
broader: Body fluids
change note: Version 4.2.0
has top concept: Body fluids
in scheme: v3
related: Getting off
related: Happy endings
related: Jizz
related: Sexual excitement
related: Sexual climax
related: Bukkake

Diversity
type: Concept
issued: 2019-05-14
modified: 2025-02-23
replaces: diversity
comment: Diversity in characteristics of people in age, gender, religion, ethnicity, sexual orientation, lifestyle, etc.
comment: Diversidad en las características de las personas en cuanto a edad, género, religión, etnicidad, orientación sexual, estilo de vida, etc.
change note: Version 4.2.0
in scheme: v3
narrower: Gender diversity
narrower: Sexual diversity
preferred label: Diversidad
related: Intersectionality

Domestic partnership contracts
type: Concept
issued: 2019-05-14
modified: 2025-02-23
replaces: domesticPartnershipContracts
comment: Agreements, legal or otherwise, between two unmarried people in a domestic partnership that define property rights and support obligations if the relationship ends or if one partner dies.
comment: Acuerdos, legales o de otro tipo, entre dos personas no casadas en una pareja de hecho que definen los derechos de propiedad y respaldan las obligaciones si la relación termina o si una de las parejas muere.
alternative label: Contratos de uniones de hecho
broader: Official documentation
change note: Version 4.2.0
has top concept: Legal status
in scheme: v3
preferred label: Contratos de parejas de hecho
related: Domestic partnership retirement benefits
related: Domestic partnerships
related: LGBTQ+ personal and family law
related: LGBTQ+ weddings
related: Living arrangements
related: Marriage

Domestic partnerships
type: Concept
issued: 2019-05-14
modified: 2025-02-23
replaces: domesticPartnerships
comment: Legal or personal relationships between individuals who live together and share their lives but are not married or joined by civil union.
comment: Relaciones jurídicas o personales entre personas que viven juntas y comparten sus vidas pero que no están casadas ni unidas por unión civil.
alternative label: Uniones de hecho
alternative label: Emparejamiento doméstico
alternative label: Asociación libre
broader: Living arrangements
change note: Version 4.2.0
has top concept: Living arrangements
in scheme: v3
preferred label: Parejas de hecho
related: Civil unions
related: Domestic partnership contracts
related: Marriage
related: Official documentation
related: Relationship satisfaction
related: Significant others

Driver's licenses
type: Concept
issued: 2019-05-14
modified: 2025-03-20
replaces: driversLicenses
comment: Legal documents authorizing individuals to operate motor vehicles; commonly used as legal proof of identity; can be used in reference to LGBTQ+ people seeking driver's licenses or changes to existing licenses (e.g., name, gender or sex marker, photo).
comment: Documentos legales que autorizan a personas a operar vehículos de motor; comúnmente utilizado como prueba legal de identidad; se puede utilizar en referencia a personas LGBTQ+ que buscan licencias de conducir o cambios en las licencias existentes (por ejemplo, nombre, género o marcador de sexo, foto).
alternative label: Carnet de conducir
alternative label: Licencia de manejar
alternative label: Carnet de manejo
alternative label: Licencia de manejo Carné de conducir
alternative label: Carné de manejar
alternative label: Carné de manejo||
broader: Official documentation
change note: Version 4.2.0
has top concept: Legal status
in scheme: v3
narrower: Gender markers
preferred label: Licencias de conducir
related: Legal name change
related: Court orders
related: Medical practitioners' statements
related: Social security cards
related: Transitioning (Gender)

LGBTQ+ people who use substances
type: Concept
issued: 2019-05-14
modified: 2025-04-24
replaces: drugUsers
comment: Umbrella term for LGBTQ+ people who use substances (that are typically deemed harmful or are subject to legal restriction, such as drugs or alcohol) for any reason. Apply more specific terms if possible.
comment: Término general para las personas LGBTQ+ que utilizan sustancias (que suelen ser consideradas nocivas o están sujetas a restricciones legales, como las drogas o el alcohol) por cualquier motivo. Aplique términos más específicos de ser posible.
alternative label: Drug users (LGBTQ)
alternative label: LGBTQ+ people who drink
alternative label: LGBTQ+ people who use drugs
alternative label: Substance users (LGBTQ)
broader: LGBTQ+ people
change note: Version 4.2.0
has top concept: LGBTQ+ people
in scheme: v3
narrower: Party drugs
narrower: Alcoholics
narrower: LGBTQ+ people with addictions
narrower: LGBTQ+ people who use substances for medical purposes
preferred label: Personas LGBTQ+ que utilizan sustancias
related: Two-Spirit people who use substances

Internalized homophobia
type: Concept
issued: 2019-05-14
modified: 2025-02-23
replaces: internalisedHomophobia
comment: This term is often used to describe internalized oppression held by and about LGBTQ+ people in general. It can also describe the more specific phenomenon in which gay men internalize or adopt homophobic beliefs (i.e., negative perceptions of and intolerance toward gay men and homosexuality) as a result of being raised or socialized within a homophobic environment or culture.
comment: Este término se utiliza a menudo para describir la opresión internalizada sostenida por y sobre las personas LGBTQ+ en general. También puede describir el fenómeno más específico a través del cual los hombres gay internalizan o adoptan creencias homofóbicas (es decir, percepciones negativas e intolerancia hacia los hombres gay y la homosexualidad) como resultado de haber sido criados o socializados dentro de un entorno o una cultura homofóbica.
alternative label: Ego-dystonic homophobia
broader: Homophobia
broader: Internalized oppression
change note: Version 4.2.0
has top concept: LGBTQ+ phobia
in scheme: v3
narrower: Lateral homophobia
preferred label: Homofobia internalizada
preferred label: Internalised homophobia
related: Denial of sexual orientation
related: Ego-dystonic sexual orientation
related: Latent homosexuality
related: LGBTQ+ self-repression

Gay clergy
type: Concept
issued: 2019-05-14
modified: 2025-02-23
replaces: gayClergy
comment: Gay men who are ordained for religious duties, particularly in the Christian Church.
comment: Hombres gay ordenados para deberes religiosos, particularmente en la Iglesia cristiana.
alternative label: Gay pastors
alternative label: Pastores gay
broader: LGBTQ+ clergy
change note: Version 4.2.0
has top concept: LGBTQ+ clergy
in scheme: v3
narrower: Gay priests
preferred label: Clero gay
related: Bisexual clergy
related: Celibacy
related: Lesbian clergy
related: Queer clergy
related: Transgender clergy

Gay liberation
type: Concept
issued: 2019-05-14
modified: 2026-02-24
replaces: gayLiberation
comment: Movement of the late 1960s and early to mid 1970s that urged lesbians and gay men to “come out" and publicly reveal their sexuality to family, friends, and colleagues as a form of activism and as a means of countering shame with pride.
comment: Movimiento de finales de la década de 1960 y principios y mediados de la década de 1970 que instaba a lesbianas y hombres gay a “salir del clóset” y revelar públicamente su sexualidad a familiares, amistades y colegas como una forma de activismo y como un medio para contrarrestar la vergüenza con orgullo.
alternative label: Gay liberation movement
alternative label: Movimiento de liberación gay
broader: LGBTQ+ social processes
change note: Version 4.2.0
has top concept: LGBTQ+ social processes
in scheme: v3
preferred label: Liberación gay
related: Gay movement
related: Lesbian liberation
related: Lesbian movement
related: LGBTQ+ emancipation
related: Stonewall riots
related: Homophile movement

Gay press
type: Concept
issued: 2019-05-14
modified: 2026-02-24
replaces: gayPress
comment: Newspapers, magazines, or other publishing outlets aimed at gay audiences and/or operated by gay men.
comment: Periódicos, revistas u otros medios editoriales dirigidos a audiencias gay y/o operados por hombres gay.
broader: LGBTQ+ press
change note: Version 4.2.0
has top concept: LGBTQ+ press
in scheme: v3
narrower: Gay newsletters
narrower: Gay newspapers
narrower: Gay zines
preferred label: Prensa gay
related: Gay movement
related: LGBTQ+ magazines
related: Homophile movement

Gender diversity
type: Concept
issued: 2019-05-14
modified: 2025-02-23
replaces: genderDiversity
comment: An umbrella term encompassing a range of gender identities.
comment: Un término general que abarca una variedad de identidades de género.
broader: Diversity
change note: Version 4.2.0
has top concept: Diversity
in scheme: v3
preferred label: Diversidad de género
related: Gender
related: Gender expression
related: Gender identity
related: Non-binary people
related: Transgender people
related: Gender minorities

Gender relations
type: Concept
issued: 2019-05-14
modified: 2025-02-23
replaces: genderRelations
comment: The culturally specific rights, responsibilities, and connections afforded to individuals or communities of one gender by individuals or communities of another gender.
comment: Los derechos, responsabilidades y las conexiones culturalmente específicas otorgados a personas o comunidades de un género por personas o comunidades de otro género.
broader: LGBTQ+ social processes
change note: Version 4.2.0
has top concept: LGBTQ+ social processes
in scheme: v3
narrower: Lesbian-gay relations
preferred label: Relaciones de género
related: Gender
related: Gender roles
related: Gender segregation
related: Lesbian separatism
related: Gender role stereotypes

Gestational parenthood
type: Concept
issued: 2019-05-14
modified: 2025-02-23
replaces: gestationalParenthood
comment: The experience of parenthood as felt by a person whose uterus was utilized to nurture and develop an embryo into a baby.
comment: La experiencia de la paternidad y/o maternidad tal como la siente una persona cuyo útero fue utilizado para nutrir y desarrollar un embrión hasta convertirlo en un bebé.
alternative label: Maternidad gestacional
alternative label: Paternidad gestacional
broader: Biological parenthood
broader: LGBTQ+ biological parents
change note: Version 4.2.0
has top concept: LGBTQ+ families
in scheme: v3
narrower: Birth parents
narrower: Surrogacy
preferred label: Maternidad y paternidad gestacional
related: Genetic parenthood
related: Gestational surrogacy
related: Surro babies

Getting off
type: Concept
issued: 2019-05-14
modified: 2025-03-20
replaces: gettingOff
comment: Slang term for the act of experiencing erotic or sexual pleasure, typically referring to an orgasm.
comment: Término de la jerga para el acto de experimentar placer erótico o sexual, que generalmente se refiere a un orgasmo.
alternative label: Pajearse
alternative label: Correrse||
change note: Version 4.2.0
in scheme: v3
preferred label: Venirse
related: Cum
related: Happy endings
related: Jizz
related: Masturbation
related: Sexual excitement
related: Sexual climax

Goldilocks (Gay culture)
type: Concept
issued: 2019-05-14
modified: 2025-02-23
replaces: goldilocks
comment: US slang term for heterosexual women who are friends with gay men in the bear community and socialize in bear spaces.
comment: Término de la jerga estadounidense para mujeres heterosexuales que son amigas de hombres gay en la comunidad de osos y socializan en espacios para osos.
alternative label: Goldilocks
alternative label: Mariliendres
broader: Heterosexual women
change note: Version 4.2.0
has top concept: Heterosexuals
in scheme: v3
preferred label: Ricitos de oro (cultura gay)
related: Bears (Gay culture)
related: Dutch boys
related: Fag hags
related: Friendships
related: Social privilege
related: Beards (Gay culture)

Group sex
type: Concept
issued: 2019-05-14
modified: 2025-02-23
replaces: groupSex
comment: Sexual activities involving multiple people, usually understood to be more than three people.
comment: Actividades sexuales en las que participan múltiples personas, dándose a entender que usualmente son más de tres personas.
alternative label: Orgies
alternative label: Orgías
broader: Sexual practices
change note: Version 4.2.0
has top concept: Sexual practices
in scheme: v3
narrower: Bukkake
preferred label: Sexo en grupo
related: Casual sex
related: Polyamory
related: Polygamy
related: Sex parties
related: Sexuality

Happy endings
type: Concept
issued: 2019-05-14
modified: 2025-03-20
replaces: happyEndings
comment: Term used in the context of sex work to describe a massage that ends with the masseuse giving the client an orgasm.
comment: Término utilizado en el contexto del trabajo sexual para describir un masaje que termina con el o la masajista dándole al cliente un orgasmo.
change note: Version 4.2.0
in scheme: v3
preferred label: Finales felices
related: Cum
related: Erotic massage
related: Getting off
related: Jizz
related: Sexual excitement
related: Sexual climax

Homophobia
type: Concept
issued: 2019-05-14
modified: 2025-02-23
replaces: homophobia
comment: Antagonism or disgust directed towards homosexuality as an identity or men who are perceived to be or are actually gay. Homophobia can include denial of the existence of homosexuality, stereotypes, verbal harassment, and physical violence. This term is often used colloquially to encompass all LGBTQ+ phobia.
comment: Antagonismo o disgusto dirigido hacia la homosexualidad como identidad o hacia los hombres que son percibidos como o que realmente son gay. La homofobia puede incluir la negación de la existencia de la homosexualidad, los estereotipos, el acoso verbal y la violencia física. Este término se utiliza a menudo de forma coloquial para abarcar toda la fobia LGBTQ+.
broader: LGBTQ+ phobia
change note: Version 4.2.0
has top concept: LGBTQ+ phobia
in scheme: v3
narrower: Internalized homophobia
narrower: Homophobia in fandom
preferred label: Homofobia
related: Anti-gay discrimination
related: Anti-gay violence
related: Gay men
related: Heterosexism

Intersexphobia
type: Concept
issued: 2019-05-14
modified: 2025-02-23
replaces: intersexphobia
comment: Antagonism or disgust directed toward intersex people or intersex variations. Intersexphobia can include the denial of the existence of intersex people, insistence that intersex variations should be forcibly "corrected," stereotypes, verbal harassment, and physical violence.
comment: Antagonismo o disgusto dirigido hacia personas intersex o variaciones intersex. La intersexfobia puede incluir la negación de la existencia de personas intersex, la insistencia en que las variaciones intersex deben "corregirse" a la fuerza, estereotipos, acoso verbal y violencia física.
alternative label: Interphobia
alternative label: Interfobia
broader: LGBTQ+ phobia
change note: Version 4.2.0
has top concept: LGBTQ+ phobia
in scheme: v3
narrower: Internalized intersexphobia
preferred label: Intersexfobia
related: Intersex
related: Heterosexism
related: Intersex genital mutilation
related: Anti-intersex violence
related: Anti-intersex discrimination

Jizz
type: Concept
issued: 2019-05-14
modified: 2025-03-20
replaces: jizz
comment: Slang term for semen; primarily used in the United States.
broader: Body fluids
change note: Version 4.2.0
has top concept: Body fluids
in scheme: v3
related: Cum
related: Getting off
related: Happy endings
related: Sexual excitement
related: Sexual climax
related: Bukkake

Lesbian press
type: Concept
issued: 2019-05-14
modified: 2026-02-24
replaces: lesbianPress
comment: Newspapers, magazines, or other publishing outlets aimed at lesbian audiences and/or operated by lesbians.
comment: Periódicos, revistas u otros medios editoriales dirigidos a audiencias lésbicas y/o operados por lesbianas.
broader: LGBTQ+ press
change note: Version 4.2.0
has top concept: LGBTQ+ press
in scheme: v3
narrower: Lesbian newsletters
narrower: Lesbian newspapers
narrower: Lesbian zines
preferred label: Prensa lésbica
related: Lesbian movement
related: LGBTQ+ magazines
related: Homophile movement

LGBTQ+ choruses
type: Concept
issued: 2019-05-14
modified: 2025-02-23
replaces: LGBTQChoruses
comment: Organized groups of LGBTQ+ people who sing together.
comment: Grupos organizados de personas LGBTQ+ que cantan juntas.
alternative label: LGBTQ choirs
alternative label: LGBTQ choruses
alternative label: Coros LGBTQ
change note: Version 4.2.0
in scheme: v3
narrower: Gay choruses
narrower: Lesbian choruses
preferred label: Coros LGBTQ+
related: LGBTQ+ arts
related: LGBTQ+ clubs and organizations
related: LGBTQ+ musicians

LGBTQ+ death and dying
type: Concept
issued: 2019-05-14
modified: 2025-02-23
replaces: LGBTQDeathAndDying
comment: Experiences related to LGBTQ+ people approaching or having reached the end of their lives.
comment: Experiencias relacionadas con personas LGBTQ+ que se acercan o han llegado al final de sus vidas.
alternative label: LGBTQ death and dying
alternative label: El proceso de morir y la muerte LGBTQ+
change note: Version 4.2.0
in scheme: v3
narrower: LGBTQ+ suicide
preferred label: Morir y la muerte LGBTQ+
related: LGBTQ+ death notices
related: LGBTQ+ obituaries
related: Terminal care (AIDS)
related: AIDS death and dying

LGBTQ+ foster families
type: Concept
issued: 2019-05-14
modified: 2025-02-23
replaces: LGBTQFosterFamilies
comment: Families including foster children in which one or more individuals identify as LGBTQ+.
comment: Familias que incluyen niños de acogida en las que una o más personas se autoidentifican como LGBTQ+.
alternative label: LGBTQ foster families
broader: LGBTQ+ families
change note: Version 4.2.0
has top concept: LGBTQ+ families
in scheme: v3
narrower: LGBTQ+ foster parents
preferred label: Familas de acogida LGBTQ+
related: Child custody
related: LGBTQ+ adoption
related: LGBTQ+ adoptive parenthood
related: LGBTQ+ parenthood
related: LGBTQ+ parents

LGBTQ+ foster parenthood
type: Concept
issued: 2019-05-14
modified: 2025-02-23
replaces: LGBTQFosterParenthood
comment: The experiences involved in foster parenting, as experienced by LGBTQ+ people.
comment: Las experiencias involucradas en la crianza de acogida, tal como las viven las personas LGBTQ+.
alternative label: LGBTQ foster parenthood
alternative label: Maternidad de acogida LGBTQ+
alternative label: Paternidad de acogida LGBTQ+
broader: LGBTQ+ parenthood
change note: Version 4.2.0
has top concept: LGBTQ+ parenthood
in scheme: v3
preferred label: Maternidad y paternidad de acogida LGBTQ+
related: LGBTQ+ families
related: LGBTQ+ adoptive parenthood
related: LGBTQ+ family planning
related: LGBTQ+ social parenthood
related: Motherhood
related: Fatherhood

MtFs
type: Concept
issued: 2019-05-14
modified: 2025-02-23
replaces: MtFs
comment: MtF (male-to-female) is a mostly historical term that has been largely replaced by "trans women." This is due in part to the term’s connection to the medicalisation of transgender people and its assumption that trans women are "born" male and become female (typically through hormones and/or surgery).
comment: MtF (del inglés "male-to-female", traducido como "de hombre a mujer") es un término mayoritariamente histórico que ha sido reemplazado en gran medida por "mujeres trans". Esto se debe en parte a la conexión del término con la medicalización de las personas transgénero y su suposición de que las mujeres trans "nacen" hombres y se vuelven mujeres (generalmente a través de hormonas y/o cirugía).
alternative label: Males transitioning to females
alternative label: MtF transsexuals
alternative label: Male-to-female
alternative label: M2Fs
alternative label: Transsexual women
broader: LGBTQ+ historical terms
broader: Transsexual people
broader: Trans women
change note: Version 4.2.0
has top concept: LGBTQ+ historical terms
in scheme: v3
preferred label: MTFs
related: Estrogen
related: FtMs
related: FtXs
related: MtXs

Manual sex
type: Concept
issued: 2019-05-14
modified: 2025-03-20
replaces: manualSex
comment: Sexual activity involving manual stimulation of erogenous zones using the hands.
comment: Actividad sexual que implica la estimulación manual de zonas erógenas mediante el uso de las manos.
broader: Sex (Act)
broader: Sexual practices
change note: Version 4.2.0
has top concept: Sex (Act)
in scheme: v3
narrower: Fingering
narrower: Wacking off
narrower: Wanking
preferred label: Sexo manual
related: Erotic massage
related: Masturbation

Marriage law
type: Concept
issued: 2019-05-14
modified: 2025-02-23
replaces: marriageLaw
comment: Legal regulations and laws dictating where, when, under what conditions, and who can be legally married in a certain jurisdiction.
comment: Regulaciones legales y leyes que dictan dónde, cuándo, bajo qué condiciones y quiénes pueden casarse legalmente en una determinada jurisdicción.
alternative label: Matrimonial law
alternative label: Ley matrimonial
alternative label: Ley de matrimonio
broader: LGBTQ+ personal and family law
change note: Version 4.2.0
has top concept: Law
in scheme: v3
narrower: Common law marriage
preferred label: Derecho matrimonial
related: Civil unions
related: Marital status
related: Marriage
related: Marriage certificates
related: Marriage licenses

Passports
type: Concept
issued: 2019-05-14
modified: 2025-03-20
replaces: passports
comment: Official documentation issued by a government that certifies the holder’s identity and citizenship, entitling them to travel under to and from other countries.
comment: Documentación oficial emitida por un gobierno que certifica la identidad y ciudadanía de la persona titular, dándole derecho a viajar hacia y desde otros países.
broader: Official documentation
change note: Version 4.2.0
has top concept: Legal status
in scheme: v3
narrower: Gender markers
preferred label: Pasaportes
related: Legal name change
related: LGBTQ+ immigration rights
related: Transitioning (Gender)
related: LGBTQ+ immigrants
related: LGBTQ+ asylum seekers

Fatherhood
type: Concept
issued: 2019-05-14
modified: 2025-02-23
replaces: fatherhood
comment: The experience of acting as a father, including the responsibilities involved in fathering and raising children.
comment: La experiencia de actuar como padre, incluidas las responsabilidades que implica la paternidad y la crianza de los hijos.
alternative label: Paternity
change note: Version 4.2.0
in scheme: v3
preferred label: Paternidad
related: Biological parenthood
related: Fathers
related: LGBTQ+ adoptive parenthood
related: LGBTQ+ family planning
related: LGBTQ+ foster parenthood
related: LGBTQ+ parenthood

Polygamy
type: Concept
issued: 2019-05-14
modified: 2025-02-23
replaces: polygamy
comment: The practice of engaging in romantic, sexual, or play relationships where the dominant partner has multiple spouses, though these marriages are not always recognized by law or within society.
comment: La práctica de entablar relaciones románticas, sexuales o de juego en las que la pareja dominante tiene varios cónyuges, aunque estos matrimonios no siempre son reconocidos por la ley o dentro de la sociedad.
broader: Partner preference
broader: Sexual relationships
change note: Version 4.2.0
has top concept: Sexual preference
in scheme: v3
preferred label: Poligamia
related: Consent
related: Group sex
related: Polyamory
related: Sexual identity
related: Polygamous people

Pornography
type: Concept
issued: 2019-05-14
modified: 2025-03-20
replaces: pornography
comment: Printed or visual materials that explicitly depict sexual acts.
comment: La representación de actos sexuales para que otras personas los vean.
broader: Sex industry
change note: Version 4.2.0
has top concept: Sex industry
in scheme: v3
narrower: Hentai
narrower: LGBTQ+ pornography
preferred label: Pornografía
related: Erotica
related: Porn stars
related: Sexting
related: Bukkake

Public bathrooms
type: Concept
issued: 2019-05-14
modified: 2025-02-23
replaces: publicBathrooms
comment: Rooms or small buildings with one or more toilets (or urinals) available for use by the general public or by customers or employees of a business.
comment: Habitaciones o pequeños edificios con uno o más inodoros (o urinarios) disponibles para el uso del público en general o de clientes o empleados de un negocio.
alternative label: Public restrooms
alternative label: Toilets
alternative label: Baños||
broader: Public facilities
change note: Version 4.2.0
has top concept: Public facilities
in scheme: v3
narrower: Glory holes
preferred label: Baños públicos
related: Anti-transgender discrimination
related: Cottages (Gay culture)
related: Passing (Gender)
related: Bathroom bans
related: Tearooms (Gay culture)

Queer community
type: Concept
issued: 2019-05-14
modified: 2025-02-23
replaces: queerCommunity
comment: Groups of people who share the experience of being queer.
comment: Grupos de personas que comparten la experiencia de ser queer.
broader: LGBTQ+ communities
change note: Version 4.2.0
has top concept: LGBTQ+ communities
in scheme: v3
preferred label: Comunidad queer
related: LGBTQ
related: LGBTQ+
related: LGBTQIA
related: Queer bars
related: 2SLGBTQ+
related: Queer joy

Queer fiction
type: Concept
issued: 2019-05-14
modified: 2026-02-23
replaces: queerFiction
comment: Written works that describe imagined events or people; use in reference to fictional works focusing on queer characters or themes.
comment: Obras escritas que describen eventos o personas imaginadas; utilícese en referencia a obras de ficción que se centran en personajes o temas queer.
broader: LGBTQ+ fiction
change note: Version 4.2.0
has top concept: Subcultures
in scheme: v3
narrower: Queer historical fiction
preferred label: Ficción queer
related: Queer authors
related: Intersex fiction
related: Aromantic fiction
related: Asexual fiction
related: Queer people in fandom

Party drugs
type: Concept
is replaced by: homoit0001235
issued: 2019-05-14
modified: 2022-12-21
modified: 2025-04-24
replaces: partyDrugs
replaces: recreationalDrugUse
comment: The use of substances (that are typically deemed harmful or are subject to legal restriction, such as drugs or alcohol) by LGBTQ+ people for recreational or social purposes.
comment: El uso de sustancias (que suelen considerarse nocivas o que están sujetas a restricciones legales, como las drogas o el alcohol) por parte de personas LGBTQ+ con fines recreativos o sociales.
alternative label: Club drugs
broader: Cocaine
broader: LGBTQ+ people who use substances
change note: Version 4.2.0
has top concept: Cocaine
has top concept: LGBTQ+ people
in scheme: v3
preferred label: LGBTQ+ people who use substances recreationally
preferred label: Personas LGBTQ+ que utilizan sustancias con fines recreativos
related: Chemsex
related: Cocaine
related: Two-Spirit people who use substances for recreational purposes

Rubber and latex fetish
type: Concept
issued: 2019-05-14
modified: 2025-02-23
replaces: rubberSex
comment: Eroticization of rubber, latex, and related materials.
comment: Erotización de la goma, el látex y materiales afines.
alternative label: Rubber and latex sex
alternative label: Rubber sex
alternative label: Rubbersex
alternative label: Fetiche de goma
alternative label: Sexo de goma y látex|
broader: BDSM
broader: Rubber and latex community
broader: Sex (Act)
broader: Sexual practices
broader: LGBTQ+ fashion
change note: Version 4.2.0
has top concept: Eroticism
in scheme: v3
preferred label: Fetiche de goma y látex
related: Inflation (Erotic)
related: Dollification

Rubber and latex community
type: Concept
issued: 2019-05-14
modified: 2025-02-23
replaces: rubberSubculture
comment: Communities of people with an interest in rubber or latex materials for fashion and kink.
comment: Comunidades de personas interesadas en materiales de goma o látex para moda y kink.
alternative label: Rubber subculture
alternative label: Subcultura de goma
broader: LGBTQ+ communities
broader: Subcultures
change note: Version 4.2.0
has top concept: LGBTQ+ communities
in scheme: v3
narrower: Rubber and latex fetish
narrower: Rubbermen
narrower: Rubberwomen
preferred label: Comunidad de goma y látex
related: Leather community
related: Balloon kink

Sexism
type: Concept
issued: 2019-05-14
modified: 2025-02-23
replaces: sexism
comment: Discrimination, prejudice, or bias directed against a particular sex or gender based on the assumption that this sex or gender is intrinsically inferior to another.
comment: Discriminación, prejuicio o predisposición dirigida contra un sexo o género en particular basado en el supuesto de que ese sexo o género es intrínsecamente inferior a otro.
change note: Version 4.2.0
in scheme: v3
preferred label: Sexismo
related: Genderism
related: Heterosexism
related: Sexual harassment
related: Misogyny in fandom
related: Gender-neutral language
related: Patriarchy

Switches (Sex)
type: Concept
issued: 2019-05-14
modified: 2025-02-23
replaces: switches
comment: Slang term for individuals who alternate between being the giving partner and the receiving partner in sexual encounters; typically used as a noun (e.g., "They're a switch").
comment: Término de la jerga para personas que alternan entre ser la pareja que da y la que recibe en encuentros sexuales; normalmente se utiliza como sustantivo (por ejemplo, "Él es versátil").
alternative label: Switches
alternative label: Vers
alternative label: Switch
broader: Sexual identity
broader: Sexual roles
change note: Version 4.2.0
has top concept: Sexual identity
in scheme: v3
preferred label: Versátiles
related: Kink community
related: Bottoms (Sex)
related: Tops (Sex)
related: Vers (Sex)

Black transgender people
type: Concept
issued: 2019-05-14
modified: 2025-02-23
replaces: transgenderBlackPeople
comment: Black people who are transgender. Use only for individuals who self-identity as Black. Follow the individual’s preference for African American or Black whenever possible.
comment: Personas negras que son queer. Utilícese únicamente para personas que seautoidentificancomo negras. Siga la preferencia del individuo para el uso de afroamericanos o negros siempre que sea posible.
alternative label: Transgender Black people
alternative label: Personas negras transgénero
broader: Black LGBTQ+ people
change note: Version 4.2.0
has top concept: LGBTQ+ people
in scheme: v3
narrower: African American transgender people
narrower: Afro-Canadian transgender people
narrower: Afro-Caribbean transgender people
narrower: Afro-European transgender people
narrower: Afro-Latin American transgender people
preferred label: Personas transgénero negras
related: Black Trans Lives Matter movement

Transgender studies
type: Concept
issued: 2019-05-14
modified: 2026-02-24
replaces: transgenderStudies
comment: Academic field of research and study about transgender people, transgender identity, and transgender communities.
comment: Campo académico de investigación y estudio sobre personas transgénero, la identidad transgénero y comunidades transgénero.
broader: Gender studies
broader: LGBTQ+ studies
change note: Version 4.2.0
has top concept: Gender studies
in scheme: v3
preferred label: Estudios transgénero
related: Bisexual studies
related: Gay studies
related: Lesbian studies
related: Queer studies
related: Transgenderism

Vaginal sex
type: Concept
issued: 2019-05-14
modified: 2025-02-23
replaces: vaginalSex
comment: Sexual acts involving the vagina.
comment: Actos sexuales que involucran la vagina.
broader: Sex (Act)
broader: Sexual practices
change note: Version 4.2.0
has top concept: Sex (Act)
in scheme: v3
narrower: Fingering
narrower: Fucking
narrower: Vaginal fisting
preferred label: Sexo vaginal
related: Cunnilingus
related: Clitoral sex

Allosexuality
type: Concept
issued: 2020-06-02
modified: 2025-02-23
replaces: allosexuality
comment: A sexual orientation generally characterized by the occurrence of sexual attraction or the desire for partnered sexual experiences.
comment: Una orientación sexual generalmente caracterizada por la atracción sexual o el deseo de tener experiencias sexuales en pareja.
broader: Sexual orientation
change note: Version 4.2.0
has top concept: Sexual orientation
in scheme: v3
preferred label: Alosexualidad
related: Bisexual people
related: Heterosexuals
related: Homosexuals
related: Pansexual people
related: Compulsory sexuality
related: Allosexual people

LGBTQ+ people with addictions
type: Concept
issued: 2020-06-03
modified: 2025-04-24
replaces: LGBTQPeopleWithAddictions
comment: Umbrella term for LGBTQ+ people experiencing addictions, dependencies, or use disorders of some kind. Only use to refer to individuals who describe themselves as having addictions. Apply more specific terms if possible.
comment: Término general para las personas LGBTQ+ que sufren de adicciones, dependencias o trastornos por consumo de algún tipo. Utilícese únicamente para referirse a personas que se describen a sí mismas como adictas. Aplique términos más específicos de ser posible.
alternative label: LGBTQ people with addictions
alternative label: Personas LGBTQ con adicciones
broader: LGBTQ+ people who use substances
broader: Cocaine
broader: LGBTQ+ people
change note: Version 4.2.0
has top concept: LGBTQ+ people
in scheme: v3
narrower: LGBTQ+ people with sexual addictions
narrower: Alcoholics
narrower: Substance abuse
preferred label: Personas LGBTQ+ con adicciones
related: Two-Spirit people with addictions

Trans
type: Concept
issued: 2020-06-03
modified: 2025-02-23
replaces: trans
comment: Umbrella term used to describe individuals who "trans" gender regardless of their identification; sometimes used as a way to historicize non-binary identities.
comment: Término general utilizado para describir a las personas de género "trans" independientemente de su identificación; a veces, se utiliza como una forma de historizar identidades no binarias.
alternative label: Trans*
change note: Version 4.2.0
in scheme: v3
related: Gender identity
related: Transgender people
related: Transgender identity
related: Transgenderism
related: Transsexualism
related: Transvestism

Lesbian-owned businesses
type: Concept
issued: 2021-11-02
modified: 2025-02-23
comment: Businesses owned by lesbians.
comment: Negocios pertenecientes a lesbianas.
broader: LGBTQ+-owned businesses
change note: Version 4.2.0
has top concept: LGBTQ+-owned businesses
in scheme: v3
preferred label: Negocios propiedad de lesbianas
related: LGBTQ+ employment
related: Gay-owned businesses
related: Bisexual-owned businesses
related: Transgender-owned businesses
related: Queer-owned businesses
related: Lesbians in the workplace

Gay-owned businesses
type: Concept
issued: 2021-11-02
modified: 2025-02-23
comment: Businesses owned by gay people.
comment: Empresas pertenecientes a hombres gay.
broader: LGBTQ+-owned businesses
change note: Version 4.2.0
has top concept: LGBTQ+-owned businesses
in scheme: v3
preferred label: Negocios propiedad de hombres gay
related: LGBTQ+ employment
related: Lesbian-owned businesses
related: Bisexual-owned businesses
related: Transgender-owned businesses
related: Queer-owned businesses
related: Gay men in the workplace

Bisexual-owned businesses
type: Concept
issued: 2021-11-02
modified: 2025-02-23
comment: Businesses owned by bisexual people.
comment: Empresas pertenecientes a personas bisexuales.
broader: LGBTQ+-owned businesses
change note: Version 4.2.0
has top concept: LGBTQ+-owned businesses
in scheme: v3
preferred label: Negocios propiedad de bisexuales
related: LGBTQ+ employment
related: Lesbian-owned businesses
related: Gay-owned businesses
related: Transgender-owned businesses
related: Queer-owned businesses
related: Bisexual people in the workplace

Transgender-owned businesses
type: Concept
issued: 2021-11-02
modified: 2025-02-23
comment: Businesses owned by transgender people.
comment: Empresas pertenecientes a personas transgénero.
broader: LGBTQ+-owned businesses
change note: Version 4.2.0
has top concept: LGBTQ+-owned businesses
in scheme: v3
preferred label: Negocios propiedad de personas transgénero
related: LGBTQ+ employment
related: Lesbian-owned businesses
related: Gay-owned businesses
related: Bisexual-owned businesses
related: Queer-owned businesses
related: Transgender people in the workplace

Queer-owned businesses
type: Concept
issued: 2021-11-02
modified: 2025-02-23
comment: Businesses owned by queer people.
comment: Empresas pertenecientes a personas queer.
broader: LGBTQ+-owned businesses
change note: Version 4.2.0
has top concept: LGBTQ+-owned businesses
in scheme: v3
preferred label: Negocios propriedad de personas queer
related: LGBTQ+ employment
related: Lesbian-owned businesses
related: Gay-owned businesses
related: Bisexual-owned businesses
related: Transgender-owned businesses
related: Queer people in the workplace

Two-Spirit authors
type: Concept
issued: 2021-11-09
modified: 2025-03-13
comment: Two-Spirit creators of written works.
comment: Creadoras de obras escritas conocidas por ser dos espíritus.
alternative label: 2S authors
alternative label: 2S writers
alternative label: Two Spirit authors
alternative label: Two Spirit writers
alternative label: Two Spirited authors
alternative label: Two Spirited writers
alternative label: Two-Spirit writers
alternative label: Two-Spirited authors
alternative label: Two-Spirited writers
preferred label: Autores dos espíritus
alternative label: Escritores dos espíritus
broader: Two-Spirit people
change note: Version 4.2.0
has top concept: Gender
in scheme: v3
narrower: Two-Spirit poets
related: LGBTQ+ authors
related: Two-Spirit literature
related: Two-Spirit autobiographies
related: Two-Spirit biographies
related: Two-Spirit people's writings

Intersex chefs
type: Concept
issued: 2021-12-07
modified: 2025-02-23
comment: Intersex people who are trained, professional cooks, typically holding a leadership role in the kitchen in which they are employed.
comment: Personas intersex que son cocineras profesionales y capacitadas, que normalmente desempeñan un papel de liderazgo en la cocina en la que trabajan.
broader: LGBTQ+ chefs
change note: Version 4.2.0
has top concept: LGBTQ+ people
in scheme: v3
preferred label: Cocineros intersex
related: Lesbian chefs
related: Gay chefs
related: Bisexual chefs
related: Transgender chefs
related: Queer chefs
related: Asexual chefs

Clocking (Gender)
type: Concept
issued: 2021-12-07
modified: 2025-02-23
comment: Slang term for the act of identifying (or clocking) someone in public as trans, crossdressing, or in drag when that person is intending to pass or be read by others as cisgender, typically for their personal safety. Clocking is often understood to be a threat (of violence or public outing) against the person being clocked. Use the term "Reading (Gender)" to refer to shared identification or recognized kinship between two individuals who are both gender minorities.
comment: Término de la jerga para el acto de identificar (o fichar) a alguien en público como trans, trasformista o drag cuando esa persona tiene la intención de pasar o ser interpretada por otros como cisgénero, generalmente por su seguridad personal. A menudo se entiende que el fichaje es una amenaza (de violencia o salida pública) contra la persona que está siendo fichada. Utilícese el término "Fichaje (Género)" para referirse a la identificación compartida o el parentesco reconocido entre dos personas que pertenecen a minorías de género.
alternative label: Clocking (Transgender)
alternative label: Clocking
change note: Version 4.2.0
in scheme: v3
preferred label: Fichaje (género)
related: Stealth (Transgender)
related: Crossdressers
related: Passing (Gender)
related: Transgender people
related: Transsexual people
related: Transvestites

Closeted intersex people
type: Concept
issued: 2021-12-08
modified: 2025-02-23
comment: Intersex people who do not disclose the fact that they are intersex to others.
comment: Personas intersexuales que no revelan a los demás el hecho de que son intersex.
alternative label: Personas intersex en el clóset
broader: Closeted LGBTQ+ people
change note: Version 4.2.0
has top concept: LGBTQ+ people
in scheme: v3
preferred label: Personas intersexuales en el clóset
related: Stealth (Transgender)
related: Coming out
related: Down-low
related: Outing (LGBTQ+ culture)
related: Secrecy
related: Closeted asexual people

Closeted Two-Spirit people
type: Concept
issued: 2021-12-08
modified: 2025-02-23
comment: Two-Spirit people who do not identify as such to others.
comment: Personas de dos espíritus que no se autoidentifican como tales ante los demás.
alternative label: Closeted 2S people
alternative label: Closeted Two Spirit people
alternative label: Closeted Two Spirited people
alternative label: Closeted Two-Spirited people
broader: Two-Spirit people
change note: Version 4.2.0
has top concept: Gender
in scheme: v3
preferred label: Personas dos espíritus en el clóset
related: Stealth (Transgender)
related: Coming out
related: Down-low
related: Outing (LGBTQ+ culture)
related: Secrecy
related: Closeted LGBTQ+ people

Beards (Gay culture)
type: Concept
issued: 2021-12-08
modified: 2025-02-23
comment: Individuals who pose as the date or partner of someone they are not in a relationship with, typically to prevent that person's sexuality from becoming public knowledge; most commonly used to refer to a woman pretending to be dating a gay man.
alternative label: Beards
broader: Gay culture
change note: Version 4.2.0
has top concept: Subcultures
in scheme: v3
related: Down-low
related: Dutch boys
related: Fag hags
related: Goldilocks (Gay culture)
related: Secrecy
related: Closeted LGBTQ+ people

Alloromanticism
type: Concept
issued: 2021-12-14
modified: 2025-02-23
comment: A romantic orientation characterized by the occurrence of romantic attraction or desire in a frequent and consistent manner, often alongside sexual attraction.
comment: Una orientación romántica caracterizada por la atracción o el deseo romántico de manera frecuente y constante, a menudo junto con la atracción sexual.
broader: Romantic orientation
change note: Version 4.2.0
has top concept: Romantic orientation
in scheme: v3
narrower: Biromanticism
narrower: Homoromanticism
narrower: Heteroromanticism
narrower: Panromanticism
preferred label: Alorromanticismo
related: Aromanticism
related: Alloromantic people

Homoeroticism
type: Concept
issued: 2022-01-18
modified: 2025-02-23
comment: Sexual attraction or erotic desire between members of the same sex or gender; typically used to describe temporary, latent, or unfulfilled desire rather than a more permanent sexual identity or orientation.
comment: Atracción sexual o deseo erótico entre miembros del mismo sexo o género; normalmente se utiliza para describir un deseo temporal, latente o insatisfecho en lugar de una identidad u orientación sexual más permanente.
alternative label: Homoerotic
alternative label: Homoerótico
broader: Eroticism
change note: Version 4.2.0
has top concept: Eroticism
in scheme: v3
preferred label: Homoerotismo
related: Physical affection
related: Sexual excitement
related: Sexuality
related: Actorfic
related: Bandslash
related: Kirk/Spock

Gender transgression
type: Concept
issued: 2022-02-14
modified: 2025-02-23
comment: Behaviors, acts, or forms of expression that contradict or do not conform to a given culture's norms surrounding gender.
comment: Comportamientos, actos o formas de expresión que contradicen o no se conforman a las normas de una cultura determinada en torno al género.
broader: Gender expression
change note: Version 4.2.0
has top concept: Gender
in scheme: v3
preferred label: Transgresión de género
related: Gender
related: Gender bending
related: Gender roles
related: Genderfuck
related: Gender minorities
related: LGBTQ+ fashion

Biromantic people
type: Concept
issued: 2022-02-14
modified: 2025-02-23
comment: Individuals who experience romantic attraction or desire in a frequent and consistent manner toward people of more than one sex or gender.
comment: Personas que experimentan atracción o deseo romántico de forma frecuente y constante hacia personas de más de un sexo o género.
broader: Alloromantic people
broader: Romantic minorities
change note: Version 4.2.0
has top concept: Alloromantic people
in scheme: v3
preferred label: Personas birrománticas
related: Aromantic people
related: Biromanticism
related: Homoromantic people
related: Heteroromantic people
related: Panromantic people

Homoromantic people
type: Concept
issued: 2022-02-14
modified: 2025-02-23
comment: Individuals who experience romantic attraction or desire in a frequent and consistent manner toward members of the same sex or gender.
comment: Personas que experimentan atracción o deseo romántico de manera frecuente y constante hacia miembros del mismo sexo o género.
broader: Alloromantic people
broader: Romantic minorities
change note: Version 4.2.0
has top concept: Alloromantic people
in scheme: v3
preferred label: Personas homorománticas
related: Aromantic people
related: Homoromanticism
related: Biromantic people
related: Heteroromantic people
related: Panromantic people

Panromantic people
type: Concept
issued: 2022-02-14
modified: 2025-02-23
comment: Individuals who experience romantic attraction or romantic desire toward others in a frequent and consistent manner irrespective of sex or gender.
comment: Personas que experimentan atracción romántica o deseo romántico hacia otras personas de manera frecuente y consistente, independientemente de su sexo o género.
broader: Alloromantic people
broader: Romantic minorities
change note: Version 4.2.0
has top concept: Alloromantic people
in scheme: v3
preferred label: Personas panrománticas
related: Aromantic people
related: Panromanticism
related: Biromantic people
related: Homoromantic people
related: Heteroromantic people

Top surgery
type: Concept
issued: 2022-02-14
modified: 2025-02-23
comment: Colloquial term for gender-affirming surgical alterations of the chest.
comment: Término coloquial para las alteraciones quirúrgicas del tórax que afirman el género.
alternative label: Cirugía superior
broader: Gender-affirming surgery
change note: Version 4.2.0
has top concept: Medical care
in scheme: v3
narrower: Breast augmentation
narrower: Mastectomy
narrower: Chest reconstruction surgery
preferred label: Cirugía de pecho
related: Binding (Chest)
related: Bottom surgery
related: Transitioning (Gender)

Labiaplasty
type: Concept
issued: 2022-02-14
modified: 2025-02-23
comment: Surgical construction of the labia.
comment: Construcción quirúrgica de la labia
alternative label: Labioplasty
broader: Bottom surgery
change note: Version 4.2.0
has top concept: Medical care
in scheme: v3
preferred label: Labioplastia
related: Neovagina
related: Transitioning (Gender)
related: Vagina
related: Vulva
related: Clitoroplasty
related: Vaginoplasty

Phalloplasty
type: Concept
issued: 2022-02-15
modified: 2025-02-23
comment: Surgical construction of the penis.
comment: Construcción quirúrgica del pene.
alternative label: Phallo
alternative label: Vagina-preserving phalloplasty
alternative label: Flaplatia preservando la vagina
broader: Bottom surgery
change note: Version 4.2.0
has top concept: Medical care
in scheme: v3
preferred label: Faloplastia
related: Penis
related: Transitioning (Gender)
related: Metoidioplasty
related: Scrotoplasty
related: Vaginectomy
related: Neophallus

Vaginoplasty
type: Concept
issued: 2022-02-15
modified: 2025-02-23
comment: Surgical construction of the vagina.
comment: Construcción quirúrgica de la vagina.
alternative label: Intestinal vaginoplasty
alternative label: Penile inversion vaginoplasty
alternative label: Phallus-preserving vaginoplasty
alternative label: Zero depth vaginoplasty
alternative label: Ginetoplastia feminizante
broader: Bottom surgery
change note: Version 4.2.0
has top concept: Medical care
in scheme: v3
preferred label: Vaginoplastia
related: Neovagina
related: Transitioning (Gender)
related: Vagina
related: Vulva
related: Clitoroplasty
related: Labiaplasty

Crip
type: Concept
issued: 2022-02-24
modified: 2025-04-23
comment: A shortened form of the word "cripple" that has been reclaimed by disabled people to express pride and identify their political and community ties. Only use in reference to individuals or organizations that self-identify as crip. Because of the many intersections between crip theory/culture and queer theory/culture, the two are often but not always viewed as related.
broader: Reclaimed terms
change note: Version 4.2.0
has top concept: LGBTQ+ slang
in scheme: v3
narrower: Crip time
related: Queer (Verb)
related: LGBTQ+ disabled people
related: LGBTQ+ Deaf culture
related: LGBTQ+ people with chronic illnesses
related: Queercrip

Drag performers
type: Concept
issued: 2022-03-29
modified: 2025-02-23
comment: Performers who dress and/or use makeup to produce, emphasize, and/or exaggerate traits associated with a certain gender, which may or may not be the gender the performer primarily identifies with.
comment: Artistas que se visten y/o utilizan maquillaje para producir, enfatizar y/o exagerar rasgos asociados con un determinado género, que puede o no ser el género con el que el artista se identifica principalmente.
change note: Version 4.2.0
in scheme: v3
preferred label: Intérpretes de drag
related: Drag
related: Drag community
related: Drag kings
related: Drag queens
related: Drag shows
related: Drag pageants

Monogamous people
type: Concept
issued: 2022-03-31
modified: 2025-02-23
comment: Individuals who engage in sexual or romantic relationships with only one person at a time.
comment: Personas que mantienen relaciones sexuales o románticas con una sola persona a la vez.
change note: Version 4.2.0
in scheme: v3
preferred label: Personas monógamas
related: Monogamy
related: Partner preference
related: Sexual relationships
related: Mononormativity
related: Compulsory monogamy
related: Monogamish

Boys' Love (Genre)
type: Concept
issued: 2022-07-04
modified: 2025-02-23
comment: The manga and anime genre of fictional male-male romance created for a primarily female audience; sometimes used interchangeably with "Yaoi" in English (but not in Japanese).
comment: El género de manga y anime de romance ficticio entre hombres creado para una audiencia principalmente femenina; a veces se utiliza indistintamente con "Yaoi" en inglés (pero no en japonés).
alternative label: BL
alternative label: Boys Love
alternative label: Boys love
alternative label: Amor de chicos
broader: Anime and manga fandom
change note: Version 4.2.0
has top concept: Subcultures
in scheme: v3
narrower: Yaoi fandom
narrower: Danmei
preferred label: Boy's love
related: Gay youth literature

Fanfiction
type: Concept
issued: 2022-07-04
modified: 2025-02-23
comment: Written works of fiction created by fans that use the characters, settings, and/or plots of other media properties in a transformative way.
comment: Obras escritas de ficción creadas por fanáticos que utilizan los personajes, escenarios y/o tramas de otras propiedades mediáticas de manera transformadora.
alternative label: Fan fic
alternative label: Fan fiction
alternative label: Fanfic
broader: Fanworks
change note: Version 4.2.0
has top concept: Subcultures
in scheme: v3
narrower: Fanfiction tropes and genres
narrower: LGBTQ+ fanfiction
narrower: Slash fiction
narrower: Transfic
preferred label: Fanficcion
related: LGBTQ+ fiction
related: Fanart

Rape/non-con (Content warning)
type: Concept
issued: 2022-07-04
modified: 2025-02-23
comment: A content warning applied to fanworks to signal the presence of rape, non-consensual sexual encounters, or dubiously consensual sexual encounters.
comment: Una advertencia de contenido aplicada a obras de fans para señalar la presencia de la violación, encuentros sexuales no consensuales o encuentros sexuales dudosamente consensuados.
alternative label: Non-consensual (Content warning)
alternative label: Rape (Content warning)
alternative label: No consensual (advertencia de contenido)
alternative label: Violación (advertencia de contenido)
broader: Content warnings
change note: Version 4.2.0
has top concept: Subcultures
in scheme: v3
preferred label: Violación/No consentimento (Advertencia de contenido)
related: Consent
related: LGBTQ+ victims of rape
related: LGBTQ+ victims of sexual abuse
related: Sexual violence
related: LGBTQ+ survivors of rape
related: LGBTQ+ survivors of sexual abuse

Slash fandom
type: Concept
issued: 2022-07-04
modified: 2025-02-23
comment: The fan community that focuses on, incorporates, or details relationships between two characters of the same sex or gender (usually fictional, with "Real person fiction" as an exception). Historically used for male-male couples only, but is now used more broadly; includes femslash fandom.
comment: La comunidad de fans que se centra sobre, incorpora o detalla las relaciones entre dos personajes del mismo sexo o género (normalmente ficticios, con la excepción de "ficción de personas reales"). Históricamente se utilizaba únicamente para parejas de hombres, pero ahora se utiliza de forma más amplia; incluye fandom de femslash.
alternative label: Slash fan community
alternative label: Comunidad fan slash
alternative label: Comunidad de fans slash
broader: Fandom
change note: Version 4.2.0
has top concept: Subcultures
in scheme: v3
narrower: Slash (Genre)
narrower: Slash conventions
narrower: Slash fanworks
narrower: Slash fiction
narrower: Slash terminology
preferred label: Fandom slash
related: Yuri fandom

LGBTQ+ people in Adult Children of Alcoholics
type: Concept
is replaced by: homoit0002227
issued: 2020-06-03
issued: 2022-07-19
modified: 2022-12-16
modified: 2025-04-24
replaces: LGBTQPeopleInAdultChildrenOfAlcoholics
replaces: LGBTQPeopleInAlAnon
replaces: LGBTQPeopleInAlcoholicsAnonymous
replaces: LGBTQPeopleInCocaineAnonymous
replaces: LGBTQPeopleInCrystalMethAnonymous
replaces: LGBTQPeopleInNarcoticsAnonymous
replaces: LGBTQStepWork
comment: LGBTQ+ people who are members of recovery groups, or voluntary associations of people in recovery from use disorders, conditions, or addictions.
comment: Personas LGBTQ+ que son miembros de grupos de recuperación o asociaciones voluntarias de personas en recuperación de trastornos, condiciones o adicciones por consumo.
alternative label: LGBTQ people in Adult Children of Alcoholics
alternative label: LGBTQ people in Al-Anon
alternative label: LGBTQ people in AA
alternative label: LGBTQ people in Alcoholics Anonymous
alternative label: LGBTQ people in CA
alternative label: LGBTQ people in Cocaine Anonymous
alternative label: LGBTQ people in CMA
alternative label: LGBTQ people in Crystal Meth Anonymous
alternative label: LGBTQ people in NA
alternative label: LGBTQ people in Narcotics Anonymous
alternative label: LGBTQ step work
alternative label: LGBTQ people in recovery groups
alternative label: LGBTQ+ people in 12 step programs
alternative label: People in recovery groups (LGBTQ)
broader: LGBTQ+ people
broader: Recovery groups
change note: Version 4.2.0
has top concept: LGBTQ+ people
has top concept: Health care for LGBTQ+ people
in scheme: v3
preferred label: LGBTQ+ people in Al-Anon
preferred label: LGBTQ+ people in Alcoholics Anonymous
preferred label: LGBTQ+ people in Cocaine Anonymous
preferred label: LGBTQ+ people in Crystal Meth Anonymous
preferred label: LGBTQ+ people in Narcotics Anonymous
preferred label: LGBTQ+ step work
preferred label: LGBTQ+ people in recovery groups
preferred label: Personas LGBTQ+ en grupos de recuperación
related: Alcoholics
related: Substance abuse
related: Recovery groups
related: Two-Spirit people in recovery groups

Anti-Blackness
type: Concept
issued: 2022-09-09
modified: 2025-02-23
comment: Term used to acknowledge the particularities of racism as directed toward Black people. Anti-Blackness includes the belief that Black people possess different inherent behavioral traits that correspond to inherited attributes and are inferior to those of other races--particularly white people. Anti-Blackness also encompasses prejudice, discrimination, and antagonism (whether personal or systematic) directed toward Black people because of their race and its perceived inferiority.
comment: Término utilizado para reconocer las particularidades del racismo dirigido hacia las personas negras. La antinegritud incluye la creencia de que las personas negras poseen diferentes características conductuales inherentes que corresponden a atributos heredados, y que son inferiores a otras razas, particularmente a las personas blancas. La antinegritud también abarca el prejuicio, la discriminación y el antagonismo (ya sea personal o sistemático) dirigido hacia las personas negras debido a su raza y su percibida inferioridad.
alternative label: Anti Blackness
alternative label: Antinegritud
broader: Racism
change note: Version 4.2.0
has top concept: Racism
in scheme: v3
preferred label: Anti-negritud
related: Critical race theory
related: Transmisogynoir
related: Misogynoir
related: Police harassment of Black LGBTQ+ people
related: Gentrification
related: Redlining

Aromantic literary criticism
type: Concept
issued: 2023-03-23
modified: 2025-02-23
comment: The study, evaluation, and interpretation of literary works focusing on aromantic characters or themes; can also include interpretation of literature through the lens and frameworks of aromantic studies.
comment: El estudio, la evaluación y la interpretación de obras literarias centradas en personajes o temas arrománticos. También puede incluir la interpretación de la literatura a través del lente y los marcos teóricos de los estudios arrománticos.
broader: LGBTQ+ literary criticism
change note: Version 4.2.0
has top concept: LGBTQ+ literary criticism
in scheme: v3
preferred label: Crítica literaria arromántica
related: Lesbian literary criticism
related: Gay literary criticism
related: Bisexual literary criticism
related: Transgender literary criticism
related: Queer literary criticism
related: Aromantic authors

Asexual literary criticism
type: Concept
issued: 2023-03-26
modified: 2025-02-23
comment: The study, evaluation, and interpretation of literary works focusing on asexual characters or themes; can also include interpretation of literature through the lens and frameworks of asexual studies.
comment: El estudio, la evaluación y la interpretación de obras literarias centradas en personajes o temas asexuales; también puede incluir la interpretación de la literatura a través del lente y los marcos teóricos de los estudios asexuales.
broader: LGBTQ+ literary criticism
change note: Version 4.2.0
has top concept: LGBTQ+ literary criticism
in scheme: v3
preferred label: Crítica literaria asexual
related: Lesbian literary criticism
related: Gay literary criticism
related: Bisexual literary criticism
related: Transgender literary criticism
related: Queer literary criticism
related: Asexual authors

Greyromantic literary criticism
type: Concept
issued: 2023-04-11
modified: 2025-02-23
comment: The study, evaluation, and interpretation of literary works focusing on greyromantic characters or themes; can also include interpretation of literature through the lens and frameworks of greyromantic studies.
comment: El estudio, la evaluación y la interpretación de obras literarias centradas en personajes o temas grisrománticos; también puede incluir la interpretación de la literatura a través del lente y los marcos teóricos de los estudios grisrománticos.
broader: LGBTQ+ literary criticism
change note: Version 4.2.0
has top concept: LGBTQ+ literary criticism
in scheme: v3
preferred label: Crítica literaria grisromántica
related: Lesbian literary criticism
related: Gay literary criticism
related: Bisexual literary criticism
related: Transgender literary criticism
related: Queer literary criticism
related: Greyromantic authors

Two-Spirit films
type: Concept
issued: 2023-04-12
modified: 2025-02-23
comment: Motion pictures, or movies, created by Two-Spirit directors, depicting Two-Spirit people, or that are regarded as important within Two-Spirit culture.
comment: Películas o filmes creados por directores dos espíritus, que representan a personas dos espíritus o que se consideran importantes dentro de la cultura dos espíritus.
alternative label: 2S films
alternative label: Two Spirit films
alternative label: Two Spirited films
alternative label: Two-Spirited films
change note: Version 4.2.0
in scheme: v3
narrower: Two-Spirit erotic films
narrower: Two-Spirit documentaries
preferred label: Películas dos espíritus
related: LGBTQ+ films

Non-binary disabled people
type: Concept
issued: 2023-06-26
modified: 2025-02-23
comment: Non-binary people who are disabled.
comment: Personas no binarias con discapacidad.
alternative label: Disabled non-binary people
alternative label: Non-binary people with disabilities
alternative label: Personas discapacidades no binarias
alternative label: Personas no binarias con discapacidades
broader: LGBTQ+ disabled people
change note: Version 4.2.0
has top concept: LGBTQ+ people
in scheme: v3
narrower: Non-binary neurodivergent people
narrower: Non-binary blind people
narrower: Non-binary hard of hearing people
narrower: Non-binary Deaf people
narrower: Non-binary wheelchair users
preferred label: Personas no binarias discapacitadas
related: Non-binary people with chronic illnesses

MVPFAFF+
type: Concept
issued: 2023-06-26
modified: 2025-02-23
comment: Acronym used to describe Pasifika/Pacific Islander gender diverse identities as a group. The acronym includes Māhū (Hawai'i and Tahiti), Vaka sa lewa lewa (Fiji), Palopa (Papua New Guinea), Fa’afafine (Samoa), Akava’ine (Rarotonga), Fakaleitī (Tonga), Fakafifine (Niue), and more.
comment: Acrónimo utilizado para describir las diversas identidades de género de los pasifika/isleños del Pacífico como grupo. El acrónimo incluye māhū (Hawái y Tahití), vaka sa lewa lewa (Fiyi), palopa (Papúa Nueva Guinea), va'afafine (Samoa), akava'ine (Rarotonga), fakaleitī (Tonga), fakafifine (Niue), etc.
broader: Non-Euro-American gender and sexual identities
change note: Version 4.2.0
has top concept: Gender
in scheme: v3
narrower: Akava'ine
narrower: Fa'afafine
narrower: Fakaleitī
narrower: Māhū
narrower: Whakatane
narrower: Whakawāhine

Asexual chefs
type: Concept
issued: 2023-06-27
modified: 2025-02-23
comment: Asexual people who are trained, professional cooks, typically holding a leadership role in the kitchen in which they are employed.
comment: Personas asexuales que son cocineros profesionales con entrenamiento, que suelen desempeñar un papel de liderazgo en la cocina en la que trabajan.
broader: LGBTQ+ chefs
change note: Version 4.2.0
has top concept: LGBTQ+ people
in scheme: v3
preferred label: Cocineros asexuales
related: Lesbian chefs
related: Gay chefs
related: Bisexual chefs
related: Transgender chefs
related: Queer chefs
related: Intersex chefs

Asexual disabled people
type: Concept
issued: 2023-06-28
modified: 2025-02-23
comment: Asexual people who are disabled.
comment: Personas asexuales con discapacidad.
alternative label: Asexual people with disabilities
alternative label: Disabled asexual people
alternative label: Personas asexuales con discapacidades
alternative label: Discapacitados asexuales
alternative label: Discapacitadas asexuales
alternative label: Personas discapacitadas asexuales
broader: LGBTQ+ disabled people
change note: Version 4.2.0
has top concept: LGBTQ+ people
in scheme: v3
narrower: Asexual neurodivergent people
narrower: Asexual blind people
narrower: Asexual Deaf people
narrower: Asexual hard of hearing people
narrower: Asexual wheelchair users
preferred label: Personas asexuales discapacitadas
related: Asexual people with chronic illnesses

Demisexual disabled people
type: Concept
issued: 2023-10-27
modified: 2025-02-23
comment: Demisexual people who are disabled.
comment: Personas demisexuales con discapacidad.
alternative label: Disabled demisexual people
alternative label: Personas discapacitadas demisexuales
alternative label: Personas demisexuales con discapacidades
broader: LGBTQ+ disabled people
change note: Version 4.2.0
has top concept: LGBTQ+ people
in scheme: v3
narrower: Demisexual neurodivergent people
narrower: Demisexual blind people
narrower: Demisexual hard of hearing people
narrower: Demisexual Deaf people
narrower: Demisexual wheelchair users
preferred label: Personas demisexuales discapacitadas
related: Demisexual people with chronic illnesses

Megasexual disabled people
type: Concept
issued: 2023-10-27
modified: 2025-02-23
comment: Megasexual people who are disabled.
comment: Personas megasexuales con discapacidad.
alternative label: Disabled megasexual people
alternative label: Personas discapacitadas megasexuales
alternative label: Personas megasexuales con discapacidades
broader: LGBTQ+ disabled people
change note: Version 4.2.0
has top concept: LGBTQ+ people
in scheme: v3
narrower: Megasexual neurodivergent people
narrower: Megasexual blind people
narrower: Megasexual hard of hearing people
narrower: Megasexual Deaf people
narrower: Megasexual wheelchair users
preferred label: Personas megasexuales discapacitadas
related: Megasexual people with chronic illnesses

Aromantic disabled people
type: Concept
issued: 2023-10-27
modified: 2025-02-23
comment: Aromantic people who are disabled.
comment: Personas arrománticas con discapacidad.
alternative label: Disabled aromantic people
alternative label: Personas discapacitadas arrománticas
alternative label: Personas arrománticas con discapacidades
broader: LGBTQ+ disabled people
change note: Version 4.2.0
has top concept: LGBTQ+ people
in scheme: v3
narrower: Aromantic neurodivergent people
narrower: Aromantic blind people
narrower: Aromantic hard of hearing people
narrower: Aromantic Deaf people
narrower: Aromantic wheelchair users
preferred label: Personas arrománticas discapacitadas
related: Aromantic people with chronic illnesses

Greyromantic disabled people
type: Concept
issued: 2023-10-27
modified: 2025-02-23
comment: Greyromantic people who are disabled.
comment: Personas grisrománticas con discapacidad.
alternative label: Disabled greyromantic people
alternative label: Personas discapacitadas grisrománticas
alternative label: Personas grisrománticas con discapacidades
broader: LGBTQ+ disabled people
change note: Version 4.2.0
has top concept: LGBTQ+ people
in scheme: v3
narrower: Greyromantic neurodivergent people
narrower: Greyromantic blind people
narrower: Greyromantic hard of hearing people
narrower: Greyromantic Deaf people
narrower: Greyromantic wheelchair users
preferred label: Personas grisrománticas discapacitadas
related: Greyromantic people with chronic illnesses

Animal roleplay
type: Concept
issued: 2023-12-18
modified: 2025-02-23
comment: The act of roleplaying as an animal or animal character, sometimes with someone acting as a trainer, handler or pet owner, for fun or erotic enjoyment.
alternative label: Pet play
broader: Roleplay
change note: Version 4.2.0
has top concept: Sex (Act)
in scheme: v3
narrower: Pony play
narrower: Pup play
related: BDSM
related: Furries
related: Furry culture
related: Dehumanization (Erotic)

Gas masks (Erotic)
type: Concept
issued: 2023-12-20
modified: 2025-02-23
comment: A mask traditionally used to protect the wearer from inhaling airborne pollutants and toxic gases and used in kink or erotic play.
comment: Máscara utilizada tradicionalmente para proteger al usuario de la inhalación de contaminantes atmosféricos y gases tóxicos, y usada en juegos eróticos o kink.
broader: Sex accessories
broader: LGBTQ+ fashion
broader: Masks (Erotic)
change note: Version 4.2.0
has top concept: Sex accessories
in scheme: v3
preferred label: Máscaras de gas (erótico)
related: Pup play
related: Gags
related: Breath control
related: Hoods (Erotic)

Chest
type: Concept
issued: 2023-12-20
modified: 2025-02-23
comment: A gender-inclusive term for the upper area of the torso, can be used if the person has breasts or not.
comment: Término inclusivo de género para la zona superior del torso; se puede utilizar para personas con o sin senos.
alternative label: Tórax
broader: Erogenous body parts
change note: Version 4.2.0
has top concept: Erogenous body parts
in scheme: v3
preferred label: Pecho
related: Binding (Chest)
related: Breast
related: Breast fetish
related: Chest reconstruction surgery
related: Breast play
related: Chest play

Douching
type: Concept
issued: 2023-12-20
modified: 2025-02-23
comment: The use of a device (called a douche or enema) to introduce a stream of liquid into either the rectum or vagina. Can be used for sexual or erotic purposes.
comment: El uso de un dispositivo (llamado ducha vaginal o enema) para introducir un chorro de líquido en el recto o la vagina. Puede utilizarse con fines sexuales o eróticos.
alternative label: Ducha vaginal
broader: BDSM
broader: Sex (Act)
broader: Sexual practices
change note: Version 4.2.0
has top concept: Eroticism
in scheme: v3
preferred label: Lavado vaginal
related: Anal sex
related: Ass fucking
related: Anal play
related: Enemas

Anti-kink discrimination
type: Concept
issued: 2023-12-20
modified: 2025-02-23
comment: The unjust or prejudicial treatment of individuals or communities due to their kinks and/or kinky sexual practices; may include adverse legal judgment and/or the denial of legal rights, employment, and housing.
comment: El trato injusto o perjudicial hacia personas o comunidades debido a sus kinks y/o prácticas sexuales kinky; puede incluir sentencias legales adversas y/o la denegación de derechos legales de empleo y vivienda.
change note: Version 4.2.0
in scheme: v3
narrower: Anti-sadomasochism
preferred label: Discriminación anti-kink
related: BDSM
related: Leather community
related: Kinky people
related: Gentrification

Hoods (Erotic)
type: Concept
issued: 2024-01-02
modified: 2025-02-23
comment: A hood used as a head covering or restraint, for kink, erotic play or fashion.
comment: Una capucha que se utiliza para cubrir o sujetar la cabeza, para el kink, los juegos eróticos o de moda.
alternative label: Bondage hoods
broader: Sex accessories
broader: LGBTQ+ fashion
change note: Version 4.2.0
has top concept: Sex accessories
in scheme: v3
preferred label: Capuchas (erótico)
related: Bondage
related: Blindfolds
related: Gags
related: Gas masks (Erotic)
related: Sensory deprivation (Erotic)

Abortion access for LGBTQ+ people
type: Concept
issued: 2024-06-19
modified: 2026-03-03
comment: Term used to describe the various aspects determining whether abortions are accessible to LGBTQ+ people in a given location. Factors determining accessibility include legality, safety, privacy, financial cost, freedom of travel, etc.
broader: Reproductive health care for LGBTQ+ people
change note: Version 4.2.0
has top concept: Health care for LGBTQ+ people
in scheme: v3
related: Reproductive health care for LGBTQ+ people
related: Abortion
related: Bodily autonomy
related: Reproductive health care for Two-Spirit people
related: LGBTQ+ abortion seekers
related: Abortion funds

Anti-gender movement
type: Concept
issued: 2024-10-23
modified: 2025-02-23
comment: A movement that opposes what is referred to as "gender ideology," or the belief that gender is a social construct that exists on a spectrum. Members of the anti-gender movement oppose the visibility, acceptance, and civil and reproductive rights of trans, non-binary, intersex, Two-Spirit, gender diverse, and gender non-conforming people.
alternative label: Gender critical movement
broader: Social movements
change note: Version 4.2.0
has top concept: Social movements
in scheme: v3
related: Trans-exclusionary radical feminism
related: Trans exclusivity
related: Transphobia
related: Anti-transgender discrimination
related: Anti-intersex discrimination
related: Anti-Two-Spirit discrimination

Two-Spirit victims of crime
type: Concept
issued: 2024-10-30
modified: 2025-02-23
comment: Two-Spirit people who have experienced crimes and may or may not have survived. Use more specific terms and follow the individual's preference for "victims" or "survivors" whenever possible.
alternative label: Two Spirit victims of crime
alternative label: Two-Spirited victims of crime
alternative label: Two Spirited victims of crime
alternative label: 2S victims of crime
alternative label: Two-Spirit crime victims
broader: Two-Spirit people
change note: Version 4.2.0
has top concept: Gender
in scheme: v3
narrower: Two-Spirit victims of hate crimes
narrower: Two-Spirit victims of rape
narrower: Two-Spirit victims of sexual abuse
narrower: Two-Spirit victims of war
narrower: Two-Spirit victims of human trafficking
related: Two-Spirit victims of bullying

Third parties (Sex work)
type: Concept
issued: 2024-10-30
modified: 2025-02-23
comment: A legal term for individuals who supervise, coordinate, assist, or facilitate sex work, either on behalf of sex workers or their clients. Third parties include managers, brothel-keepers, concierges, drivers etc.
change note: Version 4.2.0
in scheme: v3
narrower: Madams (Sex work)
narrower: Pimps
narrower: Sex work concierges

Two-Spirit people who use substances
type: Concept
issued: 2025-04-24
modified: 2025-04-24
comment: Umbrella term for Two-Spirit people who use substances (that are typically deemed harmful or are subject to legal restriction, such as drugs and alcohol) for any reason. Apply more specific terms if possible.
alternative label: Two-Spirit substance users
alternative label: Two-Spirit drug users
alternative label: Two-Spirit drinkers
alternative label: Two Spirit people who use substances
alternative label: Two-Spirited people who use substances
alternative label: Two Spirited people who use substances
alternative label: 2S people who use substances
broader: Two-Spirit people
change note: Version 4.2.0
has top concept: Gender
in scheme: v4
narrower: Two-Spirit people who use substances for medical purposes
narrower: Two-Spirit people who use substances for recreational purposes
narrower: Two-Spirit people with addictions
narrower: Two-Spirit people with alcohol use disorders
narrower: Two-Spirit people with substance use disorders
related: LGBTQ+ people who use substances

Metadata for trans and gender diverse resources
type: Concept
issued: 2026-02-23
modified: 2026-02-23
comment: Works dealing with best practices and issues around cataloging and other descriptive metadata for resources by and/or about trans and gender diverse people, issues, or cultures, in repositories such as libraries, archives, and museums.
alternative label: Trans and gender diverse metadata
alternative label: Trans metadata
alternative label: Gender diverse metadata
change note: Version 4.2.0
in scheme: v4
related: Transgender libraries
related: Transgender archives
related: Transgender museums
related: Two-Spirit libraries
related: Two-Spirit archives
related: Two-Spirit museums

Abortion funds
type: Concept
issued: 2026-03-03
modified: 2026-03-05
comment: Financial and logistical assistance, often provided by a non-profit organization, to individuals seeking abortions. These funds may also support needs like travel, lodging, childcare, abortion doulas, translation services, and meals, but are not abortion providers. They may also advocate for changes in legislation that restrict access to abortion.
alternative label: Reproductive freedom funds
broader: Mutual aid funds
change note: Version 4.2.0
has top concept: Mutual aid funds
in scheme: v4
related: Abortion access for LGBTQ+ people
related: LGBTQ+ peer support
related: Abortion counseling for LGBTQ+ people
related: Abortion services for LGBTQ+ people
related: LGBTQ+ abortion seekers
related: Abortion

Afro-Canadian LGBTQ+ people
type: Concept
issued: 2019-05-14
modified: 2025-04-24
replaces: afroCanadiansLGBTQ
comment: LGBTQ+ people of African descent born in Canada or LGBTQ+ people born in African countries who live in or have a strong connection to Canada; use for individuals who self-identity as Afro-Canadian.
comment: Personas LGBTQ+ de ascendencia africana nacidas en Canadá o personas LGBTQ+ nacidas en países africanos que viven o tienen una conexión fuerte con Canadá. Utilícese para personas que se identifiquen como afrocanadienses.
alternative label: Afro-Canadian people (LGBTQ)
alternative label: Afro-Canadians (LGBTQ)
alternative label: LGBTQ+ Afro-Canadian people
alternative label: LGBTQ+ Afro-Canadians
alternative label: Afrocanadienses LGBTQ+
alternative label: Personas afrocanadienses LGBTQ+
alternative label: Afrocanadienses (LGBTQ)
broader: Black LGBTQ+ people
change note: Version 4.2.0
has top concept: LGBTQ+ people
in scheme: v3
narrower: Afro-Canadian bisexual people
narrower: Afro-Canadian gay men
narrower: Afro-Canadian lesbians
narrower: Afro-Canadian queer people
narrower: Afro-Canadian transgender people
narrower: Afro-Canadian asexual people
narrower: Afro-Canadian intersex people
preferred label: Personas LGBTQ+ afrocanadienses

Afro-Caribbean LGBTQ+ people
type: Concept
issued: 2019-05-14
modified: 2025-02-23
replaces: afroCaribbeansLGBTQ
comment: LGBTQ+ people of African descent born in the Caribbean or LGBTQ+ people born in African countries who live in or have a strong connection to the Caribbean. Only use for individuals who self-identify as Afro-Caribbean.
comment: Personas LGBTQ+ afrodescendientes nacidas en el Caribe o personas LGBTQ+ nacidas en países africanos que viven o tienen una conexión fuerte con el Caribe. Utilícese únicamente para personas que se identifiquen como afrocaribeñas.
alternative label: Afro-Caribbean people (LGBTQ)
alternative label: Afro-Caribbeans (LGBTQ)
alternative label: LGBTQ+ Afro-Caribbean people
alternative label: LGBTQ+ Afro-Caribbeans
alternative label: Afrocaribeños LGBTQ+
alternative label: Personas afrocaribeñas LGBTQ+
alternative label: Afrocaribeños (LGBTQ)
alternative label: Afrocaribeñas LGBTQ+
alternative label: Afrocaribeñas (LGBTQ)||
broader: Black LGBTQ+ people
change note: Version 4.2.0
has top concept: LGBTQ+ people
in scheme: v3
narrower: Afro-Caribbean bisexual people
narrower: Afro-Caribbean gay men
narrower: Afro-Caribbean lesbians
narrower: Afro-Caribbean queer people
narrower: Afro-Caribbean transgender people
narrower: Afro-Caribbean asexual people
narrower: Afro-Caribbean intersex people
preferred label: Personas LGBTQ+ afrocaribeñas

Afro-European LGBTQ+ people
type: Concept
issued: 2019-05-14
modified: 2025-02-23
replaces: afroEuropeansLGBTQ
comment: LGBTQ+ people of African descent born in European countries or LGBTQ+ people born in African countries who live in or have a strong connection to Europe. Only use for individuals who self-identify as Afro-European.
comment: Personas LGBTQ+ de ascendencia africana nacidas en países europeos o personas LGBTQ+ nacidas en países africanos que viven en Europa o tienen una fuerte conexión con Europa. Utilícese únicamente para personas que se identifiquen como afroeuropeas.
alternative label: Afro-European people (LGBTQ)
alternative label: Afro-Europeans (LGBTQ)
alternative label: LGBTQ+ Afro-European people
alternative label: LGBTQ+ Afro-Europeans
alternative label: Afroeuropeos LGBTQ+
alternative label: Personas afroeuropeas LGBTQ+
alternative label: Afroeuropeos (LGBTQ)
alternative label: Afroeuropeas LGBTQ+
alternative label: Afroeuropeas (LGBTQ)||
broader: Black LGBTQ+ people
change note: Version 4.2.0
has top concept: LGBTQ+ people
in scheme: v3
narrower: Afro-European bisexual people
narrower: Afro-European gay men
narrower: Afro-European lesbians
narrower: Afro-European queer people
narrower: Afro-European transgender people
narrower: Afro-European asexual people
narrower: Afro-European intersex people
preferred label: Personas LGBTQ+ afroeuropeas

Anal sex
type: Concept
issued: 2019-05-14
modified: 2025-02-23
replaces: analSex
comment: Sexual activity involving penetration of the anus.
comment: Actividad sexual que implica la penetración del ano.
broader: Anal play
broader: Sex (Act)
broader: Sexual practices
change note: Version 4.2.0
has top concept: Sex (Act)
in scheme: v3
narrower: Anal fisting
narrower: Ass fucking
preferred label: Sexo anal
related: Rimming
related: Butt plugs
related: Douching

Anonymous sex
type: Concept
issued: 2019-05-14
modified: 2025-02-23
replaces: anonymousSex
comment: Sexual encounters between two or more people who do not know one another, typically with no expectation of future communication or interaction.
comment: Encuentros sexuales entre dos o más personas que no se conocen, generalmente sin expectativas de comunicación o interacción futura.
broader: Sexual practices
change note: Version 4.2.0
has top concept: Sexual practices
in scheme: v3
preferred label: Sexo anónimo
related: Casual sex
related: Cottaging (Gay culture)
related: Cruising (LGBTQ+ culture)
related: Sex locations
related: Sexual relationships
related: Sexuality
related: Tearoom sex

Asian American LGBTQ+ people
type: Concept
issued: 2019-05-14
modified: 2025-02-23
replaces: asianAmericansLGBTQ
comment: LGBTQ+ people of Asian heritage or descent born in the United States or born in Asian countries who live in or have a strong connection to the United States. Only use for individuals who self-identify as Asian American.
comment: Personas LGBTQ+ de ascendencia asiática nacidas en Estados Unidos o personas LGBTQ+ nacidas en países asiáticos que viven en o tienen una conexión fuerte con los Estados Unidos. Utilícese para personas que se autoidentifiquen como asiático-americanas.
alternative label: Asian American people (LGBTQ)
alternative label: Asian Americans (LGBTQ)
alternative label: LGBTQ+ Asian American people
alternative label: LGBTQ+ Asian Americans
alternative label: Personas asiático-americanas (LGBTQ)
alternative label: Asiático-americanos LGBTQ
alternative label: Asiático-americanos LGBTQ+
alternative label: Asiático-americanos (LGBTQ)
alternative label: Asiático-americanas LGBTQ
alternative label: Asiático-americanas LGBTQ+
alternative label: Asiático-americanas (LGBTQ)
broader: Asian LGBTQ+ people
change note: Version 4.2.0
has top concept: LGBTQ+ people
in scheme: v3
narrower: Asian American bisexual people
narrower: Asian American gay men
narrower: Asian American lesbians
narrower: Asian American queer people
narrower: Asian American transgender people
narrower: Asian American intersex people
narrower: Asian American asexual people
preferred label: Personas LGBTQ+ asiático-americanas

Banjees
type: Concept
issued: 2019-05-14
modified: 2025-02-23
replaces: banjees
comment: Term from the 1980s (or earlier) that describes a certain type of young Latin American or African American man who has sex with men and who dresses in stereotypical masculine urban fashion.
comment: Término de la década de 1980 (o anterior) que describe a un determinado tipo de joven latino o afroamericano que mantiene relaciones sexuales con hombres y que viste de forma estereotipada masculina y urbana.
broader: LGBTQ+ historical terms
broader: Sexual identity
change note: Version 4.2.0
has top concept: LGBTQ+ historical terms
in scheme: v3
related: African American LGBTQ+ people
related: Ball culture
related: Latino/a/x LGBTQ+ people
related: Macho men
related: Men who have sex with men
related: Chicano/a/x gay men

Binding (Chest)
type: Concept
issued: 2019-05-14
modified: 2025-02-23
replaces: bindingChest
comment: The act of flattening or concealing the chest area with a tight fitting shirt, strap, or similar material; often practiced by transgender men and transmasculine people.
comment: El acto de aplanar u ocultar la zona del pecho con una camisa ajustada, una correa o un material similar; suele practicarse por hombres transgénero o personas transmasculinas.
alternative label: Binding
alternative label: Faja
alternative label: Práctica de fajado de pecho
alternative label: Vendarse el pecho
broader: Gender expression
change note: Version 4.2.0
has top concept: Gender
in scheme: v3
preferred label: Fajarse el pecho
related: Breast
related: FtMs
related: Trans men
related: Top surgery
related: Stand-to-Pee devices
related: Chest
related: Binders (Chest)

Bottoms (Sex)
type: Concept
issued: 2019-05-14
modified: 2025-02-23
replaces: bottoms
comment: The receptive partner during sex or kink activities.
comment: Término de la jerga para personas que se asumen como pareja receptora en encuentros sexuales.
alternative label: Bottoms
alternative label: Catchers (Sex)
alternative label: Catchers
alternative label: Pasivos
broader: Sexual identity
broader: Sexual roles
change note: Version 4.2.0
has top concept: Sexual identity
in scheme: v3
preferred label: Bottoms (sexo)
related: LGBTQ+ submissives
related: Switches (Sex)
related: Tops (Sex)
related: Vers (Sex)
related: Power exchange
related: Kinky people

Boys
type: Concept
issued: 2019-05-14
modified: 2025-02-23
replaces: boys
comment: Children or youth, typically younger than 18 years old, who identify as boys.
comment: Niñez o juventud, normalmente menores de 18 años, que se autoidentifican como niños.
broader: Children
change note: Version 4.2.0
has top concept: Family members
in scheme: v3
narrower: Bisexual boys
narrower: Gay boys
narrower: Heterosexual boys
narrower: Sissies
narrower: Cisgender boys
preferred label: Niños
related: Boys' friendships
related: Gender binaries

LGBTQ+ Buddhists
type: Concept
issued: 2019-05-14
modified: 2025-02-23
replaces: buddhistsLGBTQ
comment: LGBTQ+ people who are Buddhist.
comment: Personas LGBTQ+ que son budistas.
alternative label: Buddhists (LGBTQ)
alternative label: Budistas (LGBTQ)
broader: LGBTQ+ African religions
change note: Version 4.2.0
has top concept: LGBTQ+ African religions
in scheme: v3
narrower: Bisexual Buddhists
narrower: Gay Buddhists
narrower: Lesbian Buddhists
narrower: Queer Buddhists
narrower: Transgender Buddhists
narrower: Asexual Buddhists
narrower: Intersex Buddhists
preferred label: Budistas LGBTQ+

Cunnilingus
type: Concept
issued: 2019-05-14
modified: 2025-02-23
replaces: cunnilingus
comment: A sexual act involving the use of the mouth and tongue to stimulate the clitoris, labia, and vagina.
comment: Un acto sexual que implica el uso de la boca y la lengua para estimular el clítoris, los labios y la vagina.
alternative label: Carpet munching
alternative label: Cunt licking
alternative label: Eating pussy
alternative label: Muff diving
alternative label: Comer crica
alternative label: Comer chocha
broader: Clitoral sex
broader: Oral sex
broader: Licking
broader: Sex (Act)
broader: Sexual practices
change note: Version 4.2.0
has top concept: Sex (Act)
in scheme: v3
related: Vaginal sex
related: Vagina
related: 69ing

Castration
type: Concept
issued: 2019-05-14
modified: 2025-02-23
replaces: castration
comment: Removal of the testes or use of the testes, typically through surgical or chemical means. Includes castration voluntarily undertaken as a gender-affirming surgical procedure or as part of a religious rite. For involuntary castration enacted by legal authorities or as a hate crime, use the term "Forced castration."
comment: Extirpación de los testículos o del uso de los testículos, generalmente mediante medios quirúrgicos o químicos. Incluye la castración realizada voluntariamente como procedimiento quirúrgico de afirmación de género o como parte de un rito religioso. Para la castración involuntaria promulgada por autoridades legales o como delito de odio, utilícese el término "castración forzada".
change note: Version 4.2.0
in scheme: v3
narrower: Forced castration
narrower: Orchiectomy
narrower: Penectomy
preferred label: Castración
related: Eunuchs
related: Consent

Casual sex
type: Concept
issued: 2019-05-14
modified: 2025-02-23
replaces: casualSex
comment: Intermittent or isolated sexual encounters between two or more people, typically occurring outside of romantic relationships or other forms of commitment, emotional attachment, or familiarity.
comment: Encuentros sexuales intermitentes o aislados entre dos o más personas, que generalmente ocurren fuera de relaciones románticas u otras formas de compromiso, apego emocional o familiaridad.
alternative label: Promiscuity
alternative label: Promiscuidad
broader: Sexual practices
broader: Sexual relationships
change note: Version 4.2.0
has top concept: Sexual practices
in scheme: v3
preferred label: Sexo casual
related: Anonymous sex
related: Cruising (LGBTQ+ culture)
related: Group sex
related: Sex parties
related: Sexual preference
related: Sexuality

Celibacy
type: Concept
issued: 2019-05-14
modified: 2025-02-23
replaces: celibacy
comment: Conscious abstinence from sexual activity, often associated with religious beliefs. Celibacy is distinct from asexuality; only use to describe asexual people if they are also choosing to practice conscious abstinence.
comment: Abstinencia consciente de la actividad sexual, a menudo asociada con creencias religiosas. El celibato es distinto de la asexualidad; utilícese únicamente para describir a personas asexuales si también eligen practicar la abstinencia consciente.
change note: Version 4.2.0
in scheme: v3
preferred label: Celibato
related: Asexual people
related: Bisexual clergy
related: Gay clergy
related: Lesbian clergy
related: Queer clergy
related: Sexual abstinence
related: Transgender clergy

Legal name change
type: Concept
issued: 2019-05-14
modified: 2025-03-20
replaces: legalNameChange
comment: The process by which an individual adopts a new name on legal or government-issued documents.
comment: El proceso mediante el cual una persona adopta un nombre nuevo en documentos legales o emitidos por el gobierno.
alternative label: Change of name
alternative label: Cambio de nombre
broader: LGBTQ+ personal and family law
broader: Official documentation
change note: Version 4.2.0
has top concept: Law
in scheme: v3
preferred label: Cambio de nombre legal
related: Birth certificates
related: Driver's licenses
related: Marriage
related: Passports
related: Social security cards
related: Gender marker change bans

Sex workers' clients
type: Concept
issued: 2019-05-14
modified: 2025-02-23
replaces: prostitutesClients
comment: People who provide money or goods to sex workers in exchange for sexual services, performances, or companionship.
comment: Personas que ofrecen dinero o bienes a trabajadoras/es sexuales a cambio de servicios o actuaciones sexuales.
alternative label: Johns
alternative label: Tricks
alternative label: Prostitutes' clients
alternative label: Prostitutes' customers
alternative label: Sex workers' customers
alternative label: Sex-buyers
alternative label: Janes
alternative label: Curb crawlers
alternative label: Punters
alternative label: Clientes de prostitutxs
alternative label: Clientes de prostitutos
alternative label: Clientes de prostitutas
alternative label: Compradores de sexo
alternative label: Clientes de sexo
change note: Version 4.2.0
in scheme: v3
narrower: Sugar daddies
narrower: Sugar mamas
preferred label: Clientes de trabajadores sexuales
related: Curb crawling
related: Solicitation of sex work

Clitoris
type: Concept
issued: 2019-05-14
modified: 2025-02-23
replaces: clitoris
comment: Erogenous external organ that is capable of erection under sexual stimulation.
comment: Órgano externo erógeno que es capaz de erección bajo estimulación sexual.
broader: Erogenous body parts
broader: Genitals
change note: Version 4.2.0
has top concept: Erogenous body parts
in scheme: v3
narrower: G-spot
preferred label: Clítoris
related: Clit rings
related: Clitoral sex
related: Clitoroplasty
related: Vaginectomy
related: Clit twisting

Enemas
type: Concept
issued: 2019-05-14
modified: 2025-02-23
replaces: enemas
comment: A liquid application device used as a douche or to cleanse the bowels or vagina, or usage of such a device. Can be used for sexual or erotic purposes.
comment: Inyecciones de agua u otros líquidos en el recto, normalmente con fines médicos o higiénicos; también se puede utilizar en un contexto erótico.
alternative label: Colonic irrigation
alternative label: Lavativa
alternative label: Hidroterapia de colon
broader: BDSM
broader: Sex accessories
broader: Sex (Act)
broader: Sexual practices
broader: Kink accessories
change note: Version 4.2.0
has top concept: Eroticism
in scheme: v3
related: Ass fucking
related: Anal play
related: Douching

Conversion therapy
type: Concept
issued: 2019-05-14
modified: 2025-02-23
replaces: sexualReorientation
comment: Efforts to change the sexual or gender identity of an individual who is or is suspected to be LGBTQ+ to meet heterosexual or cisgender norms, typically under the belief that being LGBTQ+ is dangerous and/or the result of mental illness or trauma. The processes involved in conversion therapy include visualization training, spiritual interventions, and other aversion treatments.
alternative label: Reparative therapy
alternative label: Reorientation therapy
alternative label: Sexual reorientation therapy
broader: Behavioral therapy
change note: Version 4.2.0
has top concept: Medical care
in scheme: v3
narrower: Gender conversion therapy

Hormone therapy (Gender)
type: Concept
issued: 2019-05-14
modified: 2025-02-23
replaces: hormoneTherapyGender
comment: The process of altering one's sex hormones using hormone blockers and/or doses of testosterone, estrogen, or progesterone.
comment: El proceso de alterar las hormonas sexuales utilizando bloqueadores hormonales y/o dosis de testosterona, estrógeno o progesterona.
alternative label: Cross-gender hormone therapy
alternative label: Hormone reassignment therapy
alternative label: Hormone replacement therapy
alternative label: Terapia de reemplazo hormonal
broader: Therapies
change note: Version 4.2.0
has top concept: Medical care
in scheme: v3
narrower: Estrogen
narrower: Hormone blockers
narrower: Testosterone
preferred label: Terapia hormonal (género)
related: Medication
related: No hormone identity
related: Transgender people
related: Androgens

Cruising (LGBTQ+ culture)
type: Concept
issued: 2019-05-14
modified: 2025-02-23
replaces: cruising
comment: Walking or driving about a locality in search of a sex partner, typically to engage in casual sex.
comment: Caminar o conducir por una localidad en busca de una pareja sexual, generalmente para tener relaciones sexuales casuales.
alternative label: Cruising
alternative label: Cancaneo
broader: Sex (Act)
broader: Sexual practices
change note: Version 4.2.0
has top concept: Sex (Act)
in scheme: v3
preferred label: Cruising (Cultura LGBTQ+)
related: Anonymous sex
related: Casual sex
related: Cottaging (Gay culture)
related: LGBTQ+ meeting places
related: Public sex
related: Tearoom sex

Demisexual people
type: Concept
issued: 2019-05-14
modified: 2025-02-23
replaces: demisexualPeople
comment: Individuals who do not experience sexual attraction unless they have first formed a strong emotional connection with a person.
comment: Personas que no experimentan atracción sexual a menos que primero hayan formado una fuerte conexión emocional con una persona.
broader: Sexual identity
broader: Sexual minorities
broader: Sexual preference
change note: Version 4.2.0
has top concept: Sexual identity
in scheme: v3
narrower: Demisexual college students
preferred label: Personas demisexuales
related: Demisexuality
related: Sexual relationships
related: Compulsory sexuality
related: Demiromantic people

Drag families
type: Concept
issued: 2019-05-14
modified: 2025-02-23
replaces: dragFamilies
comment: Groups of drag performers who share a community and typically live in close quarters with one another. Drag families are headed by drag mothers or drag fathers, with other members termed drag daughters and sons. Members of a drag family typically use the same last name as their drag mother or father (e.g., Xtravaganza) in social contexts or while performing.
comment: Grupos de artistas drag que comparten una comunidad y usualmente viven cerca unos de otros. Las familias drag están encabezadas por madres drag o padres drag, y otros miembros se denominan hijas e hijos drag. Los miembros de una familia drag suelen utilizar el mismo apellido que su madre o padre drag (por ejemplo, Xtravaganza) en contextos sociales o mientras se presentan.
broader: Drag community
broader: LGBTQ+ families
broader: LGBTQ+ chosen families
change note: Version 4.2.0
has top concept: LGBTQ+ communities
in scheme: v3
narrower: Drag fathers
narrower: Drag mothers
preferred label: Familias drag
related: Ballroom families
related: Drag kings
related: Drag queens

Femininities
type: Concept
issued: 2019-05-14
modified: 2025-02-23
replaces: femininity
comment: Culture-specific sets of attributes, behaviors, and roles generally associated with women or girls.
comment: Conjuntos de atributos, comportamientos y roles específicos de una cultura que se asocian generalmente con las mujeres o las niñas.
alternative label: Effeminacy
alternative label: Femininity
alternative label: Feminidad
broader: Gender expression
change note: Version 4.2.0
has top concept: Gender
in scheme: v3
narrower: Transfemininity
narrower: Feminine of center
preferred label: Feminidades
related: Androgyny
related: Femmes
related: Gender roles
related: Masculinities
related: Transfeminine people

Fucking
type: Concept
issued: 2019-05-14
modified: 2025-02-23
replaces: fucking
comment: Slang term (typically regarded as vulgar) for the sexual act of penetrating another individual’s mouth, anus, or vagina with a penis or dildo. May also be used to describe sex acts in general (e.g., "They were fucking.").
comment: Término de la jerga (generalmente considerado vulgar) para el acto sexual de penetrar la boca, el ano o la vagina de otra persona con un pene o un consolador. También se puede utilizar para describir actos sexuales en general (por ejemplo, "Estaban follando").
alternative label: Culear
alternative label: Garchar
alternative label: Echar un polvo
alternative label: Tirar
alternative label: Acostar
alternative label: Chingar
alternative label: Joder
alternative label: Coger
alternative label: Chichar
broader: Clitoral sex
broader: Phallic sex
broader: Sex (Act)
broader: Vaginal sex
change note: Version 4.2.0
has top concept: Sex (Act)
in scheme: v3
narrower: Ass fucking
preferred label: Follar
related: Getting laid
related: Sexual intercourse
related: Sex swings

Gay saunas
type: Concept
issued: 2019-05-14
modified: 2025-02-23
replaces: gaySaunas
comment: Commercial saunas or bathhouses intended for gay men to meet and engage in sexual activities.
comment: Saunas o baños comerciales destinados a que hombres gay se reúnan y realicen actividades sexuales.
alternative label: Gay bathhouses
alternative label: Gay baths
broader: Sex industry
broader: LGBTQ+ night life
broader: Sex locations
change note: Version 4.2.0
has top concept: Sex industry
in scheme: v3
narrower: Glory holes
preferred label: Saunas gay
related: Public sex
related: Sex clubs
related: Police raids on LGBTQ+ bathhouses
related: Play spaces

Gay fiction
type: Concept
issued: 2019-05-14
modified: 2026-02-23
replaces: gayFiction
comment: Written works describing imagined events or people; use in reference to fictional works focusing on gay characters or themes.
comment: Obras escritas que describen eventos o personas imaginadas; utilícese en referencia a obras de ficción que se centran en personajes o temas gay.
broader: LGBTQ+ fiction
change note: Version 4.2.0
has top concept: Subcultures
in scheme: v3
narrower: Gay historical fiction
preferred label: Ficción gay
related: Gay authors
related: Intersex fiction
related: Aromantic fiction
related: Asexual fiction
related: Gay men in fandom
related: Yaoi

Gender swapping
type: Concept
issued: 2019-05-14
modified: 2025-02-23
replaces: genderSwapping
comment: A media trope (commonly used in fanfiction and fanart) in which one or more characters switch binary sexes (e.g., a cisgender man transforms into a cisgender woman), often temporarily.
comment: Un tropo mediático (comúnmente utilizado en fanfiction y fanart) en el que uno o más personajes cambian de sexo binario (por ejemplo, un hombre cisgénero se transforma en una mujer cisgénero), a menudo de forma temporal.
alternative label: Gender roleplay
alternative label: Juego de roles de género
broader: Gender expression
broader: Roleplay
change note: Version 4.2.0
has top concept: Gender
in scheme: v3
preferred label: Intercambio de género
related: Gender roles
related: Fanfiction tropes and genres
related: Femslash
related: Gender in fandom
related: Mpreg
related: Transfic

Genetic parenthood
type: Concept
issued: 2019-05-14
modified: 2025-02-23
replaces: geneticParenthood
comment: The experience of parenthood as felt by parents who passed on genetic material to their child or children.
comment: La experiencia de la maternidad y paternidad tal como la sienten los padres que transmitieron material genético a su hijo o hijos.
alternative label: Paternidad genética
alternative label: Maternidad genetica
broader: Biological parenthood
broader: LGBTQ+ biological parents
change note: Version 4.2.0
has top concept: LGBTQ+ families
in scheme: v3
preferred label: Maternidad y paternidad genética
related: Donors
related: Egg donors
related: Gestational parenthood
related: LGBTQ+ parenthood
related: Donor siblings
related: Half-siblings

Girls
type: Concept
issued: 2019-05-14
modified: 2025-02-23
replaces: girls
comment: Children or youth, typically younger than 18 years old, who identify as girls.
comment: Infancias o jóvenes, generalmente menores de 18 años, que se autoidentifican como niñas.
broader: Children
change note: Version 4.2.0
has top concept: Family members
in scheme: v3
narrower: Bisexual girls
narrower: Heterosexual girls
narrower: Lesbian girls
narrower: Tomboys
narrower: Cisgender girls
preferred label: Niñas
related: Gender binaries
related: Girls' friendships

Oral sex
type: Concept
issued: 2019-05-14
modified: 2025-03-20
replaces: oralSex
comment: Sexual activities performed using the mouth.
comment: Actividades sexuales realizadas utilizando la boca.
alternative label: Giving head
alternative label: Going down
alternative label: Mamar
alternative label: Mamada
broader: Sex (Act)
broader: Sexual practices
change note: Version 4.2.0
has top concept: Sex (Act)
in scheme: v3
narrower: Fellatio
narrower: Cunnilingus
narrower: Kissing
narrower: Licking
narrower: 69ing
preferred label: Sexo oral
related: Rimming

LGBT
type: Concept
issued: 2019-05-14
modified: 2025-02-23
replaces: LGBT
comment: Acronym used to describe lesbians, gay men, bisexual people, and transgender people as a group.
comment: Acrónimo utilizado para describir a lesbianas, hombres gay, personas bisexuales y personas transgénero como grupo.
alternative label: GLBT
broader: LGBTI
broader: LGBTQ
change note: Version 4.2.0
has top concept: LGBTI
in scheme: v3
narrower: LBT
narrower: LGB
related: Bisexual community
related: Gay community
related: Lesbian community
related: Transgender community

Hijras
type: Concept
issued: 2019-05-14
modified: 2025-10-28
replaces: hijra
comment: Hindi word used in South Asia to refer to people assigned male at birth who identify as women or “not-men.”
comment: Palabra hindi utilizada en el sur de Asia para referirse a personas asignadas al sexo masculino al nacer que se autoidentifican como mujeres o "no hombres".
broader: Non-Euro-American gender and sexual identities
change note: Version 4.2.0
has top concept: Gender
in scheme: v3
related: Aravani
related: Eunuchs
related: Chakka
related: Jogappa
related: Khusra
related: Kinnar
related: Kothis

HIV-positive people
type: Concept
issued: 2019-05-14
modified: 2025-02-23
replaces: HIV-positivePeople
comment: People who have contracted HIV.
comment: Personas que han contraído el VIH.
alternative label: HIV-seropositive people
change note: Version 4.2.0
in scheme: v3
narrower: HIV-undetectable people
preferred label: Personas positivas al VIH
related: HIV/AIDS
related: LGBTQ+ peer support
related: HIV-negative people
related: Serodiscordant couples
related: Serostatus

Homosexuality
type: Concept
issued: 2019-05-14
modified: 2025-02-23
replaces: homosexuality
comment: Sexual orientation with sexual and/or romantic attraction to individuals of the same sex.
comment: Orientación sexual con atracción sexual y/o romántica hacia personas del mismo sexo.
broader: Sexual orientation
broader: Monosexuality
change note: Version 4.2.0
has top concept: Sexual orientation
in scheme: v3
narrower: Ritual homosexuality
preferred label: Homosexualidad
related: Bisexuality
related: Gay men
related: Lesbians
related: Heterosexuality
related: Lesbianism

Homosociality
type: Concept
issued: 2019-05-14
modified: 2025-02-23
replaces: homosociality
comment: A concept used to describe the social bonds that exist between members of the same sex or gender in a given culture.
comment: Concepto utilizado para describir los vínculos sociales que existen entre miembros del mismo sexo o género en una cultura determinada.
alternative label: Homosocial bonds
alternative label: Lazos homosociales
alternative label: Vínculos homosociales
change note: Version 4.2.0
in scheme: v3
narrower: Boys' friendships
narrower: Women's friendships
narrower: Girls' friendships
narrower: Men's friendships
preferred label: Homosocialidad
related: Friendships
related: Heterosociality
related: Male bonding

Intersectionality
type: Concept
issued: 2019-05-14
modified: 2025-02-23
replaces: intersectionality
comment: A theoretical framework first conceptualized by Kimberlé Crenshaw to describe how different facets of social identity (such as gender, race, ethnicity, disability, socioeconomic class, religion, and sexual identity) overlap and intersect, often compounding the individual's experiences with inequality and discrimination.
comment: Un marco teórico conceptualizado y acuñado por Kimberlé Crenshaw para describir cómo las diferentes facetas de la identidad social (como el género, la raza, el origen étnico, la discapacidad, la clase socioeconómica, la religión y la identidad sexual) se superponen y entrecruzan, a menudo agravando las experiencias de la persona con la desigualdad y la discriminación.
change note: Version 4.2.0
in scheme: v3
preferred label: Interseccionalidad
related: Diversity
related: LGBTQ+ people of shared ethnic or national identities
related: Social privilege
related: Black feminism
related: White feminism
related: Womanism
related: Transfeminism

Intersex movement
type: Concept
issued: 2019-05-14
modified: 2025-04-23
replaces: intersexMovement
comment: Umbrella term for activism focused on the rights of intersex people and issues faced by intersex communities.
comment: Término general para el activismo centrado en los derechos de las personas intersex y los problemas que enfrentan las comunidades intersex.
broader: LGBTQ+ movement
change note: Version 4.2.0
has top concept: Social movements
in scheme: v3
preferred label: Movimiento intersex
related: Intersex
related: Intersex people
related: LGBTI
related: LGBTQ+
related: LGBTQIA
related: Social movements
related: Intersex demonstrations

Leather daddies
type: Concept
issued: 2019-05-14
modified: 2025-02-23
replaces: leatherDaddies
comment: People who participate in leather communities and identify as leather daddies.
comment: Personas que participan en comunidades leather y se autoidentifican como papis leather.
broader: Leather community
broader: Leather people
change note: Version 4.2.0
has top concept: LGBTQ+ communities
in scheme: v3
preferred label: Papis leather
related: Leather families
related: Leather mommies
related: Leathermen
related: Leatherwomen
related: Leatherboys
related: Leathergirls

Leather families
type: Concept
issued: 2019-05-14
modified: 2025-02-23
replaces: leatherFamilies
comment: Multiple people who participate in leather communities and identify as a leather family.
comment: Múltiples personas que participan en comunidades de cuero y se autoidentifican como una familia leather.
alternative label: Leather household
broader: Leather community
broader: Leather people
change note: Version 4.2.0
has top concept: LGBTQ+ communities
in scheme: v3
preferred label: Familias leather
related: Leather daddies
related: Leather mommies
related: Leathermen
related: Leatherwomen
related: Leatherboys
related: Leathergirls

Leather mommies
type: Concept
issued: 2019-05-14
modified: 2025-02-23
replaces: leatherMommies
comment: People who participate in leather communities and identify as leather mommies.
comment: Mujeres mayores, a menudo lesbianas, que forman parte de la comunidad de cuero; típicamente utilizado para describir a las dominatrices.
broader: Leather community
broader: Leather people
change note: Version 4.2.0
has top concept: LGBTQ+ communities
in scheme: v3
preferred label: Mamis leather
related: Leather daddies
related: Leather families
related: Leathermen
related: Leatherwomen
related: Leatherboys
related: Leathergirls

Leathermen
type: Concept
issued: 2019-05-14
modified: 2025-02-23
replaces: leathermen
comment: People who participate in leather communities and identify as leathermen.
comment: Hombres que tienen fetiches o participan en actividades fetichistas relacionadas con el cuero y pertenecen a la comunidad de cuero; frecuentemente asociados a las subculturas LGBTQ+.
broader: Leather community
broader: Leather people
change note: Version 4.2.0
has top concept: LGBTQ+ communities
in scheme: v3
preferred label: Hombres leather
related: Leather daddies
related: Leather families
related: Leather mommies
related: Leatherwomen
related: Leatherboys
related: Leathergirls

Leatherwomen
type: Concept
issued: 2019-05-14
modified: 2025-02-23
replaces: leatherwomen
comment: People who participate in leather communities and identify as leatherwomen.
comment: Mujeres que tienen fetiches o participan en actividades fetichistas relacionadas con el cuero y pertenecen a la comunidad de cuero; frecuentemente asociadas a subculturas LGBTQ+.
alternative label: Leatherdykes
broader: Leather community
broader: Leather people
change note: Version 4.2.0
has top concept: LGBTQ+ communities
in scheme: v3
preferred label: Mujeres leather
related: Leather daddies
related: Leather families
related: Leather mommies
related: Leathermen
related: Leatherboys
related: Leathergirls

Lesbian fiction
type: Concept
issued: 2019-05-14
modified: 2026-02-23
replaces: lesbianFiction
comment: Written works describing imagined events or people; use in reference to fictional works focusing on lesbian characters or themes.
comment: Obras escritas que describen eventos o personas imaginadas; utilícese en referencia a obras de ficción que se centran en personajes o temas lésbicos.
broader: LGBTQ+ fiction
broader: Femslash
change note: Version 4.2.0
has top concept: Subcultures
in scheme: v3
narrower: Lesbian historical fiction
preferred label: Ficción lésbica
related: Lesbian authors
related: Lesbians in fandom
related: Yuri
related: Girls’ Love (Genre)
related: Baihe

LGBTQ+ adoptive parents
type: Concept
issued: 2019-05-14
modified: 2025-02-23
replaces: LGBTQAdoptiveParents
comment: Parents who adopt and who are LGBTQ+ people.
comment: Padres y/o madres que adoptan y que son personas LGBTQ+.
alternative label: LGBTQ adoptive parents
alternative label: Madres adoptivos LGBTQ+
alternative label: Padres adoptivos LGBTQ+
broader: LGBTQ+ families
broader: LGBTQ+ adoption
broader: LGBTQ+ parenthood
broader: LGBTQ+ parents
change note: Version 4.2.0
has top concept: LGBTQ+ families
in scheme: v3
preferred label: Madres y padres adoptivos LGBTQ+
related: Adoptive parents
related: Birth parents
related: LGBTQ+ adoptive families
related: LGBTQ+ foster parents

LGBTQ+ biological parents
type: Concept
issued: 2019-05-14
modified: 2025-02-23
replaces: LGBTQBiologicalParents
comment: Biological or genetic parents who are LGBTQ+ people. For adoption contexts, use LGBTQ+ birth parents.
alternative label: LGBTQ biological parents
broader: LGBTQ+ families
broader: LGBTQ+ parents
change note: Version 4.2.0
has top concept: LGBTQ+ families
in scheme: v3
narrower: Biological parenthood
narrower: Genetic parenthood
narrower: Gestational parenthood
related: Birth parents
related: LGBTQ+ family planning
related: LGBTQ+ parenthood

Dating applications
type: Concept
issued: 2019-05-14
modified: 2025-07-16
modified: 2025-04-01
replaces: datingApplications
replaces: LGBTQDatingApplications
comment: Software applications designed to generate connections between people interested in romantic or sexual relationships.
comment: Aplicaciones de software diseñadas para generar conexiones entre personas interesadas en relaciones románticas o sexuales.
comment: Software applications designed to generate connections between LGBTQ+ people interested in romantic or sexual relationships.
comment: Aplicaciones de software diseñadas para generar conexiones entre personas LGBTQ+ interesadas en relaciones románticas o sexuales.
alternative label: Dating apps
alternative label: Apps de citas
alternative label: LGBTQ dating applications
alternative label: Aplicaciones de citas LGBTQ
broader: Social media
broader: LGBTQ+ social media
change note: Version 4.2.0
has top concept: Social media
has top concept: LGBTQ+ social media
in scheme: v3
preferred label: Aplicaciones de citas
preferred label: LGBTQ+ dating applications
preferred label: Aplicaciones de citas LGBTQ+
related: Cybersex
related: Dating websites
related: LGBTQ+ online dating
related: LGBTQ+ dating websites
related: LGBTQ+ meeting places
related: Digital identification of LGBTQ+ people by police
related: LGBTQ+ dating

LGBTQ+ dating websites
type: Concept
issued: 2019-05-14
modified: 2025-04-01
replaces: LGBTQDatingWebsites
comment: Websites designed to generate connections between LGBTQ+ people interested in romantic or sexual relationships.
comment: Sitios web diseñados para generar conexiones entre personas LGBTQ+ interesadas en relaciones románticas o sexuales.
alternative label: LGBTQ dating websites
alternative label: Sitios web de citas LGBTQ
broader: LGBTQ+ websites
change note: Version 4.2.0
has top concept: LGBTQ+ websites
in scheme: v3
preferred label: Sitios web de citas LGBTQ+
related: Dating applications
related: LGBTQ+ meeting places
related: Digital identification of LGBTQ+ people by police
related: LGBTQ+ dating
related: LGBTQ+ online dating

LGBTQ+ immigration rights
type: Concept
issued: 2019-05-14
modified: 2025-02-23
replaces: LGBTQImmigrationRights
comment: Legal and social entitlement to freedom, equality, and protection held by LGBTQ+ immigrants.
comment: Derecho legal y social a la libertad, la igualdad y la protección que tienen los inmigrantes LGBTQ+.
alternative label: LGBTQ immigration rights
alternative label: Derechos de inmigración LGBTQ
alternative label: Derechos migratorios LGBTQ+
broader: Legal status
change note: Version 4.2.0
has top concept: Legal status
in scheme: v3
preferred label: Derechos de inmigracion LGBTQ+
related: Detention of LGBTQ+ people
related: LGBTQ+ refugees
related: Official documentation
related: Passports
related: Undocumented LGBTQ+ residents
related: LGBTQ+ immigrants
related: LGBTQ+ asylum seekers

Being in love
type: Concept
is replaced by: homoit0000894
issued: 2019-05-14
modified: 2022-10-13
modified: 2026-02-27
replaces: beingInLove
replaces: LGBTQLove
comment: Strong feelings of affection arising out of kinship, personal ties, or intimate relationships between two or more LGBTQ+ people. Can be used to describe the particularities of love as experienced by LGBTQ+ people in a given culture, as well as the ways love is discussed and expressed within LGBTQ+ communities.
comment: Fuertes sentimientos de afecto que surgen del parentesco, los vínculos personales o las relaciones íntimas entre dos o más personas LGBTQ+. Puede utilizarse para describir las particularidades del amor experimentado por las personas LGBTQ+ en una cultura determinada, así como las formas en que se discute y expresa el amor dentro de las comunidades LGBTQ+.
alternative label: LGBTQ love
alternative label: Love (LGBTQ)
alternative label: Amor LGBTQ
alternative label: Amor (LGBTQ)
change note: Version 4.2.0
in scheme: v3
narrower: LGBTQ+ platonic love
narrower: LGBTQ+ unrequited love
preferred label: LGBTQ+ love
preferred label: Amor LGBTQ+
related: Relationship satisfaction
related: Queer desire

LGBTQ+ refugees
type: Concept
issued: 2019-05-14
modified: 2025-02-23
replaces: LGBTQRefugees
comment: LGBTQ+ people who have fled to another country to escape war, persecution, natural disaster, or other forms of conflict. Only use for people legally recognized as refugees; otherwise, use LGBTQ+ asylum seekers.
comment: Personas LGBTQ+ que han huido a otro país para escapar de la guerra, la persecución, los desastres naturales u otras formas de conflicto. Utilícese únicamente para personas legalmente reconocidas como refugiadas; en caso contrario, utilícese "solicitantes de asilo LGBTQ+".
alternative label: Refugees (LGBTQ)
alternative label: LGBTQ refugees
alternative label: Refugiados LGBTQ
alternative label: Refugiados (LGBTQ)
broader: LGBTQ+ people
change note: Version 4.2.0
has top concept: LGBTQ+ people
in scheme: v3
preferred label: Refugiados LGBTQ+
related: Legal status
related: LGBTQ+ immigration rights
related: LGBTQ+ migrants
related: LGBTQ+ persecutions
related: Undocumented LGBTQ+ residents
related: LGBTQ+ immigrants
related: LGBTQ+ asylum seekers

Motherhood
type: Concept
issued: 2019-05-14
modified: 2025-02-23
replaces: motherhood
comment: The state, condition, or fact of being a mother.
comment: El estado, la condición o el hecho de ser madre.
alternative label: Maternity
change note: Version 4.2.0
in scheme: v3
preferred label: Maternidad
related: Biological parenthood
related: LGBTQ+ adoptive parenthood
related: LGBTQ+ family planning
related: LGBTQ+ foster parenthood
related: LGBTQ+ motherhood
related: LGBTQ+ parenthood
related: Mothers

Men who have sex with men
type: Concept
issued: 2019-05-14
modified: 2025-02-23
replaces: menWhoHaveSexWithMen
comment: Men who engage in sexual activity with other men, whether or not they identify as gay or bisexual.
comment: Hombres que participan de actividades sexuales con otros hombres, se autoidentifiquen o no como gay o bisexuales.
alternative label: MSM
broader: LGBTQ+ people
broader: Males
change note: Version 4.2.0
has top concept: LGBTQ+ people
in scheme: v3
preferred label: Hombres que tienen sexo con hombres
related: Banjees
related: Bisexual men
related: Down-low
related: Gay men
related: Same-gender-loving
related: Sexual minorities

Misogyny
type: Concept
issued: 2019-05-14
modified: 2025-02-23
replaces: misogyny
comment: Hate or dislike of women or girls.
comment: Odio o desagrado hacia las mujeres o las niñas.
change note: Version 4.2.0
in scheme: v3
narrower: Misogyny in fandom
preferred label: Misoginia
related: Intolerance towards LGBTQ+ people
related: Social privilege
related: Transmisogyny
related: Transmisogynoir
related: Misogynoir

LGBTQ+ Muslims
type: Concept
issued: 2019-05-14
modified: 2025-02-23
replaces: muslimsLGBTQ
comment: LGBTQ+ people who are Muslim.
comment: Personas LGBTQ+ que son musulmanas.
alternative label: Muslims (LGBTQ)
alternative label: Musulmanes (LGBTQ)
broader: LGBTQ+ African religions
change note: Version 4.2.0
has top concept: LGBTQ+ African religions
in scheme: v3
narrower: Bisexual Muslims
narrower: Gay Muslims
narrower: Lesbian Muslims
narrower: Queer Muslims
narrower: Transgender Muslims
narrower: Intersex Muslims
narrower: Asexual Muslims
preferred label: Musulmanes LGBTQ+

Nipple play
type: Concept
issued: 2019-05-14
modified: 2025-02-23
replaces: nipplePlay
comment: Sexual acts involving stimulation of the nipples.
comment: Actos sexuales que implican la estimulación de los pezones.
alternative label: Nipple sex
alternative label: Sexo de pezones
broader: Sex (Act)
broader: Sexual practices
broader: Breast play
broader: Chest play
change note: Version 4.2.0
has top concept: Sex (Act)
in scheme: v3
narrower: Nipple torture
preferred label: Juego de pezones
related: Breast fetish
related: Nipple
related: Breast torture

Otters (Gay culture)
type: Concept
issued: 2019-05-14
modified: 2025-02-23
replaces: otters
comment: U.S. slang term term for gay men who blend the physical and social traits of bears and twinks.
comment: Término de la jerga estadounidense para referirse a hombres gay que combinan los rasgos físicos y sociales de los osos y los twinks.
alternative label: Otter men
alternative label: Otters
alternative label: Chicos nutrias
alternative label: Nutrias
broader: Gay culture
broader: Gay men
broader: Gender roles
broader: Sexual identity
change note: Version 4.2.0
has top concept: Subcultures
in scheme: v3
preferred label: Nutrias (cultura gay)
related: Bears (Gay culture)
related: Gender expression
related: Pups (Roleplay)
related: Wolves (Gay culture)

LGBTQ+ Roman Catholics
type: Concept
issued: 2019-05-14
modified: 2025-02-23
replaces: romanCatholicsLGBTQ
comment: LGBTQ+ people who are members of the Roman Catholic Church.
comment: Personas LGBTQ+ que son miembros de la Iglesia católica romana.
alternative label: Roman Catholics (LGBTQ)
alternative label: Católicos romanos (LGBTQ)
broader: LGBTQ+ Christians
change note: Version 4.2.0
has top concept: LGBTQ+ African religions
in scheme: v3
narrower: Bisexual Roman Catholics
narrower: Gay Roman Catholics
narrower: Lesbian Roman Catholics
narrower: Queer Roman Catholics
narrower: Transgender Roman Catholics
narrower: Asexual Roman Catholics
narrower: Intersex Roman Catholics
preferred label: Personas católico romanas LGBTQ+

Sex parties
type: Concept
issued: 2019-05-14
modified: 2025-02-23
replaces: sexParties
comment: Social gatherings or events, typically held in private residences or at sex clubs, in which participants engage in or observe group sexual activities.
comment: Encuentros o eventos sociales, generalmente celebrados en residencias privadas o en clubes sexuales, donde quienes participan forman parte de u observan actividades sexuales grupales.
broader: Sex locations
change note: Version 4.2.0
has top concept: Sex locations
in scheme: v3
narrower: Safer sex parties
preferred label: Fiestas sexuales
related: Dark rooms
related: Casual sex
related: Group sex
related: Sex clubs
related: Sexuality
related: Leather and kink conventions

Sexual diversity
type: Concept
issued: 2019-05-14
modified: 2025-02-23
replaces: sexualDiversity
comment: Diversity of sexual orientation or sexuality among members of a group or within a given society.
comment: Diversidad de orientación sexual o sexualidad entre miembros de un grupo o dentro de una sociedad determinada.
broader: Diversity
change note: Version 4.2.0
has top concept: Diversity
in scheme: v3
narrower: Polysexuality
preferred label: Diversidad sexual
related: LGBTQ+
related: Sexual function
related: Sexual identity
related: Sexual orientation
related: Sexual preference
related: Monosexuality

Sexual function
type: Concept
issued: 2019-05-14
modified: 2025-02-23
replaces: sexualFunction
comment: The process by which an individual's body experiences and reacts to sexual stimuli.
comment: El proceso por el cual el cuerpo de una persona experimenta y reacciona a estímulos sexuales.
broader: Sexual orientation
change note: Version 4.2.0
has top concept: Sexual orientation
in scheme: v3
preferred label: Función sexual
related: Libido
related: Sex (Act)
related: Sexual excitement
related: Sexual diversity
related: Sexual dysfunction
related: Sexual health
related: Sexuality

LGBTQ+ sons
type: Concept
issued: 2019-05-14
modified: 2025-02-23
replaces: sonsLGBTQ
comment: Sons who identify as LGBTQ+.
comment: Hijos que se identifican como LGBTQ+.
alternative label: Sons (LGBTQ)
alternative label: Hijos LGBTQ
broader: LGBTQ+ people
broader: Sons
change note: Version 4.2.0
has top concept: LGBTQ+ people
in scheme: v3
narrower: Bisexual sons
narrower: Gay sons
narrower: Queer sons
narrower: Transgender sons
narrower: Asexual sons
narrower: Intersex sons
preferred label: Hijos LGBTQ+

Transgender fiction
type: Concept
issued: 2019-05-14
modified: 2026-02-23
replaces: transgenderFiction
comment: Written works describing imagined events or people; use in reference to fictional works focusing on transgender characters or themes.
comment: Obras escritas que describen eventos o personas imaginadas; utilícese en referencia a obras de ficción que se centran en personajes o temas transgénero.
broader: LGBTQ+ fiction
change note: Version 4.2.0
has top concept: Subcultures
in scheme: v3
narrower: Transgender historical fiction
preferred label: Ficción transgénero
related: Transgender authors
related: Intersex fiction
related: Aromantic fiction
related: Asexual fiction
related: Transfic
related: Transgender people in fandom

Transgender parents
type: Concept
issued: 2019-05-14
modified: 2025-02-23
replaces: transgenderParents
comment: Transgender people who are parents.
comment: Personas transgénero que son padres y/o madres.
alternative label: Madres transgénero
alternative label: Padres transgénero
broader: LGBTQ+ parents
broader: Transgender people
change note: Version 4.2.0
has top concept: LGBTQ+ families
in scheme: v3
narrower: Transgender fathers
narrower: Transgender mothers
preferred label: Madres y padres transgénero
related: Children of transgender people
related: Transgender families
related: LGBTQ+ family generations
related: People with transgender parents

Transsexualism
type: Concept
issued: 2019-05-14
modified: 2025-02-23
replaces: transsexualism
comment: An individual's identification with a gender inconsistent with or not culturally associated with their assigned sex.
comment: La identificación de una persona con un género inconsistente o no asociado culturalmente con su sexo asignado.
broader: Medicalization
broader: Transgenderism
change note: Version 4.2.0
has top concept: Medical care
in scheme: v3
preferred label: Transexualismo
related: Eonism
related: Transsexuality
related: Transsexual people
related: Transitioning (Gender)
related: Voice therapy (Gender)
related: Trans

Womyn
type: Concept
issued: 2019-05-14
modified: 2025-02-23
replaces: womyn
comment: A spelling of "woman" or "women" that first appeared in print in 1976 and is used in certain feminist circles to avoid having the suffix of "men." Some contemporary transgender activists have criticized use of the word "womyn" due to its prevalence in trans-exclusionary radical feminist (TERF) circles following the exclusion of trans women from the Michigan Womyn’s Music Festival.
comment: Una grafía de "woman" o "women" (que en español significa "mujer" o "mujeres") que apareció impresa por primera vez en 1976 y se utiliza en ciertos círculos feministas para evitar tener el sufijo "men" (que en español significa "hombres"). Algunos activistas transgénero contemporáneos han criticado el uso de la palabra "womyn" debido a su prevalencia en los círculos feministas radicales transexclusivos (TERF) tras la exclusión de las mujeres trans del Festival de Música Womyn de Michigan.
change note: Version 4.2.0
in scheme: v3
related: Anti-transgender discrimination
related: Feminism
related: Radical feminism
related: Wimmin
related: Females
related: Women's music festivals
related: Trans exclusivity

Monosexuality
type: Concept
issued: 2020-06-03
modified: 2025-02-23
replaces: monosexuality
comment: A sexuality that involves attraction to only one gender; includes homosexuality and heterosexuality.
comment: Una sexualidad que implica la atracción hacia un solo género; incluye la homosexualidad y la heterosexualidad.
broader: Sexual orientation
change note: Version 4.2.0
has top concept: Sexual orientation
in scheme: v3
narrower: Heterosexuality
narrower: Homosexuality
preferred label: Monosexualidad
related: Sexual diversity
related: Sexual identity
related: Sexual preference
related: Mononormativity
related: Monosexual people

Trans women
type: Concept
issued: 2020-12-11
modified: 2025-02-23
replaces: transWomen
comment: Women whose gender assigned at birth was not female. Do not use for intersex people unless the intersex person identifies as a trans woman.
comment: Mujeres a las que se les asignó al sexo masculino al nacer.
alternative label: Transgender women
alternative label: Transwomen
alternative label: Trans-women
alternative label: Mujeres transgénero
broader: Transgender people
broader: Females
change note: Version 4.2.0
has top concept: LGBTQ+ people
in scheme: v3
narrower: MtFs
preferred label: Mujeres trans
related: Assigned male at birth
related: Estrogen
related: Transfemininity
related: Feminine of center
related: Transfeminism

Trans men
type: Concept
issued: 2020-12-11
modified: 2025-02-23
replaces: transMen
comment: Men whose gender assigned at birth was not male. Do not use for intersex people unless the intersex person identifies as a trans man.
comment: Hombres a los que se les asignó al sexo femenino al nacer.
alternative label: Transgender men
alternative label: Transmen
alternative label: Trans-men
alternative label: Hombres transgénero
broader: Males
broader: Transgender people
change note: Version 4.2.0
has top concept: Gender
in scheme: v3
narrower: FtMs
preferred label: Hombres trans
related: Assigned female at birth
related: Binding (Chest)
related: Testosterone
related: Transmasculinity
related: Masculine of center

Demigirls
type: Concept
issued: 2021-06-30
modified: 2025-02-23
replaces: demigirls
comment: People who partially, but not fully, identify women or girls irrespective of their assigned genders. Used by cisgender, transgender, transfeminine, or nonbinary people who feel more strongly aligned with women physically or socially, but not strongly enough to identify solely as one.
comment: Personas que se autoidentifican parcial, pero no completamente, como mujeres o niñas independientemente de su género asignado. Utilizado por personas cisgénero, transgénero, transfemeninas o no binarias que se sienten más alineadas con las mujeres física o socialmente, pero no lo suficiente como para identificarse únicamente como tal.
alternative label: Demiwomen
alternative label: Demiwoman
alternative label: Demigirl
alternative label: Demilady
alternative label: Demiladies
alternative label: Demifemale people
broader: Demigender people
change note: Version 4.2.0
has top concept: LGBTQ+ people
in scheme: v3
preferred label: Deminiñas
related: Cisgender people
related: Non-binary people
related: Transfeminine people
related: Demiboys
related: Transfemininity
related: Demigender identity
related: Feminine of center

Demiboys
type: Concept
issued: 2021-06-30
modified: 2025-02-23
replaces: demiboys
comment: People who partially, but not fully, identify as men or boys irrespective of their assigned genders. Used by cisgender, transgender, transmasculine, or nonbinary people who feel more aligned with men physically or socially, but not strongly enough to identify solely as one.
comment: Personas que se autoidentifican parcial, pero no totalmente, como hombres o niños independientemente de su género asignado. Utilizado por personas cisgénero, transgénero, transmasculinas o no binarias que se sienten más alineadas física o socialmente con los hombres, pero no lo suficiente como para identificarse únicamente como tal.
alternative label: Demiguy
alternative label: Demiguys
alternative label: Demimen
alternative label: Demimales
alternative label: Demimale people
alternative label: Demiboy
broader: Demigender people
change note: Version 4.2.0
has top concept: LGBTQ+ people
in scheme: v3
preferred label: Deminiños
related: Cisgender people
related: Non-binary people
related: Transmasculine people
related: Demigirls
related: Transmasculinity
related: Demigender identity
related: Masculine of center

Non-monogamous people
type: Concept
issued: 2021-06-30
modified: 2025-02-23
replaces: nonMonogamousPeople
comment: People who practice romantic or sexual relationships with more than one person simultaneously.
comment: Personas que practican relaciones románticas o sexuales con más de una persona simultáneamente.
broader: Relationship minorities
change note: Version 4.2.0
has top concept: Relationship minorities
in scheme: v3
narrower: Metamours
narrower: Anchor partners
narrower: Nesting partners
narrower: Paramours
narrower: Polyamorous people
narrower: Relationship anarchists
preferred label: Personas no monógamas
related: Polycules

Polyamorous people
type: Concept
issued: 2021-06-30
modified: 2025-03-20
replaces: polyamorousPeople
comment: People who engage in romantic, sexual, or play relationships with more than one person simultaneously, with the knowledge and consent of all parties involved.
comment: Personas que mantienen relaciones románticas, sexuales o de juego con más de una persona simultáneamente, con el conocimiento y consentimiento de todas las partes involucradas.
broader: Relationship minorities
broader: Non-monogamous people
change note: Version 4.2.0
has top concept: Relationship minorities
in scheme: v3
preferred label: Personas poliamorosas
related: Polyamory
related: Anchor partners
related: Nesting partners
related: NRE (New Relationship Energy)
related: Polycules
related: Polyamorous families

Lesbian-focused businesses
type: Concept
issued: 2021-11-02
modified: 2025-02-23
comment: Businesses focusing on lesbian clientele and products related to lesbian communities.
comment: Empresas enfocadas en clientela lésbica y productos relacionados con comunidades lésbicas.
broader: LGBTQ+-focused businesses
change note: Version 4.2.0
has top concept: LGBTQ+-focused businesses
in scheme: v3
preferred label: Negocios orientados a lesbianas
related: LGBTQ+ employment
related: LGBTQ+-owned businesses
related: Gay-focused businesses
related: Bisexual-focused businesses
related: Transgender-focused businesses
related: Queer-focused businesses
related: Lesbians in the workplace

Gay-focused businesses
type: Concept
issued: 2021-11-02
modified: 2025-02-23
comment: Businesses focusing on gay clientele and products related to gay communities.
comment: Empresas enfocadas en clientela gay y productos relacionados con las comunidades gay.
broader: LGBTQ+-focused businesses
change note: Version 4.2.0
has top concept: LGBTQ+-focused businesses
in scheme: v3
preferred label: Negocios orientados a hombres gay
related: LGBTQ+ employment
related: LGBTQ+-owned businesses
related: Lesbian-focused businesses
related: Bisexual-focused businesses
related: Transgender-focused businesses
related: Queer-focused businesses
related: Gay men in the workplace

Bisexual-focused businesses
type: Concept
issued: 2021-11-02
modified: 2025-02-23
comment: Businesses focusing on bisexual clientele and products related to bisexual communities.
comment: Empresas enfocadas en clientela bisexual y productos relacionados con comunidades bisexuales.
broader: LGBTQ+-focused businesses
change note: Version 4.2.0
has top concept: LGBTQ+-focused businesses
in scheme: v3
preferred label: Negocios orientados a bisexuales
related: LGBTQ+ employment
related: LGBTQ+-owned businesses
related: Lesbian-focused businesses
related: Gay-focused businesses
related: Transgender-focused businesses
related: Queer-focused businesses
related: Bisexual people in the workplace

Transgender-focused businesses
type: Concept
issued: 2021-11-02
modified: 2025-02-23
comment: Businesses focusing on transgender clientele and products related to transgender communities.
comment: Empresas enfocadas en clientela transgénero y productos relacionados con comunidades transgénero.
broader: LGBTQ+-focused businesses
change note: Version 4.2.0
has top concept: LGBTQ+-focused businesses
in scheme: v3
preferred label: Negocios orientados a personas transgénero
related: LGBTQ+ employment
related: LGBTQ+-owned businesses
related: Lesbian-focused businesses
related: Gay-focused businesses
related: Bisexual-focused businesses
related: Queer-focused businesses
related: Transgender people in the workplace

Queer-focused businesses
type: Concept
issued: 2021-11-02
modified: 2025-02-23
comment: Businesses focusing on queer clientele and products related to queer communities.
comment: Empresas enfocadas en clientela queer y productos relacionados con comunidades queer.
broader: LGBTQ+-focused businesses
change note: Version 4.2.0
has top concept: LGBTQ+-focused businesses
in scheme: v3
preferred label: Negocios orientados a personas queer
related: LGBTQ+ employment
related: LGBTQ+-owned businesses
related: Lesbian-focused businesses
related: Gay-focused businesses
related: Bisexual-focused businesses
related: Transgender-focused businesses
related: Queer people in the workplace

Lesbian chefs
type: Concept
issued: 2021-12-07
modified: 2025-02-23
comment: Lesbians who are trained, professional cooks, typically holding a leadership role in the kitchen in which they are employed.
comment: Lesbianas que son cocineras profesionales capacitadas y que normalmente desempeñan un papel de liderazgo en la cocina en la que trabajan.
broader: LGBTQ+ chefs
change note: Version 4.2.0
has top concept: LGBTQ+ people
in scheme: v3
preferred label: Cocineras lesbianas
related: Lesbian employment
related: Gay chefs
related: Bisexual chefs
related: Transgender chefs
related: Queer chefs
related: Intersex chefs
related: Asexual chefs

Gay chefs
type: Concept
issued: 2021-12-07
modified: 2025-02-23
comment: Gay men who are trained, professional cooks, typically holding a leadership role in the kitchen in which they are employed.
comment: Hombres gay que son cocineros profesionales entrenados y que generalmente desempeñan un papel de liderazgo en la cocina en la que trabajan.
broader: LGBTQ+ chefs
change note: Version 4.2.0
has top concept: LGBTQ+ people
in scheme: v3
preferred label: Cocineros gay
related: Gay employment
related: Lesbian chefs
related: Bisexual chefs
related: Transgender chefs
related: Queer chefs
related: Intersex chefs
related: Asexual chefs

Bisexual chefs
type: Concept
issued: 2021-12-07
modified: 2025-02-23
comment: Bisexual people who are trained, professional cooks, typically holding a leadership role in the kitchens in which they are employed.
comment: Personas bisexuales que son cocineras profesionales y capacitadas, quienes normalmente desempeñan un papel de liderazgo en las cocinas en las que trabajan.
alternative label: Chefs bisexuales
alternative label: Cocineras bisexuales
broader: LGBTQ+ chefs
change note: Version 4.2.0
has top concept: LGBTQ+ people
in scheme: v3
preferred label: Cocineros bisexuales
related: Bisexual employment
related: Lesbian chefs
related: Gay chefs
related: Transgender chefs
related: Queer chefs
related: Intersex chefs
related: Asexual chefs

Transgender chefs
type: Concept
issued: 2021-12-07
modified: 2025-02-23
comment: Transgender people who are trained, professional cooks, typically holding a leadership role in the kitchen in which they are employed.
comment: Personas transgénero que son cocineras profesionales capacitadas y que normalmente desempeñan un papel de liderazgo en la cocina en la que trabajan.
broader: LGBTQ+ chefs
change note: Version 4.2.0
has top concept: LGBTQ+ people
in scheme: v3
preferred label: Cocineros transgénero
related: Transgender employment
related: Lesbian chefs
related: Gay chefs
related: Bisexual chefs
related: Queer chefs
related: Intersex chefs
related: Asexual chefs

Queer chefs
type: Concept
issued: 2021-12-07
modified: 2025-02-23
comment: Queer people who are trained, professional cooks, typically holding a leadership role in the kitchen in which they are employed.
comment: Personas queer que son cocineras profesionales y capacitadas, que normalmente desempeñan un papel de liderazgo en la cocina en la que trabajan.
alternative label: Chef queer
broader: LGBTQ+ chefs
change note: Version 4.2.0
has top concept: LGBTQ+ people
in scheme: v3
preferred label: Cocineros queer
related: Queer employment
related: Lesbian chefs
related: Gay chefs
related: Bisexual chefs
related: Transgender chefs
related: Intersex chefs
related: Asexual chefs

Indigiqueer people
type: Concept
issued: 2022-01-19
modified: 2025-02-23
comment: Indigenous queer people who recognize their queer identity as salient to their Indigenous identity and vice versa; some but not all Indigiqueer people also identify as Two-Spirit; only use to describe individuals who self-identify as Indigiqueer.
comment: Personas indígenas queer que reconocen su identidad queer como parte importante de su identidad indígena y viceversa; algunas, pero no todas, las personas indigequeer también se identifican como dos espíritus; utilícese únicamente para describir a personas que se autoidentifiquen como indigequeer.
broader: Indigenous LGBTQ+ people
broader: Queer people
change note: Version 4.2.0
has top concept: LGBTQ+ people
in scheme: v3
preferred label: Personas indigequeer
related: Aboriginal Australian LGBTQ+ people
related: Inuit LGBTQ+ people
related: Papuan LGBTQ+ people
related: Native American LGBTQ+ people
related: Two-Spirit people
related: Indigiqueer

Indigiqueer
type: Concept
issued: 2022-01-19
modified: 2025-02-23
comment: Term used to describe the identity of people who are both Indigenous and queer and view those identities as inherently related and interconnected.
comment: Término utilizado para describir la identidad de personas que son tanto indígenas como queer y ven esas identidades como inherentemente relacionadas e interconectadas.
broader: Non-Euro-American gender and sexual identities
change note: Version 4.2.0
has top concept: Gender
in scheme: v3
preferred label: Indigequeer
related: Aboriginal Australian LGBTQ+ people
related: Inuit LGBTQ+ people
related: Takatāpui
related: Papuan LGBTQ+ people
related: Native American LGBTQ+ people
related: Two-Spirit people
related: Indigiqueer people

LGBTQ+ immigrants
type: Concept
issued: 2022-01-24
modified: 2025-02-23
comment: LGBTQ+ people who have moved to another country.
comment: Personas LGBTQ+ que se han mudado a otro país.
alternative label: Immigrants (LGBTQ)
alternative label: Inmigrantes (LGBTQ)
broader: LGBTQ+ people
change note: Version 4.2.0
has top concept: LGBTQ+ people
in scheme: v3
preferred label: Inmigrantes LGBTQ+
related: LGBTQ+ immigration rights
related: LGBTQ+ migrants
related: LGBTQ+ refugees
related: Official documentation
related: Passports
related: Undocumented LGBTQ+ residents
related: LGBTQ+ asylum seekers

Scrotoplasty
type: Concept
issued: 2022-02-14
modified: 2025-02-23
comment: Surgical construction of the scrotum.
comment: Construcción quirúrgica del escroto.
alternative label: Oscheoplasty
broader: Bottom surgery
change note: Version 4.2.0
has top concept: Medical care
in scheme: v3
preferred label: Escrotoplastia
related: Penis
related: Testicle
related: Transitioning (Gender)
related: Metoidioplasty
related: Vaginectomy
related: Phalloplasty
related: Neophallus

LGBTQ+ asylum seekers
type: Concept
issued: 2022-02-15
modified: 2025-02-23
comment: LGBTQ+ people who have left their home countries and are seeking protection from persecution and/or human rights violations in other countries but have not yet been legally recognized as refugees.
comment: Personas LGBTQ+ que han abandonado sus países de origen y buscan protección en otros países contra la persecución y/o violaciones de derechos humanos, pero que aún no han sido reconocidas legalmente como refugiadas.
alternative label: Asylum seekers (LGBTQ)
alternative label: Solicitantes de asilo (LGBTQ)
broader: LGBTQ+ people
change note: Version 4.2.0
has top concept: LGBTQ+ people
in scheme: v3
preferred label: Solicitantes de asilo LGBTQ+
related: LGBTQ+ immigration rights
related: LGBTQ+ migrants
related: LGBTQ+ refugees
related: Official documentation
related: Passports
related: Undocumented LGBTQ+ residents
related: LGBTQ+ immigrants

Neophallus
type: Concept
issued: 2022-02-28
modified: 2025-02-23
comment: A surgically constructed penis; typically made using tissue grafts from other parts of the body.
comment: Un pene construido quirúrgicamente; por lo general, se elabora con tejido injertado de otras partes del cuerpo.
broader: Gender-affirming surgery
broader: Penis
change note: Version 4.2.0
has top concept: Medical care
in scheme: v3
preferred label: Neofalo
related: Transitioning (Gender)
related: Metoidioplasty
related: Scrotoplasty
related: Vaginectomy
related: Phalloplasty
related: Stand-to-Pee devices

Monosexual people
type: Concept
issued: 2022-03-31
modified: 2025-02-23
comment: Individuals who are attracted to only one gender; includes gay people and straight people.
comment: Personas que se sienten atraídas por un solo género; incluye a personas homosexuales y heterosexuales.
alternative label: Monosexuals
alternative label: Monosexuales
change note: Version 4.2.0
in scheme: v3
preferred label: Personas monosexuales
related: Heterosexuals
related: Homosexuals
related: Sexual identity
related: Sexual orientation
related: Sexual preference
related: Mononormativity
related: Monosexuality

Feminist theory
type: Concept
issued: 2022-06-15
modified: 2025-02-23
comment: The extension of feminism into theoretical, fictional, or philosophical discourse, often seeking to understand the nature of gender inequity.
comment: La extensión del feminismo al discurso teórico, ficticio o filosófico, que a menudo trata de comprender la naturaleza de la desigualdad de género.
alternative label: Feminist philosophy
alternative label: Theory of feminism
alternative label: Filosofía feminista
alternative label: Teoría del feminismo
broader: Theories
change note: Version 4.2.0
has top concept: Theories
in scheme: v3
narrower: Female gaze
narrower: Male gaze
narrower: Rape culture
narrower: Feminist film criticism
preferred label: Teoría feminista
related: Feminism
related: Gender studies
related: Queer studies

Indian LGBTQ+ people
type: Concept
issued: 2022-06-15
modified: 2025-02-23
comment: LGBTQ+ people who were born in India or are of Indian descent. Do not conflate with the Indigenous peoples of the United States.
comment: Personas LGBTQ+ que nacieron en la India o son de ascendencia india. No se debe confundir con los pueblos indígenas de los Estados Unidos.
alternative label: Indian people (LGBTQ)
alternative label: Indians (LGBTQ)
alternative label: LGBTQ+ Indians
alternative label: Personas LGBTQ+ de la India
alternative label: Personas indias LGBTQ+
broader: South Asian LGBTQ+ people
change note: Version 4.2.0
has top concept: LGBTQ+ people
in scheme: v3
narrower: Indian lesbians
narrower: Indian gay men
narrower: Indian bisexual people
narrower: Indian queer people
narrower: Indian intersex people
narrower: Indian transgender people
narrower: Indian asexual people
preferred label: Personas LGBTQ+ indias

Bisexual people in fandom
type: Concept
issued: 2022-07-04
modified: 2025-02-23
comment: The participation and inclusion of bisexual people in fan communities.
comment: Personas bisexuales que son las parejas románticas, sexuales o de juego de otra persona o personas.
alternative label: Bisexuals in fandom
broader: LGBTQ+ people in fandom
change note: Version 4.2.0
has top concept: LGBTQ+ people
in scheme: v3
preferred label: Parejas bisexuales
related: Bisexual fiction
related: Bisexual people
related: Bisexual authors
related: Asexual fiction
related: Megasexual fiction
related: Greyromantic fiction

Furries
type: Concept
issued: 2022-07-04
modified: 2025-02-23
comment: Individuals who are interested in anthropomorphized animals, as well as fiction and artwork featuring anthropomorphized animals. Many furries identify with anthropomorphized animal versions of themselves, which are called fursonas.
comment: Personas interesadas en animales antropomorfizados, así como en ficción y obras de arte que presenten animales antropomorfizados. Muchos furros se autoidentifican con versiones animales antropomorfizadas de sí mismos, que se llaman "fursonas".
broader: Furry fandom
change note: Version 4.2.0
has top concept: Subcultures
in scheme: v3
narrower: Fursonas
narrower: Fursuits
narrower: Yiff
preferred label: Furros
related: Role behavior
related: Roleplay
related: Animal roleplay
related: Furry culture

Yaoi
type: Concept
issued: 2022-07-04
modified: 2025-02-23
comment: Japanese word used by English-speaking anime and manga fans to describe explicit or pornographic works featuring male-male couples that are typically created by heterosexual female authors for heterosexual female readers. Note that the Japanese meaning and usage of "yaoi" and related terms differ considerably.
comment: Palabra japonesa utilizada por los fanáticos del anime y el manga de habla inglesa para describir obras explícitas o pornográficas que presentan parejas de hombres y que generalmente son creadas por autoras heterosexuales para lectoras heterosexuales. Tenga en cuenta que el significado y el uso japonés de "yaoi" y términos relacionados difieren considerablemente.
broader: Yaoi fandom
change note: Version 4.2.0
has top concept: Subcultures
in scheme: v3
narrower: Seme (Yaoi)
narrower: Uke (Yaoi)
related: Gay fiction
related: Gay erotic literature
related: Hentai
related: Original slash fiction
related: Slash fanworks

LGBTQ+ cinema
type: Concept
issued: 2022-11-15
modified: 2025-02-23
comment: Term that encompasses LGBTQ+ filmmaking, the LGBTQ+ film industry, and film as an art form within LGBTQ+ culture. For specific movies created by or representing LGBTQ+ people, use the term "LGBTQ+ films."
comment: Término que abarca el cine LGBTQ+, la industria cinematográfica LGBTQ+ y el cine como forma de arte dentro de la cultura LGBTQ+. Para películas específicas creadas por personas LGBTQ+ o que las representen, utilice el término "películas LGBTQ+".
alternative label: Cinema (LGBTQ)
alternative label: Film (LGBTQ)
alternative label: LGBTQ+ film
broader: LGBTQ+ arts
change note: Version 4.2.0
has top concept: Subcultures
in scheme: v3
narrower: LGBTQ+ films
narrower: Lesbian cinema
narrower: Gay cinema
narrower: Drag in film
narrower: LGBTQ+ film criticism
preferred label: Cine LGBTQ+
related: LGBTQ+ film censorship
related: LGBTQ+ film festivals

Mothers of LGBTQ+ people
type: Concept
issued: 2022-12-13
modified: 2025-02-23
comment: People who act as a mother to one or more LGBTQ+ person. For mothers who are themselves LGBTQ+, use the term "LGBTQ+ mothers."
comment: Personas que actúan como madre de una o más personas LGBTQ+. Para las madres que son LGBTQ+, utilice el término "madres LGBTQ+".
alternative label: Moms of LGBTQ+ people
alternative label: Mamás de personas LGBTQ+
broader: Mothers
change note: Version 4.2.0
has top concept: Family members
in scheme: v3
narrower: Mothers of bisexual people
narrower: Mothers of gay men
narrower: Mothers of lesbians
narrower: Mothers of transgender people
narrower: Mothers of queer people
narrower: Mothers of asexual people
narrower: Mothers of intersex people
preferred label: Madres de personas LGBTQ+

Sons of LGBTQ+ people
type: Concept
issued: 2022-12-13
modified: 2025-02-23
comment: Sons who have one or more LGBTQ+ parent. For sons who are themselves LGBTQ+, use the term "LGBTQ+ sons."
comment: Hijos que tienen uno o más padres LGBTQ+. Para los hijos que son LGBTQ+, utilice el término "hijos LGBTQ+".
broader: Sons
change note: Version 4.2.0
has top concept: Family members
in scheme: v3
narrower: Sons of bisexual people
narrower: Sons of gay men
narrower: Sons of lesbians
narrower: Sons of transgender people
narrower: Sons of queer people
narrower: Sons of intersex people
narrower: Sons of asexual people
preferred label: Hijos de personas LGBTQ+

Partners of LGBTQ+ people
type: Concept
issued: 2022-12-13
modified: 2025-02-23
comment: Individuals who have one ore more romantic, sexual, or play partner who is LGBTQ+.
comment: Personas que tienen una o más parejas románticas, sexuales o de juego que sean LGBTQ+.
broader: Partners
change note: Version 4.2.0
has top concept: Partners
in scheme: v3
narrower: Partners of bisexual people
narrower: Partners of gay men
narrower: Partners of lesbians
narrower: Partners of queer people
narrower: Partners of transgender people
narrower: Partners of intersex people
narrower: Partners of asexual people
preferred label: Parejas de personas LGBTQ+

Parents
type: Concept
issued: 2022-12-13
modified: 2025-02-23
comment: People who act as parents to one or more people.
comment: Personas que actúan como padres y/o madres de una o más personas.
broader: Family members
change note: Version 4.2.0
has top concept: Family members
in scheme: v3
narrower: Adoptive parents
narrower: Birth parents
narrower: Foster parents
narrower: LGBTQ+ parents
narrower: Parents of crossdressers
narrower: Two-Spirit parents
narrower: Parents of LGBTQ+ people
preferred label: Madres y padres

Police raids on LGBTQ+-related establishments
type: Concept
issued: 2023-01-13
modified: 2025-02-23
comment: Unexpected and unannounced entry into and searches of establishments owned or frequented by LGBTQ+ people by law enforcement officers with the aim of using surprise to seize evidence or arrest suspects. Police raids may be undertaken legally using a search warrant or through exigent circumstances, such as probable cause, though the latter is highly subjective and civilians often have little resources to appeal illegal raids.
comment: Un registro no anunciado y sin orden judicial de una residencia o un establecimiento principalmente afiliado o relacionado con comunidades o identidades LGBTQ+ por parte de la policía. Estos ataques suelen ser traumáticos y caóticos y pueden eludir los procedimientos penales típicos y las libertades civiles.
alternative label: Anti-LGBTQ+ police raids
alternative label: Police raids on LGBTQ+ establishments
alternative label: Police raids on LGBTQ+ venues
alternative label: Police raids to LGBTQ+ venues
alternative label: Redadas policiales anti-LGBTQ+
alternative label: Redadas policiales en establecimientos LGBTQ+
alternative label: Redadas policiales en lugares LGBTQ+
broader: Police raids
broader: Police violence toward LGBTQ+ people
change note: Version 4.2.0
has top concept: Harassment
in scheme: v3
narrower: Police raids on LGBTQ+ bathhouses
narrower: Police raids on LGBTQ+ meeting places
narrower: Police raids on LGBTQ+ bars
narrower: Police raids on LGBTQ+ nightclubs
preferred label: Redadas policiales en establecimientos relacionados con comunidades LGBTQ+|| Redadas policiales en establecimientos relacionados con identidades LGBTQ+
related: LGBTQ+-owned businesses
related: LGBTQ+-focused businesses

Demisexual authors
type: Concept
issued: 2023-03-26
modified: 2025-03-13
comment: Demisexual creators of written works.
comment: Creadores de obras escritas conocidos por ser demisexuales.
broader: LGBTQ+ authors
change note: Version 4.2.0
has top concept: LGBTQ+ people
in scheme: v3
preferred label: Autores demisexuales
related: Demisexual fiction
related: Demisexual poetry
related: Demisexual literature
related: Demisexual autobiographies
related: Demisexual biographies
related: Demisexual literary criticism
related: Demisexual people's writings

Megasexual authors
type: Concept
issued: 2023-04-11
modified: 2025-03-13
comment: Megasexual creators of written works.
comment: Creadores de obras escritas conocidos por ser megasexuales.
broader: LGBTQ+ authors
change note: Version 4.2.0
has top concept: LGBTQ+ people
in scheme: v3
preferred label: Autores megasexuales
related: Megasexual fiction
related: Megasexual literature
related: Megasexual poetry
related: Megasexual autobiographies
related: Megasexual biographies
related: Megasexual literary criticism
related: Megasexual people's writings

Armenian LGBTQ+ people
type: Concept
issued: 2023-04-11
modified: 2025-02-23
comment: LGBTQ+ people who are ethnically Armenian.
comment: Personas LGBTQ+ de etnia armenia.
alternative label: LGBTQ+ Armenians
alternative label: Armenios LGBTQ+
alternative label: Armenios LGBTQ
alternative label: Armenias LGBTQ+
alternative label: Armenias LGBTQ
broader: LGBTQ+ people of shared ethnic or national identities
change note: Version 4.2.0
has top concept: LGBTQ+ people
in scheme: v3
narrower: Armenian gay men
narrower: Armenian lesbians
narrower: Armenian bisexual people
narrower: Armenian queer people
narrower: Armenian transgender people
narrower: Armenian intersex people
narrower: Armenian asexual people
preferred label: Personas LGBTQ+ armenias

Greyromantic authors
type: Concept
issued: 2023-04-11
modified: 2025-03-13
comment: Greyromantic creators of written works.
comment: Creadores de obras escritas conocidos por ser grisrománticos.
broader: LGBTQ+ authors
change note: Version 4.2.0
has top concept: LGBTQ+ people
in scheme: v3
preferred label: Autores grisrománticos
related: Greyromantic fiction
related: Greyromantic poetry
related: Greyromantic literature
related: Greyromantic autobiographies
related: Greyromantic biographies
related: Greyromantic literary criticism
related: Greyromantic people's writings

Non-binary fiction
type: Concept
issued: 2023-04-12
modified: 2026-02-23
comment: Written works describing imagined events or people; use in reference to fictional works focusing on non-binary characters or themes.
comment: Obras escritas que describen eventos o personas imaginadas; utilícese en referencia a obras de ficción que se centran en personajes o temas no binarios.
alternative label: Nonbinary fiction
broader: LGBTQ+ fiction
change note: Version 4.2.0
has top concept: Subcultures
in scheme: v3
narrower: Non-binary romance fiction
narrower: Non-binary mystery and detective fiction
narrower: Non-binary horror fiction
narrower: Non-binary science fiction
narrower: Non-binary fantasy fiction
narrower: Non-binary urban fantasy fiction
narrower: Non-binary historical fiction
preferred label: Ficción no binaria

Two-Spirit press
type: Concept
issued: 2023-06-27
modified: 2025-02-23
comment: Newspapers, magazines, or other publishing outlets aimed at Two-Spirit audiences and/or operated by Two-Spirit people.
comment: Periódicos, revistas u otros medios editoriales dirigidos a audiencias dos espíritus y/o operados por personas dos espíritus.
alternative label: 2S press
alternative label: Two Spirit press
alternative label: Two Spirited press
alternative label: Two-Spirited press
change note: Version 4.2.0
in scheme: v3
narrower: Two-Spirit newsletters
narrower: Two-Spirit newspapers
narrower: Two-Spirit zines
preferred label: Prensa dos espíritus
related: LGBTQ+ press

Impact play
type: Concept
issued: 2023-12-15
modified: 2025-02-23
comment: An activity where a person is struck repeatedly, with or without an implement, for erotic play.
comment: Actividad en la que se golpea repetidamente a una persona, con o sin un instrumento, como parte de juegos eróticos.
alternative label: Beating
alternative label: Cropping
broader: BDSM
change note: Version 4.2.0
has top concept: Eroticism
in scheme: v3
narrower: Flagellation
narrower: Spanking
narrower: Whipping
narrower: Paddling
narrower: Caning
narrower: Flogging
preferred label: Juegos de impacto
related: Gloves (Erotic)

Body fluids
type: Concept
issued: 2023-12-18
modified: 2025-03-20
comment: Naturally occurring fluids produced by the human body.
comment: Fluidos naturales producidos por el cuerpo humano.
alternative label: Feces
alternative label: Milk
alternative label: Snot
alternative label: Sweat
alternative label: Urine
alternative label: Vomit
alternative label: Heces
alternative label: Sudor
alternative label: Leche
alternative label: Mocos
alternative label: Vómito
alternative label: Orina
change note: Version 4.2.0
in scheme: v3
narrower: Cum
narrower: Jizz
narrower: Squirting
preferred label: Fluidos corporales
related: Urine play

Leatherboys
type: Concept
issued: 2023-12-18
modified: 2025-02-23
comment: People who participate in leather communities and identify as leatherboy.
comment: Personas que participan en comunidades de cuero y se autoidentifican como leatherboys.
broader: Leather community
broader: Leather people
change note: Version 4.2.0
has top concept: LGBTQ+ communities
in scheme: v3
preferred label: Chicos leather
related: Leather daddies
related: Leather families
related: Leather mommies
related: Leathermen
related: Leatherwomen
related: Leathergirls

Leathergirls
type: Concept
issued: 2023-12-18
modified: 2025-02-23
comment: People who participate in leather communities and identify as leathergirls.
comment: Personas que participan en comunidades de cuero y se autoidentifican como leathergirls.
broader: Leather community
broader: Leather people
change note: Version 4.2.0
has top concept: LGBTQ+ communities
in scheme: v3
preferred label: Chicas leather
related: Leather daddies
related: Leather families
related: Leather mommies
related: Leathermen
related: Leatherwomen
related: Leatherboys

Lateral oppression
type: Concept
issued: 2023-12-18
modified: 2025-02-23
comment: The phenomenon in which someone in a marginalized group displaces violence or oppression onto other members of their own group, often by acting on internalized oppressive beliefs (i.e., negative perceptions of and intolerance toward any marginalized identities they hold) adopted as a result of being raised or socialized within an oppressive environment or culture.
comment: El fenómeno a través del cual una persona de un grupo marginado desplaza la violencia u opresión hacia otros miembros de su propio grupo, a menudo, actuando sobre la base de creencias opresivas internalizadas (es decir, percepciones negativas e intolerancia hacia cualquier identidad marginada que tengan), adoptadas como resultado de haber sido criadas o socializadas dentro de un entorno o una cultura opresiva.
alternative label: Lateral violence
change note: Version 4.2.0
in scheme: v3
narrower: Lateral lesbophobia
narrower: Lateral homophobia
narrower: Lateral biphobia
narrower: Lateral transphobia
narrower: Lateral queerphobia
narrower: Lateral intersexphobia
preferred label: Opresión lateral
related: Internalized oppression

Pregnant people
type: Concept
issued: 2024-06-19
modified: 2025-02-23
comment: People who are pregnant, meaning that a fertilized egg is developing in their uterus.
change note: Version 4.2.0
in scheme: v3
narrower: Pregnant men
narrower: Pregnant women
narrower: Pregnant intersex people
narrower: Pregnant transgender people
narrower: Pregnant non-binary people
narrower: Pregnant Two-Spirit people
narrower: Pregnant māhū

LGBTQ+ film criticism
type: Concept
issued: 2024-10-23
modified: 2025-02-23
comment: The analysis and evaluation of LGBTQ+ films and film history, or film criticism from an LGBTQ+ perspective.
alternative label: Film criticism (LGBTQ)
alternative label: LGBTQ+ film critique
alternative label: Film critique (LGBTQ)
alternative label: LGBTQ+ film analysis
alternative label: Film analysis (LGBTQ)
broader: LGBTQ+ cinema
change note: Version 4.2.0
has top concept: Subcultures
in scheme: v3
narrower: Lesbian film criticism
narrower: Gay film criticism
narrower: Bisexual film criticism
narrower: Transgender film criticism
narrower: Queer film criticism
related: LGBTQ+ literary criticism
related: Feminist film criticism

Detrans people
type: Concept
issued: 2026-02-23
modified: 2026-02-23
comment: People who cease or reverse the social and/or medical process of gender transitioning for any reason, including health concerns, lack of support, economic issues, personal safety, stigma, and a changing understanding of or relationship to their gender. Detransitioning may be temporary or permanent. Detrans people may still identify as trans or under the trans umbrella. Only use for people who self-identify as detrans or detransitioners.
alternative label: Detransitioners
change note: Version 4.2.0
in scheme: v4
related: Detransitioning
related: Transitioning status
related: Retransitioning
related: Desistance (Gender)
related: Transgender people
related: Anti-transgender discrimination
related: Transgender health care bans

Asexuality
type: Concept
issued: 2019-05-14
modified: 2025-02-23
replaces: asexuality
comment: A sexual orientation generally characterized by a lack of sexual attraction or desire.
comment: Orientación sexual caracterizada generalmente por la falta de atracción o deseo sexual.
alternative label: Ace
broader: Sexual orientation
change note: Version 4.2.0
has top concept: Sexual orientation
in scheme: v3
preferred label: Asexualidad
related: Aromantic people
related: Asexual people
related: LGBTQ+
related: LGBTQIA
related: Sexual abstinence
related: Virginity
related: Compulsory sexuality
related: Aromanticism

Afro-Latin American LGBTQ+ people
type: Concept
issued: 2019-05-14
modified: 2025-02-23
replaces: afroLatinAmericansLGBTQ
comment: LGBTQ+ people of African descent born in Latin American countries or LGBTQ+ people born in African countries who live in or have a strong connection to Latin America. Only use for individuals who self-identify as Afro-Latin American.
comment: Personas LGBTQ+ afrodescendientes nacidas en países latinoamericanos o personas LGBTQ+ nacidas en países africanos que viven o tienen una conexión fuerte con América Latina. Utilícese únicamente para personas que se identifiquen como afrolatinoamericanas.
alternative label: Afro-Latin American people (LGBTQ)
alternative label: Afro-Latin Americans (LGBTQ)
alternative label: LGBTQ+ Afro-Latin American people
alternative label: LGBTQ+ Afro-Latin Americans
alternative label: Afrolatinoamericanos LGBTQ+
alternative label: Personas afrolatinoamericanas LGBTQ+
alternative label: Afrolatinoamericanos (LGBTQ)
alternative label: Afrolatinoamericanas LGBTQ+
alternative label: Afrolatinoamericanas (LGBTQ)||
broader: Black LGBTQ+ people
broader: Latino/a/x LGBTQ+ people
change note: Version 4.2.0
has top concept: LGBTQ+ people
in scheme: v3
narrower: Afro-Latin American bisexual people
narrower: Afro-Latin American gay men
narrower: Afro-Latin American lesbians
narrower: Afro-Latin American queer people
narrower: Afro-Latin American transgender people
narrower: Afro-Latin American asexual people
narrower: Afro-Latin American intersex people
preferred label: Personas LGBTQ+ afrolatinoamericanas

LGBTQ+ atheists
type: Concept
issued: 2019-05-14
modified: 2025-02-23
replaces: atheistsLGBTQ
comment: LGBTQ+ people who do not believe in the existence of God or gods.
comment: Personas LGBTQ+ que son ateas.
alternative label: Atheists (LGBTQ)
alternative label: Ateos (LGBTQ)
broader: LGBTQ+ people
change note: Version 4.2.0
has top concept: LGBTQ+ people
in scheme: v3
narrower: Bisexual atheists
narrower: Gay atheists
narrower: Lesbian atheists
narrower: Queer atheists
narrower: Transgender atheists
narrower: Intersex atheists
narrower: Asexual atheists
preferred label: Ateos LGBTQ+
related: LGBTQ+ African religions

Ball culture
type: Concept
issued: 2019-05-14
modified: 2025-02-23
replaces: ballCulture
comment: A subculture that emerged in early 20th century New York City in which primarily African-American and Latin American LGBTQ+ people perform and compete for various prizes.
comment: Subcultura surgida en la ciudad de Nueva York a principios del siglo XX en la que personas LGBTQ+ principalmente afroamericanas y latinoamericanas actúan y compiten por diversos premios.
alternative label: Ballroom community
alternative label: Ballroom culture
alternative label: Ballroom scene
alternative label: Drag ball culture
alternative label: House-ballroom culture
alternative label: Comunidad ballroom
alternative label: Cultura ball
alternative label: Cultura ballroom
alternative label: Escena ballroom
alternative label: Cultura drag ball
alternative label: Cultura de casas ballroom
broader: Subcultures
change note: Version 4.2.0
has top concept: Subcultures
in scheme: v3
narrower: Ballroom families
preferred label: Cultura del ball
related: Banjees
related: Drag balls
related: Drag community
related: Sexual identity
related: Voguing
related: Reading (LGBTQ+ culture)
related: Kiki (Social Gathering)

Birth certificates
type: Concept
issued: 2019-05-14
modified: 2025-03-20
replaces: birthCertificates
comment: Legal documents issued to record an individual’s birth, typically including identifying information such as the individual's name, assigned gender or sex, date and location of birth, and parentage.
comment: Documentos legales expedidos para registrar el nacimiento de una persona, que suelen incluir información identificativa como el nombre de la persona, el sexo o género asignado, la fecha y el lugar de nacimiento y el parentesco.
broader: Official documentation
change note: Version 4.2.0
has top concept: Legal status
in scheme: v3
narrower: Birth certificate amendments
narrower: Gender markers
preferred label: Certificados de nacimiento
related: Gender assigned at birth
related: Legal name change
related: Court orders
related: Medical practitioners' statements
related: Social security cards
related: Transitioning (Gender)

Gender assigned at birth
type: Concept
issued: 2019-05-14
modified: 2025-02-23
replaces: genderAssignedAtBirth
comment: The legal gender marker recorded in birth-related certifications and registries. Often but not always used synonymously with “sex assigned at birth." Also used in reference to the gendered roles and expectations associated with said gender marker.
comment: El marcador legal de género registrado en las certificaciones y registros relacionados con el nacimiento. A menudo, pero no siempre, se utiliza como sinónimo de "sexo asignado al nacer". También se utiliza en referencia a los roles de género y las expectativas asociadas con dicho marcador de género.
alternative label: Birth gender
alternative label: Natal gender
alternative label: GAAB
alternative label: Assigned gender at birth
alternative label: AGAB
alternative label: Designated gender at birth
alternative label: DGAB
alternative label: Gender at birth
broader: Assigned gender
change note: Version 4.2.0
has top concept: Gender
in scheme: v3
preferred label: Género asignado al nacer
related: Birth certificate amendments
related: Birth certificates
related: Cisgender people
related: Gender dysphoria
related: Gender markers
related: Sex assigned at birth
related: Transgender people
related: Gender euphoria

Birth parents
type: Concept
issued: 2019-05-14
modified: 2025-02-23
replaces: birthParents
comment: Biological or genetic parents of a child or children placed for adoption.
comment: Padres y/o madres biológicos o genéticos del niño o niños dados en adopción.
alternative label: Madres biológicas
alternative label: Padres biológicos
broader: Gestational parenthood
broader: Parents
change note: Version 4.2.0
has top concept: LGBTQ+ families
in scheme: v3
narrower: LGBTQ+ birth parents
preferred label: Madres y padres biológicos
related: Adoptive parents
related: Biological parenthood
related: LGBTQ+ adoption
related: LGBTQ+ adoptive parents
related: LGBTQ+ biological parents
related: Conception by LGBTQ+ people

Bisexual characters
type: Concept
issued: 2019-05-14
modified: 2025-02-23
replaces: bisexualCharacters
comment: Characters in creative works who are bisexual.
comment: Personajes en obras creativas que son bisexuales.
broader: LGBTQ+ characters
change note: Version 4.2.0
has top concept: LGBTQ+ characters
in scheme: v3
preferred label: Personajes bisexuales
related: Bisexual children
related: Bisexual drama
related: Bisexual fiction
related: Bisexual people
related: Bisexual television
related: Asexual fiction
related: Greyromantic fiction

Bisexual community
type: Concept
issued: 2019-05-14
modified: 2025-02-23
replaces: bisexualCommunity
comment: Groups of people who share the experience of being bisexual.
comment: Grupos de personas que comparten la experiencia de ser bisexual.
broader: LGBTQ+ communities
change note: Version 4.2.0
has top concept: LGBTQ+ communities
in scheme: v3
preferred label: Comunidad bisexual
related: Bisexual people
related: LGBT
related: LGB
related: LGBTI
related: LGBTQ
related: LGBTQ+
related: LGBTQIA
related: 2SLGBTQ+

Bootblacking
type: Concept
issued: 2019-05-14
modified: 2025-02-23
replaces: bootblacking
comment: In the leather and kink communities, the act of cleaning and conditioning leather.
comment: En las comunidades del cuero y las kinky, el acto de limpiar y acondicionar las botas, zapatos o prendas de cuero de alguien.
broader: Leather community
change note: Version 4.2.0
has top concept: LGBTQ+ communities
in scheme: v3
related: BDSM
related: Roleplay
related: Uniform fetish
related: Boot fetish
related: Leather fetish
related: Shoe fetish
related: Bootblacks
related: Foot fetish

Civil unions
type: Concept
issued: 2019-05-14
modified: 2025-02-23
replaces: civilUnions
comment: Legally recognized unions with rights similar (but often not identical or equal) to those of marriage, originally created for same-sex couples in jurisdictions where they were not legally allowed to marry.
comment: Uniones legalmente reconocidas con derechos similares (pero a menudo no idénticos o iguales) a los del matrimonio, creadas originalmente para parejas del mismo sexo en jurisdicciones donde no se les permitía casarse legalmente.
alternative label: Civil partnership
alternative label: Registered partnership
alternative label: Unión civil
alternative label: Unión registrada
broader: Living arrangements
change note: Version 4.2.0
has top concept: Living arrangements
in scheme: v3
narrower: Civil union documents
narrower: Civil union certificates
preferred label: Uniones civiles
related: Domestic partnerships
related: Legal status
related: LGBTQ+ personal and family law
related: Marriage
related: Marriage law
related: Official documentation

LGBTQ+ daughters
type: Concept
issued: 2019-05-14
modified: 2025-02-23
replaces: daughtersLGBTQ
comment: Daughters who identify as LGBTQ+.
comment: Hijas que se autoidentifican como LGBTQ+.
alternative label: Daughters (LGBTQ)
alternative label: Hijas (LGBTQ)
broader: LGBTQ+ people
broader: Daughters
change note: Version 4.2.0
has top concept: LGBTQ+ people
in scheme: v3
narrower: Bisexual daughters
narrower: Lesbian daughters
narrower: Queer daughters
narrower: Transgender daughters
narrower: Asexual daughters
narrower: Intersex daughters
preferred label: Hijas LGBTQ+
related: Two-Spirit daughters

Lesbian culture
type: Concept
issued: 2019-05-14
modified: 2025-02-23
replaces: lesbianCulture
comment: Use to describe cultural experiences shared by members of lesbian communities or products of lesbian culture (e.g., art and media created by and for lesbians, activism focused on lesbian issues, slang commonly used in lesbian communities, etc.).
comment: Utilícese para describir experiencias culturales compartidas por miembros de comunidades lésbicas o productos de la cultura lésbica (p. ej., arte y medios creados por y para lesbianas, activismo centrado en cuestiones lésbicas, jerga comúnmente utilizada en comunidades lésbicas, etc.).
alternative label: Dyke culture
broader: LGBTQ+ culture
change note: Version 4.2.0
has top concept: Subcultures
in scheme: v3
narrower: Butch-femme relationships
narrower: Dykes on bikes
narrower: Lesbian choruses
narrower: Women's music
narrower: Lesbian slang
preferred label: Cultura lésbica
related: Sexual identity
related: Queer culture
related: Bisexual culture

LGBTQ+ older people
type: Concept
issued: 2019-05-14
modified: 2025-02-23
replaces: olderPeopleLGBTQ
comment: LGBTQ+ people who are advanced in age, typically defined as older than 60 years of age.
comment: Personas LGBTQ+ de edad avanzada, normalmente definidas como mayores de 60 años.
alternative label: Elderly (LGBTQ)
alternative label: Senior citizens (LGBTQ)
alternative label: Seniors (LGBTQ)
alternative label: Older people (LGBTQ)
alternative label: Personas envejecientes (LGBTQ)
alternative label: Personas de tercera edad LGBTQ+
alternative label: Personas en su tercera edad (LGBTQ)
alternative label: Viejos LGBTQ+
alternative label: Gente mayor LGBTQ+
broader: LGBTQ+ people
change note: Version 4.2.0
has top concept: LGBTQ+ people
in scheme: v3
narrower: Older bisexual people
narrower: Older gay men
narrower: Older lesbians
narrower: Older queer people
narrower: Older transgender people
preferred label: Personas LGBTQ+ en su tercera edad
related: LGBTQ+ older people's organizations
related: LGBTQ+ retirement homes

Eonism
type: Concept
issued: 2019-05-14
modified: 2025-02-23
replaces: eonism
comment: Historical term used to describe people assigned male at birth who adopt feminine behaviors.
comment: Término histórico utilizado para describir a las personas asignadas al sexo masculino al nacer y que adoptan comportamientos femeninos.
broader: Gender expression
broader: LGBTQ+ historical terms
broader: Medicalization
change note: Version 4.2.0
has top concept: Gender
in scheme: v3
preferred label: Eonismo
related: Crossdressing
related: Eonist people
related: Sexual inversion
related: Transgenderism
related: Transsexualism
related: Transvestism

FtMs
type: Concept
issued: 2019-05-14
modified: 2025-02-23
replaces: FtMs
comment: FtM (female-to-male) is a mostly historical term which has been largely replaced by “trans men.” This is due in part to the term's role in the medicalization of transgender people and the assumption that trans men were previously “female” and have become “male” (typically through hormones and/or surgery).
comment: FtM (del inglés "female-to-male", traducido como "de mujer a hombre") es un término mayoritariamente histórico que ha sido reemplazado en gran medida por "hombres trans". Esto se debe, en parte, al rol del término en la medicalización de las personas transgénero y a la suposición de que los hombres trans antes eran “femeninos” y se han convertido en “masculinos” (generalmente, a través de hormonas y/o cirugía).
alternative label: Females transitioning to males
alternative label: FtM transsexuals
alternative label: F2Ms
alternative label: Transsexual men
alternative label: Female-to-male
alternative label: Mujer-a-hombre
alternative label: Mujeres transicionando a hombres
alternative label: Transexuales FTM
alternative label: Hombres transexuales
broader: LGBTQ+ historical terms
broader: Transsexual people
broader: Trans men
change note: Version 4.2.0
has top concept: LGBTQ+ historical terms
in scheme: v3
preferred label: FTMs
related: Binding (Chest)
related: Brotherboys
related: FtXs
related: MtFs
related: MtXs
related: Testosterone

Gay movement
type: Concept
issued: 2019-05-14
modified: 2025-04-17
replaces: gayMovement
comment: Umbrella term for activism focused on the rights of gay men and issues faced by gay communities.
comment: Hombres gay que son madres. Esto incluye a hombres trans que tuvieron hijos antes de su transición y aún se identifican como madres de esos niños. No se debe utilizar para describir a padres gay a menos que se autoidentifiquen como madres.
alternative label: Gay organisations
alternative label: Gay organizations
alternative label: Mamás gay
broader: LGBTQ+ movement
change note: Version 4.2.0
has top concept: Social movements
in scheme: v3
narrower: Gay trade union groups
preferred label: Madres gay
related: Gay community centers
related: Gay information centers
related: Gay liberation
related: Gay press
related: Gay radio
related: Gay television
related: Gay demonstrations

Genitals
type: Concept
issued: 2019-05-14
modified: 2025-02-23
replaces: genitals
comment: General term for erogenous and/or reproductive organs (e.g., vagina, clitoris, penis).
comment: Término general para órganos erógenos y/o reproductivos (p. ej., vagina, clítoris, pene).
alternative label: Genitalia
broader: Sex (Body)
change note: Version 4.2.0
has top concept: Sex (Body)
in scheme: v3
narrower: Clitoris
narrower: Penis
narrower: Testicle
narrower: Vagina
narrower: Vulva
preferred label: Genitales
related: Erogenous body parts
related: Sex assigned at birth
related: Genital torture

Information provision
type: Concept
issued: 2019-05-14
modified: 2025-02-23
replaces: informationProvision
comment: Process by which information is provided to individuals or communities.
comment: Proceso mediante el cual se proporciona información a personas o comunidades.
change note: Version 4.2.0
in scheme: v3
narrower: AIDS education
narrower: LGBTQ+ health education
narrower: Sex education
preferred label: Suministro de información
related: LGBTQ+ information centers
related: LGBTQ+ information professionals

Intersex genital mutilation
type: Concept
issued: 2019-05-14
modified: 2025-02-23
replaces: intersexGenitalMutilation
comment: Surgeries or other medical treatments performed, typically on newborn babies or children, to "normalize" the patient's reproductive or sexual anatomy and force their body to conform to medical or social expectations for what is male or female. IGM practices can be performed for cultural, social, or religious reasons. Though they are typically justified through a medical lens, IGM practices are medically unnecessary and non-consensual.
comment: Cirugías u otros tratamientos médicos realizados, generalmente en recién nacidos y niños, para "normalizar" la anatomía sexual o reproductiva del paciente y obligar a su cuerpo a acomodarse a las expectativas médicas o sociales de lo que es masculino o femenino. Las prácticas de MGI se pueden realizar por razones culturales, sociales o religiosas. Aunque normalmente se justifican desde una perspectiva médica, las prácticas de MGI son médicamente innecesarias y no consensuadas.
alternative label: IGM
alternative label: Mutilación genital a personas intersex
change note: Version 4.2.0
in scheme: v3
narrower: Clitoridectomy
narrower: Intersex surgery
preferred label: Mutilación genital intersex
related: Intersex
related: Intersex people
related: Intersexphobia
related: Intersex rights
related: Sex assigned at birth

LGB
type: Concept
issued: 2019-05-14
modified: 2025-02-23
replaces: LGB
comment: Acronym used to describe lesbians, gay people, and bisexuals as a group. This acronym has often been used to exclude transgender people.
comment: Acrónimo utilizado para describir a lesbianas, hombres gay y personas bisexuales como grupo. Este acrónimo se ha utilizado a menudo para excluir a las personas transgénero.
broader: LGBT
broader: LGBTI
broader: LGBTQ
broader: LGBTQ+
broader: LGBTQIA
change note: Version 4.2.0
has top concept: LGBTI
in scheme: v3
related: Bisexual community
related: Gay community
related: Lesbian community
related: Transgender community

LGBTQ
type: Concept
issued: 2019-05-14
modified: 2025-02-23
replaces: LGBTQ
comment: Acronym used to describe lesbians, gay men, bisexual people, transgender people, and queer people as a group.
comment: Acrónimo utilizado para describir a lesbianas, hombres gay, personas bisexuales, personas transgénero y personas queer como grupo.
broader: LGBTQ+
broader: LGBTQIA
change note: Version 4.2.0
has top concept: 2SLGBTQ+
in scheme: v3
narrower: LGBT
narrower: LGB
related: Bisexual community
related: Gay community
related: Lesbian community
related: Queer community
related: Transgender community

Biracial LGBTQ+ people
type: Concept
issued: 2019-05-14
modified: 2025-02-23
replaces: LGBTQBiracialPeople
comment: LGBTQ+ people who belong to two or more racial groups. Only use to describe people who self-identify as biracial.
comment: Personas LGBTQ+ que pertenecen a dos o más grupos raciales. Utilícese únicamente para personas que se autoidentifiquen como birraciales.
alternative label: Bi-racial people (LGBTQ)
alternative label: Biracial people (LGBTQ)
alternative label: Bi-racial LGBTQ+ people
alternative label: LGBTQ+ bi-racial people
alternative label: LGBTQ+ biracial people
alternative label: Personas LGBTQ+ bi-raciales
alternative label: Personas birraciales (LGBTQ)
alternative label: Personas bi-raciales LGBTQ+
alternative label: Personas birraciales LGBTQ+
alternative label: Personas bi-raciales (LGBTQ)||
broader: LGBTQ+ people of color
change note: Version 4.2.0
has top concept: LGBTQ+ people
in scheme: v3
narrower: Biracial lesbians
narrower: Biracial gay men
narrower: Biracial bisexual people
narrower: Biracial transgender people
narrower: Biracial queer people
narrower: Biracial asexual people
narrower: Biracial intersex people
narrower: Biracial non-binary people
preferred label: Personas LGBTQ+ birraciales

LGBTQ+ blind people
type: Concept
issued: 2019-05-14
modified: 2025-02-23
replaces: LGBTQBlindPeople
comment: LGBTQ+ people with significant or total loss of vision.
comment: Personas LGBTQ+ con pérdida significativa o total de la visión.
alternative label: Blind people (LGBTQ)
alternative label: Blind LGBTQ+ people
alternative label: Personas ciegas LGBTQ+
alternative label: Personas ciegas (LGBTQ)
broader: LGBTQ+ disabled people
change note: Version 4.2.0
has top concept: LGBTQ+ people
in scheme: v3
narrower: Lesbian blind people
narrower: Gay blind men
narrower: Bisexual blind people
narrower: Transgender blind people
narrower: Queer blind people
narrower: Asexual blind people
narrower: Intersex blind people
preferred label: Personas LGBTQ+ ciegas
related: Two-Spirit blind people

Conception by LGBTQ+ people
type: Concept
issued: 2019-05-14
modified: 2025-02-23
replaces: ConceptionByLGBTQPeople
comment: Umbrella term used to describe the processes by which LGBTQ+ people conceive children, including an LGBTQ+ person, their partner, or a third party becoming pregnant with a child that will be raised by an LGBTQ+ person, as well as LGBTQ+ people conceiving children that will be raised by other parents.
comment: Término general utilizado para describir los procesos mediante los cuales las personas LGBTQ+ conciben niños, incluyendo a una persona LGBTQ+, su pareja o una tercera persona que queda embarazada con un niño que será criado por una persona LGBTQ+, así como personas LGBTQ+ que conciben niños que serán criados por otros padres.
alternative label: Conception by LGBTQ people
alternative label: Concepción por parte de personas LGBTQ+
broader: LGBTQ+ family planning
change note: Version 4.2.0
has top concept: LGBTQ+ family planning
in scheme: v3
narrower: Insemination
narrower: In vitro fertilization
narrower: Self-insemination
narrower: Surrogacy
preferred label: Concepción por personas LGBTQ+
related: Birth parents
related: Desire to have children
related: Donors
related: LGBTQ+ parents

Romani LGBTQ+ people
type: Concept
issued: 2019-05-14
modified: 2026-02-11
replaces: LGBTQRoma
comment: LGBTQ+ people who are Romani or descend from this traditionally nomadic Indo-European people; only use to refer to people who self-identify as Romani.
comment: Personas LGBTQ+ que son romaníes o parte del pueblo indoeuropeo tradicionalmente nómada.
alternative label: Roma (LGBTQ)
alternative label: Romani people (LGBTQ)
alternative label: LGBTQ+ Roma
alternative label: LGBTQ+ Romani people
alternative label: Personas romaníes LGBTQ+
broader: LGBTQ+ people of shared ethnic or national identities
change note: Version 4.2.0
has top concept: LGBTQ+ people
in scheme: v3
narrower: Romani lesbians
narrower: Romani gay men
narrower: Romani bisexual people
narrower: Romani transgender people
narrower: Romani queer people
narrower: Romani intersex people
narrower: Romani asexual people
narrower: Romani non-binary people
preferred label: Personas LGBTQ+ romaníes

LGBTQ+ magazines
type: Concept
issued: 2019-05-14
modified: 2025-02-23
replaces: LGBTQMagazines
comment: Print or digital publications about LGBTQ+ people and LGBTQ+ issues (typically produced by LGBTQ+ people or LGBTQ+ organizations) that contain articles, photographs, and illustrations, and advertisements.
comment: Publicaciones impresas o digitales sobre personas LGBTQ+ y temas LGBTQ+ (normalmente producidas por personas LGBTQ+ u organizaciones LGBTQ+) que contienen artículos, fotografías, ilustraciones y anuncios.
alternative label: LGBTQ magazines
alternative label: Revistas LGBTQ
broader: LGBTQ+ press
broader: LGBTQ+ periodicals
change note: Version 4.2.0
has top concept: LGBTQ+ press
in scheme: v3
preferred label: Revistas LGBTQ+
related: Bisexual press
related: Gay press
related: Lesbian press
related: LGBTQ+ zines
related: LGBTQ+ newsletters
related: LGBTQ+ newspapers
related: Transgender press

Multiracial LGBTQ+ people
type: Concept
issued: 2019-05-14
modified: 2025-02-23
replaces: LGBTQMultiRacialPeople
comment: LGBTQ+ people who belong to more than one racial group.
comment: Personas LGBTQ+ que pertenecen a dos o más de un grupos raciales. Utilícese únicamente para personas que se autoidentifiquen como multirraciales.
alternative label: Multi-racial people (LGBTQ)
alternative label: Multiracial people (LGBTQ)
alternative label: LGBTQ+ mixed-race people
alternative label: LGBTQ+ multi-racial people
alternative label: LGBTQ+ multiracial people
alternative label: Mixed-race LGBTQ+ people
alternative label: Multi-racial LGBTQ+ people
alternative label: Personas multirraciales LGBTQ+
broader: LGBTQ+ people of color
change note: Version 4.2.0
has top concept: LGBTQ+ people
in scheme: v3
narrower: Multiracial lesbians
narrower: Multiracial gay men
narrower: Multiracial bisexual people
narrower: Multiracial transgender people
narrower: Multiracial queer people
narrower: Multiracial asexual people
narrower: Multiracial intersex people
narrower: Multiracial non-binary people
preferred label: Personas LGBTQ+ multirraciales

LGBTQ+ tourism
type: Concept
issued: 2019-05-14
modified: 2025-02-23
replaces: LGBTQTourism
comment: Industry centered around LGBTQ+ people traveling to and staying in various locations for recreation or leisure.
comment: Industria centrada en personas LGBTQ+ que viajan y se alojan en diversos lugares por motivos de recreación u ocio.
alternative label: LGBTQ tourism
alternative label: Turismo LGBTQ
change note: Version 4.2.0
in scheme: v3
narrower: LGBTQ+ cruises
narrower: LGBTQ+ sex tourism
narrower: LGBTQ+ travel guides
preferred label: Turismo LGBTQ+
related: LGBTQ+ hotels
related: LGBTQ+ restaurants

Māhū
type: Concept
issued: 2019-05-14
modified: 2025-02-23
replaces: mahu
comment: Term used in Hawaiian and Tahitian cultures for third gender people who blend genders and often hold spiritual roles.
comment: Término utilizado en las culturas hawaianas y tahitianas para las personas del tercer género que mezclan géneros y que, a menudo, desempeñan roles espirituales.
alternative label: Mahu
broader: Non-Euro-American gender and sexual identities
broader: MVPFAFF+
change note: Version 4.2.0
has top concept: Gender
in scheme: v3
narrower: Māhūkāne
narrower: Māhūwahine
narrower: Pregnant māhū
narrower: Māhū teachers
narrower: Māhū sex workers
related: Kānaka Maoli LGBTQ+ people
related: Kānaka Maoli transgender people

Marital status
type: Concept
issued: 2019-05-14
modified: 2025-02-23
replaces: maritalStatus
comment: A person's state of being single, married, separated, divorced, or widowed, as defined by a government or legal authority.
comment: El estado de una persona de estar soltera, casada, separada, divorciada o viuda, según lo define un gobierno o una autoridad legal.
broader: Marriage
change note: Version 4.2.0
has top concept: Living arrangements
in scheme: v3
narrower: Divorced people
narrower: Married people
narrower: Single people
narrower: Unmarried couples
narrower: Widowed people
preferred label: Estado civil
related: Legal status
related: LGBTQ+ separation
related: Marriage law

Masturbation
type: Concept
issued: 2019-05-14
modified: 2025-02-23
replaces: masturbation
comment: Sexual stimulation of one's own genitals for sexual pleasure.
comment: Estimulación sexual de los propios genitales para el placer sexual.
broader: Sex (Act)
broader: Sexual practices
change note: Version 4.2.0
has top concept: Sex (Act)
in scheme: v3
narrower: Jerking off
narrower: Mutual masturbation
narrower: Wacking off
preferred label: Masturbación
related: Autoeroticism
related: Getting off
related: Manual sex
related: Solo sex

Medication
type: Concept
issued: 2019-05-14
modified: 2025-03-20
replaces: medication
comment: Non-recreational drugs as used by members of the LGBTQ+ community.
comment: Drogas no recreativas utilizadas por miembros de la comunidad LGBTQ+.
alternative label: Pharmaceuticals
alternative label: Productos farmacéuticos
alternative label: Farmacéuticos
broader: Therapies
change note: Version 4.2.0
has top concept: Medical care
in scheme: v3
narrower: Erection pills
narrower: Hormone blockers
narrower: Passive immune therapy
narrower: Puberty blockers
narrower: HAART (Highly Active Antiretroviral Therapy)
narrower: PEP (HIV)
preferred label: Medicamento
related: Hormone therapy (Gender)
related: Cocaine

LGBTQ+ museums
type: Concept
issued: 2019-05-14
modified: 2026-02-23
replaces: museumsLGBTQ
comment: Institutions dedicated to the storage, exhibition, conservation, and preservation of materials relating to LGBTQ+ people, LGBTQ+ communities, and LGBTQ+ history.
comment: Instituciones dedicadas al almacenamiento, la exhibición, la conservación y la preservación de materiales relacionados con las personas LGBTQ+, las comunidades LGBTQ+ y la historia LGBTQ+.
alternative label: Museums (LGBTQ)
alternative label: Museos (LGBTQ)
broader: LGBTQ+ cultural heritage institutions
change note: Version 4.2.0
has top concept: LGBTQ+ cultural heritage institutions
in scheme: v3
narrower: Bisexual museums
narrower: Gay museums
narrower: Lesbian museums
narrower: Queer museums
narrower: Transgender museums
preferred label: Museos LGBTQ+
related: LGBTQ+ special collections
related: Two-Spirit museums
related: Metadata for LGBTQ+ resources

Partner preference
type: Concept
issued: 2019-05-14
modified: 2025-02-23
replaces: partnerPreference
comment: An enduring pattern of desire for connection and relationships (romantic, sexual, or play) with people of specific identities or within specific relationship orientations (monogamy, polyamory, polygamy).
comment: Un patrón duradero de deseo de conexión y relaciones (románticas, sexuales o de juego) con personas de identidades específicas o dentro de orientaciones relacionales específicas (monogamia, poliamor, poligamia).
broader: Sexual preference
change note: Version 4.2.0
has top concept: Sexual preference
in scheme: v3
narrower: Monogamy
narrower: Polygamy
preferred label: Preferencia de pareja
related: Sexual identity
related: Sexual relationships
related: Significant others
related: Monogamous people
related: Polygamous people
related: Partners

Passing (Gender)
type: Concept
issued: 2019-05-14
modified: 2025-02-23
replaces: passingGender
comment: An individual's ability to "pass," or be accepted or regarded as a member of the gender they identify with. "Passing" has historically been used to describe an individual's ability to "pass" as a certain race or ethnicity, though the term was later appropriated by the LGBTQ+ community.
comment: La capacidad de una persona para "pasar", ser aceptada o considerada como miembro del género con el que se identifica. "Pasar" se ha utilizado históricamente para describir la capacidad de una persona de "pasar" como una determinada raza o etnia, aunque eventualmente la comunidad LGBTQ+ se apropió del término.
alternative label: Pasando
alternative label: Pasar desapercibido
change note: Version 4.2.0
in scheme: v3
preferred label: Passing (género)
related: Stealth (Transgender)
related: Crossdressers
related: Gender
related: Public bathrooms
related: Reading (Gender)
related: Transgender people
related: Clocking (Gender)
related: Passing (Sexuality)

Safer sex
type: Concept
issued: 2019-05-14
modified: 2025-02-23
replaces: saferSex
comment: A set of practices aimed to minimize the risk of STI transmission, including but not limited to using condoms and dental dams, taking PrEP, and participating in regular STI testing.
comment: Un conjunto de prácticas destinadas a minimizar el riesgo de transmisión de ITS, que incluye, entre otras, el uso de condones y protectores dentales, la toma de PrEP y la participación en pruebas periódicas de ITS.
broader: Sex (Act)
broader: Sexual practices
change note: Version 4.2.0
has top concept: Sex (Act)
in scheme: v3
preferred label: Sexo más seguro
related: AIDS education
related: Condoms
related: Dental dams
related: Latex gloves
related: Risk behaviors
related: Safer sex parties
related: Sexual behavior change

LGBTQ+ theology
type: Concept
is replaced by: homoit0001218
issued: 2019-05-14
modified: 2022-11-17
replaces: theologyLGBTQ
alternative label: Theology (LGBTQ)
change note: Version 4.2.0
in scheme: v3
narrower: Queer theology
related: LGBTQ+ African religions

Wolves (Gay culture)
type: Concept
issued: 2019-05-14
modified: 2025-02-23
replaces: wolves
comment: U.S. slang term for heavy-set, masculine gay men who are often characterized as having hairy bodies and facial hair; typically used for individuals who are more aggressive and overtly masculine than bears.
comment: Término de la jerga estadounidense para hombres gay masculinos y corpulentos que a menudo se caracterizan por tener cuerpos peludos y vello facial; normalmente se utiliza para personas que son más agresivas y abiertamente masculinas que los osos.
alternative label: Wolves
alternative label: Lobos
broader: Gay culture
broader: Gay men
broader: Gender roles
broader: Sexual identity
change note: Version 4.2.0
has top concept: Subcultures
in scheme: v3
narrower: Cubs (Gay culture)
preferred label: Lobos (Cultura gay)
related: Bears (Gay culture)
related: Gender expression
related: Masculinities
related: Otters (Gay culture)

Women who have sex with women
type: Concept
issued: 2019-05-14
modified: 2025-02-23
replaces: womenWhoHaveSexWithWomen
comment: Women who engage in sexual activity with other women.
comment: Mujeres que mantienen actividad sexual con otras mujeres.
alternative label: WSW
broader: LGBTQ+ people
broader: Females
change note: Version 4.2.0
has top concept: LGBTQ+ people
in scheme: v3
narrower: Mati
preferred label: Mujeres que tienen sexo con mujeres
related: Bisexual women
related: Lesbians
related: Same-gender-loving
related: Sexual minorities
related: Strap-on sex
related: Women's sexuality

Compulsory sexuality
type: Concept
issued: 2020-06-02
modified: 2025-02-23
replaces: compulsorySexuality
comment: The belief that everyone should be either sexually available or in a sexual relationship.
comment: La creencia de que todo el mundo debería estar disponible sexualmente o en una relación sexual.
broader: Social norms
change note: Version 4.2.0
has top concept: Social norms
in scheme: v3
preferred label: Sexualidad obligatoria
related: Asexuality
related: Asexual people
related: Demisexuality
related: Demisexual people
related: LGBTQ+ discrimination
related: Allosexuality
related: Compulsory monogamy
related: Allosexual people

Polysexuality
type: Concept
issued: 2020-06-03
modified: 2026-02-24
replaces: polysexuality
comment: Term used to describe the sexual identity of individuals who experience attraction to more than one gender; includes bisexuality and pansexuality.
comment: Término utilizado para describir la identidad sexual de personas que sienten atracción por más de un género; incluye la bisexualidad y la pansexualidad.
broader: Sexual diversity
broader: Sexual identity
broader: Sexual orientation
broader: Sexual preference
change note: Version 4.2.0
has top concept: Diversity
in scheme: v3
narrower: Bisexuality
narrower: Pansexuality
preferred label: Polisexualidad
related: Polyamory
related: Polysexual people
related: Throuple

Reclaimed terms
type: Concept
issued: 2020-06-03
modified: 2025-02-23
replaces: reclaimedTerms
comment: Terms that have been or are currently used in derogatory ways but have been reclaimed by certain groups or in certain circumstances.
comment: Términos que se han utilizado o se utilizan actualmente de manera despectiva pero que han sido reclamados por ciertos grupos o en determinadas circunstancias.
alternative label: Términos recuperados
alternative label: Lenguaje reapropiado
broader: LGBTQ+ slang
change note: Version 4.2.0
has top concept: LGBTQ+ slang
in scheme: v3
narrower: Dykes
narrower: Faggots
narrower: Queer people
narrower: Crip
narrower: Fairies (Gay culture)
narrower: Queercrip
preferred label: Palabras reclamadas
related: Queer slang
related: Slurs

Gay authors
type: Concept
issued: 2021-11-02
modified: 2025-03-13
comment: Gay creators of written works.
comment: Creadores de obras escritas conocidos por ser gay.
broader: LGBTQ+ authors
change note: Version 4.2.0
has top concept: LGBTQ+ people
in scheme: v3
preferred label: Autores gay
related: Gay drama
related: Gay fiction
related: Gay literature
related: Gay poetry
related: Gay literary criticism
related: Gay autobiographies
related: Gay men in fandom
related: Gay men's writings

Aromantic authors
type: Concept
issued: 2021-11-09
modified: 2025-03-13
comment: Aromantic creators of written works.
comment: Creadores de obras escritas conocidos por ser arrománticos.
alternative label: Aro authors
alternative label: Aro writers
alternative label: Aromantic writers
alternative label: Autores aro
alternative label: Escritores aro
alternative label: Escritores arrománticos
alternative label: Autoras aro
alternative label: Escritoras aro
alternative label: Escritoras arrománticas
broader: LGBTQ+ authors
change note: Version 4.2.0
has top concept: LGBTQ+ people
in scheme: v3
preferred label: Autores arrománticos
related: Aromantic fiction
related: Aromantic people in fandom
related: Aromantic poetry
related: Aromantic literature
related: Aromantic autobiographies
related: Aromantic biographies
related: Aromantic literary criticism
related: Aromantic people's writings

2SLGBTQ+
type: Concept
issued: 2021-12-14
modified: 2025-02-23
comment: Abbreviation used to describe Two-Spirit people, lesbians, gay men, bisexual people, transgender people, queer people, and other gender and sexual minorities as a group; commonly used in Canada to emphasize the particularities of Indigenous people's experiences.
comment: Abreviatura utilizada para describir a las personas dos espíritus, lesbiana, gay, bisexuales, transgénero, queer y otras minorías sexuales y de género como grupo; comúnmente utilizada en Canadá para situar y centrar las experiencias particulares de las personas indígenas.
alternative label: LGBTQ2S+
change note: Version 4.2.0
in scheme: v3
narrower: LGBTQ+
related: Bisexual community
related: Gay community
related: Lesbian community
related: Queer community
related: Transgender community

Metoidioplasty
type: Concept
issued: 2022-02-14
modified: 2025-02-23
comment: Surgical procedure in which the urethra is elongated and placed along a neophallus, typically to allow for standing urination.
comment: Procedimiento quirúrgico en el que la uretra se alarga y se coloca a lo largo de un neofalo, generalmente para permitir orinar de pie.
alternative label: Meta
alternative label: Metaoidioplasty
alternative label: Meto
alternative label: Meto||
broader: Bottom surgery
change note: Version 4.2.0
has top concept: Medical care
in scheme: v3
preferred label: Metoidioplastia
related: Penis
related: Testicle
related: Transitioning (Gender)
related: Scrotoplasty
related: Vaginectomy
related: Phalloplasty
related: Stand-to-Pee devices
related: Neophallus

LGBTQ+ wheelchair users
type: Concept
issued: 2022-02-17
modified: 2025-02-23
comment: LGBTQ+ people who use wheelchairs.
comment: Personas LGBTQ+ que utilizan sillas de ruedas.
alternative label: Wheelchair users (LGBTQ)
alternative label: Usuarios de sillas de ruedas (LGBTQ)
broader: LGBTQ+ disabled people
change note: Version 4.2.0
has top concept: LGBTQ+ people
in scheme: v3
narrower: Lesbian wheelchair users
narrower: Gay wheelchair users
narrower: Bisexual wheelchair users
narrower: Transgender wheelchair users
narrower: Queer wheelchair users
narrower: Asexual wheelchair users
narrower: Intersex wheelchair users
preferred label: Usuarios LGBTQ+ de sillas de ruedas
related: Two-Spirit wheelchair users

LGBTQ+ witches
type: Concept
issued: 2022-03-29
modified: 2025-02-23
comment: LGBTQ+ practitioners of Wicca or other Pagan religions who self-identify as witches.
comment: Practicantes LGBTQ+ de Wicca u otras religiones paganas que se autoidentifican como brujas.
alternative label: LGBTQ+ Wiccans
broader: LGBTQ+ Pagans
change note: Version 4.2.0
has top concept: LGBTQ+ African religions
in scheme: v3
narrower: Lesbian witches
narrower: Gay witches
narrower: Bisexual witches
narrower: Transgender witches
narrower: Queer witches
narrower: Intersex witches
narrower: Asexual witches
preferred label: Brujas LGBTQ+
related: Goddess movement

Chicano/a/x LGBTQ+ people
type: Concept
issued: 2022-05-11
modified: 2025-02-23
comment: LGBTQ+ people of Mexican descent born in the United States; only use to describe people who self-identify as Chicano, Chicana, or Chicanx. Do not conflate with Latino/a/x or Hispanic people.
comment: personas LGBTQ+ de ascendencia mexicana nacidas en Estados Unidos; utilícese únicamente para describir a personas que se autoidentifiquen como chicanas. No se debe confundir con latinos/a/x o hispanos.
alternative label: Chicana LGBTQ+ people
alternative label: Chicanas (LGBTQ)
alternative label: Chicano LGBTQ+ people
alternative label: Chicanos (LGBTQ)
alternative label: Chicanx LGBTQ+ people
alternative label: Chicanx people (LGBTQ)
alternative label: Chicanxs (LGBTQ)
alternative label: LGBTQ+ Chicanas
alternative label: LGBTQ+ Chicanos
alternative label: LGBTQ+ Chicanx people
alternative label: LGBTQ+ Chicanxs
alternative label: Personas chicanas LGBTQ+
alternative label: Personas chicanas (LGBTQ)
alternative label: Chicanos LGBTQ+
alternative label: Chicanas LGBTQ+
alternative label: Chicanxs LGBTQ+
alternative label: Chicanxs (LGBTQ)||
broader: LGBTQ+ people of shared ethnic or national identities
change note: Version 4.2.0
has top concept: LGBTQ+ people
in scheme: v3
narrower: Chicano/a/x lesbians
narrower: Chicano/a/x gay men
narrower: Chicano/a/x bisexual people
narrower: Chicano/a/x transgender people
narrower: Chicano/a/x queer people
narrower: Chicano/a/x intersex people
narrower: Chicano/a/x non-binary people
narrower: Chicano/a/x asexual people
preferred label: Personas LGBTQ+ chicanas

Masculine of center
type: Concept
issued: 2022-06-27
modified: 2025-02-23
comment: Term used to describe individuals whose gender expression is more masculine than androgynous. Generally used as a self-descriptor within LGBTQ+ communities.
comment: Término utilizado para describir a personas cuya expresión de género es más masculina que andrógina. Generalmente se utiliza como término para la autodescripción dentro de las comunidades LGBTQ+.
alternative label: MOC
alternative label: Masc of center
broader: Masculinities
change note: Version 4.2.0
has top concept: Gender
in scheme: v3
preferred label: Masculino de centro
related: Bois
related: Butches
related: Soft butches
related: Tomboys
related: Transmasculine people
related: Trans men
related: Demiboys
related: Feminine of center

Anime and manga fandom
type: Concept
issued: 2022-07-04
modified: 2025-02-23
comment: The fan community that focuses on, incorporates, or details the relationships of characters derived from anime or manga.
comment: La comunidad de fans que se centra sobre, incorpora o detalla las relaciones de personajes derivados del anime o manga.
alternative label: Anime and manga fan community
alternative label: Anime fandom
alternative label: Manga and anime fandom
alternative label: Manga fandom
alternative label: Comunidad fan del anime y manga
alternative label: Fandom de anime
alternative label: Fandom de manga
alternative label: Comunidades fan de anime y manga
broader: Fandom
change note: Version 4.2.0
has top concept: Subcultures
in scheme: v3
narrower: Bara fandom
narrower: Bishounen
narrower: Boys' Love (Genre)
narrower: Hentai fandom
narrower: Yuri fandom
narrower: Girls’ Love (Genre)
preferred label: Fandom de anime y manga
related: LGBTQ+ cartoons
related: LGBTQ+ manga

Slash fanworks
type: Concept
issued: 2022-07-04
modified: 2025-02-23
comment: Works created by fans that focus on romantic or sexual relationships between characters of the same sex or gender. Typically erotic or pornographic in nature. Historically used for male-male couples only, but is now used more broadly; includes femslash fanworks.
comment: Obras creadas por fans que se centran en relaciones románticas o sexuales entre personajes del mismo sexo o género. Normalmente de naturaleza erótica o pornográfica. Históricamente se utilizaba únicamente para parejas de hombres, pero ahora se utiliza de forma más amplia; incluye obras de fans de femslash.
alternative label: Slash fan works
alternative label: Fan works slash
broader: Fanworks
broader: Slash fandom
change note: Version 4.2.0
has top concept: Subcultures
in scheme: v3
narrower: Slash art
narrower: Slash fiction
narrower: Slash manips
narrower: Slash roleplay
narrower: Slash vidding
preferred label: Fanworks slash
related: Fanart
related: Yaoi

Parents of LGBTQ+ people
type: Concept
issued: 2022-07-19
modified: 2025-02-23
comment: Individuals who have one or more LGBTQ+ child.
comment: Personas que actúan como padres de una o más personas LGBTQ+. Para padres que son LGBTQ+, utilice el término "madres y padres LGBTQ+"
alternative label: LGBTQ people's parents
alternative label: LGBTQ+ people's parents
alternative label: Parents of LGBTQ people
alternative label: Padres de personas LGBTQ+
alternative label: Madres de personas LGBTQ+
broader: Parents
change note: Version 4.2.0
has top concept: Family members
in scheme: v3
narrower: Parents of bisexual people
narrower: Parents of gay men
narrower: Parents of lesbians
narrower: Parents of queer people
narrower: Parents of transgender people
narrower: Parents of non-binary people
narrower: Parents of intersex people
narrower: Parents of asexual people
preferred label: Madres y padres de personas LGBTQ+

Substance abuse
type: Concept
is replaced by: homoit0002226
issued: 2019-05-14
issued: 2020-06-02
issued: 2022-07-19
modified: 2022-12-16
modified: 2025-04-24
replaces: substanceAbuse
replaces: drugAbuse
replaces: cocaineAddiction
replaces: crystalMethAddiction
comment: Abuse of or dependence on addictive substances such as drugs or alcohol.
comment: Dependence upon cocaine or crack; characterized by the experience of withdrawal symptoms upon cessation.
comment: LGBTQ+ people who have been diagnosed with or regard themselves as having a substance use disorder, a medical condition that involves a pattern of substance use that is difficult to control, negatively impacts the individual's life, and results in withdrawal symptoms upon cessation. Only use to refer to individuals who describe themselves as having a substance use disorder. Follow the individual's preference for "use disorder" or "addiction" whenever possible.
comment: Personas LGBTQ+ que han sido diagnosticadas o que ellas mismas consideran que padecen de un trastorno por uso de sustancias, una condición médica que implica un patrón de uso de sustancias que es difícil de controlar, afecta negativamente la vida de la persona y provoca síntomas de abstinencia al dejar de usarlas. Utilícese únicamente para referirse a personas que se describen a sí mismas como padeciendo de un trastorno por uso de sustancias. Siga la preferencia de la persona sobre el uso de "trastorno por consumo" o "adicción" siempre que sea posible.
alternative label: Chemical dependency
alternative label: Drug addiction
alternative label: Drug dependence
alternative label: Cocaine abuse
alternative label: Cocaine misuse
alternative label: Cocaine use disorder
alternative label: Crack abuse
alternative label: Crack addiction
alternative label: Crystal meth misuse
alternative label: Crystal meth abuse
alternative label: Methamphetamine misuse
alternative label: Methamphetamine abuse
alternative label: Drug addicts (LGBTQ)
alternative label: LGBTQ+ drug addicts
alternative label: LGBTQ+ people with drug addictions
alternative label: People with substance abuse disorders (LGBTQ)
broader: LGBTQ+ people
broader: LGBTQ+ people with addictions
change note: Version 4.2.0
has top concept: LGBTQ+ people
in scheme: v3
preferred label: Drug abuse
preferred label: Cocaine addiction
preferred label: Crystal meth addiction
preferred label: LGBTQ+ people with substance use disorders
preferred label: Personas LGBTQ+ con trastornos por uso de sustancias
related: LGBTQ+ people who use substances
related: Cocaine
related: Party drugs
related: LGBTQ+ people in Adult Children of Alcoholics
related: Recovery groups
related: Two-Spirit people with substance use disorders

Gender euphoria
type: Concept
issued: 2022-09-09
modified: 2025-02-23
comment: The powerful feeling of joy and comfort an individual experiences when their assigned gender, gender expression, and/or the way their gender is perceived by themselves and others aligns with their gender identity. Though gender euphoria is often associated with trans people, people of any identity may experience gender euphoria when they feel that their gender has been seen and affirmed, or when they feel "right" in their body and the way their gender is being expressed.
comment: El poderoso sentimiento de alegría y consuelo que una persona experimenta cuando su género asignado, su expresión de género y/o la forma en que la propia persona y las demás personas perciben su género se alinea con su identidad de género. Aunque la euforia de género a menudo se asocia con las personas trans, las personas de cualquier identidad pueden experimentar euforia de género cuando sienten que su género ha sido visto y afirmado, o cuando se sienten "bien" con su cuerpo y la forma en que se expresa su género.
change note: Version 4.2.0
in scheme: v3
preferred label: Euforia de género
related: Gender assigned at birth
related: Gender dysphoria
related: Gender expression
related: Gender identity
related: Gender dysphoria in children
related: Gender dysphoria in youth
related: Queer joy
related: Trans joy

LGBTQ+ fathers
type: Concept
issued: 2022-12-13
modified: 2025-02-23
comment: LGBTQ+ people who are fathers.
comment: Personas LGBTQ+ que son padres.
alternative label: Dads (LGBTQ)
alternative label: Fathers (LGBTQ)
alternative label: LGBTQ+ dads
alternative label: Papás LGBTQ+
broader: Fathers
broader: LGBTQ+ parents
change note: Version 4.2.0
has top concept: Family members
in scheme: v3
narrower: Transgender fathers
narrower: Bisexual fathers
narrower: Gay fathers
narrower: Lesbian fathers
narrower: Queer fathers
narrower: Intersex fathers
narrower: Asexual fathers
preferred label: Padres LGBTQ+

Fathers of LGBTQ+ people
type: Concept
issued: 2022-12-13
modified: 2025-02-23
comment: People who act as a father to one or more LGBTQ+ person. For fathers who are themselves LGBTQ+, use the term "LGBTQ+ fathers."
comment: Personas que asumen el rol de padre de personas LGBTQ+. Utilícese únicamente para describir a personas que se autoidentifiquen como padres.
alternative label: Dads of LGBTQ+ people
alternative label: Papás de personas LGBTQ+
broader: Fathers
change note: Version 4.2.0
has top concept: Family members
in scheme: v3
narrower: Fathers of bisexual people
narrower: Fathers of gay men
narrower: Fathers of lesbians
narrower: Fathers of queer people
narrower: Fathers of transgender people
narrower: Fathers of intersex people
narrower: Fathers of asexual people
narrower: Fathers of non-binary people
preferred label: Padres de personas LGBTQ+

LGBTQ+ mothers
type: Concept
issued: 2022-12-13
modified: 2025-02-23
comment: LGBTQ+ people who are mothers.
comment: Personas LGBTQ+ que son madres.
alternative label: LGBTQ+ moms
alternative label: Moms (LGBTQ)
alternative label: Mothers (LGBTQ)
alternative label: Mamás LGBTQ+
alternative label: Mamás LGBTQ
alternative label: Madres LGBTQ
alternative label: Madres (LGBTQ)
alternative label: Mamás (LGBTQ)
broader: Mothers
broader: LGBTQ+ parents
change note: Version 4.2.0
has top concept: Family members
in scheme: v3
narrower: Transgender mothers
narrower: Bisexual mothers
narrower: Gay mothers
narrower: Lesbian mothers
narrower: Queer mothers
narrower: Asexual mothers
narrower: Intersex mothers
preferred label: Madres LGBTQ+

Daughters of LGBTQ+ people
type: Concept
issued: 2022-12-13
modified: 2025-02-23
comment: Daughters who have one or more LGBTQ+ parent. For daughters who are themselves LGBTQ+, use the term "LGBTQ+ daughters."
comment: Hijas que tienen uno o más padres LGBTQ+. Para las hijas que son LGBTQ+, utilice el término "hijas LGBTQ+".
broader: Daughters
change note: Version 4.2.0
has top concept: Family members
in scheme: v3
narrower: Daughters of bisexual people
narrower: Daughters of gay men
narrower: Daughters of lesbians
narrower: Daughters of transgender people
narrower: Daughters of queer people
narrower: Daughters of intersex people
narrower: Daughters of asexual people
narrower: Daughters of non-binary people
preferred label: Hijas de personas LGBTQ+

Demisexual fiction
type: Concept
issued: 2023-01-17
modified: 2025-02-23
comment: Written works describing imagined events or people; use in reference to fictional works focusing on demisexual characters or themes.
comment: Obras escritas que describen eventos o personas imaginadas; utilícese en referencia a obras de ficción que se centran en personajes o temas demisexuales.
broader: LGBTQ+ fiction
change note: Version 4.2.0
has top concept: Subcultures
in scheme: v3
narrower: Demisexual fantasy fiction
narrower: Demisexual horror fiction
narrower: Demisexual mystery and detective fiction
narrower: Demisexual romance fiction
narrower: Demisexual science fiction
narrower: Demisexual short stories
preferred label: Ficción demisexual
related: Demisexual literature
related: Demisexual authors

Two-Spirit disabled people
type: Concept
issued: 2023-06-26
modified: 2025-04-24
comment: Two-Spirit people who are disabled
comment: Personas dos espíritus con discapacidad.
alternative label: 2S disabled people
alternative label: Disabled 2S people
alternative label: Disabled Two Spirit people
alternative label: Disabled Two-Spirited people
alternative label: Two Spirit disabled people
alternative label: Two Spirited disabled people
alternative label: Two-Spirited disabled people
alternative label: Personas dos espíritus con discapacidades
alternative label: Discapacitados dos espíritus
alternative label: Personas discapacitadas dos espíritus
broader: Two-Spirit people
change note: Version 4.2.0
has top concept: Gender
in scheme: v3
narrower: Two-Spirit autistic people
narrower: Two-Spirit blind people
narrower: Two-Spirit Deaf people
narrower: Two-Spirit hard of hearing people
narrower: Two-Spirit wheelchair users
preferred label: Personas dos espíritus discapacitadas
related: LGBTQ+ disabled people
related: Two-Spirit people with chronic illnesses
related: Two-Spirit people who use substances for medical purposes

LGBTQ+ operas
type: Concept
issued: 2023-06-28
modified: 2025-02-23
comment: Long-form musical performances combining singing, orchestral music, and often ballet, typically set to a dramatic narrative or libretto and presented on a theater stage centered on LGBTQ+ characters or themes.
comment: Presentaciones musicales de larga duración que combinan canto, música orquestal y, a menudo, ballet, generalmente ambientadas con una narrativa o libreto dramático y presentadas en un escenario teatral, centradas en personajes o temas LGBTQ+.
broader: LGBTQ+ arts
change note: Version 4.2.0
has top concept: Subcultures
in scheme: v3
narrower: Gay operas
narrower: Bisexual operas
narrower: Transgender operas
narrower: Asexual operas
narrower: Intersex operas
narrower: Lesbian operas
narrower: Queer operas
preferred label: Óperas LGBTQ+
related: Two-Spirit operas

Uniform fetish
type: Concept
issued: 2023-12-18
modified: 2025-02-23
comment: Eroticization of uniforms.
comment: Erotización de los uniformes.
broader: Kink accessories
change note: Version 4.2.0
has top concept: Eroticism
in scheme: v3
preferred label: Fetiche de uniformes
related: Bootblacking
related: Clothing
related: Roleplay
related: Boot fetish
related: Leather fetish
related: LGBTQ+ fashion
related: Medical play
related: Shoe fetish

Breast play
type: Concept
issued: 2023-12-20
modified: 2025-02-23
comment: Any sexual activity involving the breasts, including fondling/groping, kissing, licking, rubbing, pinching, or squeezing/constricting.
comment: Cualquier actividad sexual que involucre los senos, incluyendo acariciar/manosear, besar, lamer, frotar, pellizcar o apretar/constreñir.
alternative label: Juego con senos
broader: Sex (Act)
broader: Sexual practices
change note: Version 4.2.0
has top concept: Sex (Act)
in scheme: v3
narrower: Nipple play
narrower: Breast torture
preferred label: Juego de senos
related: Breast
related: Breast fetish
related: Chest
related: Nipple torture
related: Chest play

Hispanic American LGBTQ+ people
type: Concept
issued: 2024-12-12
modified: 2025-02-23
comment: LGBTQ+ people who were born in or currently reside in the United States and are descended from Spain or other regions formerly colonized by Spain that are primarily Spanish-speaking. Only use for individuals who self-identify as Hispanic American; do not conflate with Latino/a/x or Chicano/a/x.
alternative label: Hispanic Americans (LGBTQ)
alternative label: Hispanic American people (LGBTQ)
alternative label: LGBTQ+ Hispanic Americans
alternative label: LGBTQ+ Hispanic American people
broader: Hispanic LGBTQ+ people
change note: Version 4.2.0
has top concept: LGBTQ+ people
in scheme: v3
narrower: Hispanic American lesbians
narrower: Hispanic American gay men
narrower: Hispanic American bisexual people
narrower: Hispanic American transgender people
narrower: Hispanic American queer people
narrower: Hispanic American non-binary people
narrower: Hispanic American intersex people
narrower: Hispanic American asexual people

LGBTQ+ dancers
type: Concept
issued: 2025-04-23
modified: 2025-07-21
comment: LGBTQ+ people who dance, either professionally or as a hobby.
alternative label: Dancers (LGBTQ)
broader: LGBTQ+ people
change note: Version 4.2.0
has top concept: LGBTQ+ people
in scheme: v4
narrower: Lesbian dancers
narrower: Gay dancers
narrower: Bisexual dancers
narrower: Transgender dancers
narrower: Queer dancers
narrower: Non-binary dancers
narrower: Intersex dancers
related: Two-Spirit dancers

LGBTQ+ people in visual art
type: Concept
issued: 2025-04-23
modified: 2025-04-23
comment: The depiction of LGBTQ+ people and communities in visual art, including painting, performance art, sculpture, photography, cinema, etc.
alternative label: LGBTQ+ people in art
broader: LGBTQ+ people in arts and media
change note: Version 4.2.0
has top concept: LGBTQ+ people
in scheme: v4
narrower: Lesbians in visual art
narrower: Gay men in visual art
narrower: Bisexual people in visual art
narrower: Transgender people in visual art
narrower: Queer people in visual art
narrower: Intersex people in visual art
narrower: Non-binary people in visual art
related: Two-Spirit people in visual art

Ainu LGBTQ+ people
type: Concept
issued: 2025-04-24
modified: 2025-04-24
comment: LGBTQ+ people who belong to the Ainu, an Indigenous ethnic group that has historically resided in Ainu Mosir, or the land of the Ainu, in what is now known as Japan. Only use to refer to people who self-identify as Ainu.
alternative label: LGBTQ+ Ainu people
alternative label: Ainu people (LGBTQ)
broader: Indigenous LGBTQ+ people
change note: Version 4.2.0
has top concept: LGBTQ+ people
in scheme: v4
narrower: Ainu lesbians
narrower: Ainu gay men
narrower: Ainu bisexual people
narrower: Ainu transgender people
narrower: Ainu queer people
narrower: Ainu intersex people
narrower: Ainu non-binary people
narrower: Ainu asexual people

Assigned gender
type: Concept
issued: 2019-05-14
modified: 2025-02-23
replaces: assignedGender
comment: The gender, typically "girl" or "boy," ascribed to a child at birth or adolescence based on the child's perceived sex.
comment: El género, típicamente "niña" o "niño", asignado a un infante al nacer o a un adolescente basado en su género percibido.
broader: Gender
broader: Gender identity
change note: Version 4.2.0
has top concept: Gender
in scheme: v3
narrower: Assigned female at birth
narrower: Assigned male at birth
narrower: Gender assigned at birth
preferred label: Género asignado
related: Birth certificate amendments
related: Chromosomes
related: Stealth (Transgender)
related: Transitioning (Gender)
related: Assigned sex

Bondage
type: Concept
issued: 2019-05-14
modified: 2025-02-23
replaces: bondage
comment: The act of tying up or restraining the body, usually with rope, cuffs, tape, or other adhesive, for the purposes of erotic enjoyment or aesthetic appreciation.
comment: Actos sexuales que implican la restricción física de una pareja.
alternative label: Erotic bondage
alternative label: Sexual bondage
alternative label: B&D
alternative label: Bondage y disciplina
broader: BDSM
change note: Version 4.2.0
has top concept: Eroticism
in scheme: v3
narrower: Mummification (Erotic)
narrower: Rope bondage
narrower: Hogtie
related: Restraints
related: Kink accessories
related: Gags
related: Cuffs
related: Body bags (Erotic)
related: Hoods (Erotic)

Bisexual fiction
type: Concept
issued: 2019-05-14
modified: 2026-02-23
replaces: bisexualFiction
comment: Written works describing imagined events or people; use in reference to fictional works focusing on bisexual characters or themes.
comment: Personas bisexuales que son padres.
alternative label: Papás bisexuales
broader: LGBTQ+ fiction
change note: Version 4.2.0
has top concept: Subcultures
in scheme: v3
narrower: Bisexual historical fiction
preferred label: Padres bisexuales
related: Bisexual characters
related: Bisexual literature
related: Bisexual authors
related: Intersex fiction
related: Aromantic fiction
related: Asexual fiction
related: Bisexual people in fandom
related: Greyromantic fiction

Bisexual literature
type: Concept
issued: 2019-05-14
modified: 2025-04-23
replaces: bisexualLiterature
comment: Written literary works about bisexuality, bisexual characters, or bisexual themes.
comment: El estudio, la evaluación y la interpretación de obras literarias centradas en personajes o temas bisexuales; también puede incluir la interpretación de la literatura a través del lente y los marcos teóricos de la bisexualidad.
broader: LGBTQ+ literature
change note: Version 4.2.0
has top concept: Subcultures
in scheme: v3
preferred label: Crítica literaria bisexual
related: Bisexual drama
related: Bisexual fiction
related: Bisexual poetry
related: Bisexual authors
related: Asexual fiction
related: Megasexual fiction
related: Greyromantic fiction
related: Bisexual people in literature

Closeted lesbians
type: Concept
issued: 2019-05-14
modified: 2025-02-23
replaces: closetedLesbians
comment: Lesbians who do not identify as such to others.
comment: Lesbianas que no se autoidentifican como tales ante los demás.
broader: Lesbians
broader: Closeted LGBTQ+ people
change note: Version 4.2.0
has top concept: LGBTQ+ people
in scheme: v3
preferred label: Lesbianas en el clóset
related: Closeted bisexual people
related: Closeted gay men
related: Coming out
related: Outing (LGBTQ+ culture)
related: Secrecy
related: Closeted transgender people
related: Closeted queer people
related: Closeted asexual people

Detention of LGBTQ+ people
type: Concept
issued: 2019-05-14
modified: 2025-02-23
replaces: detentionOfLGBTQPeople
comment: Temporary physical and legal confinement of LGBTQ+ people by an institution or authority, typically pending criminal charges or deportation. Can also be used to describe individuals held in custody for political purposes or within the context of war.
comment: Confinamiento físico y legal temporal de personas LGBTQ+ por parte de una institución o autoridad, generalmente en espera de cargos penales o deportación. También se puede utilizar para describir a personas detenidas por motivos políticos o en contexto de guerra.
alternative label: Detention of LGBTQ people
alternative label: Detención de personas LGBTQ
change note: Version 4.2.0
in scheme: v3
narrower: Arrests of LGBTQ+ people
narrower: Detention of LGBTQ+ people under a hospital order
narrower: LGBTQ+ incarceration
preferred label: Detención de personas LGBTQ+
related: Legal status
related: LGBTQ+ immigration rights
related: LGBTQ+ incarcerated people

Drag community
type: Concept
issued: 2019-05-14
modified: 2025-02-23
replaces: dragCommunity
comment: Groups of people (typically drag performers) with a shared interest in drag performances and culture.
comment: Grupos de personas (usualmente artistas drag) con un interés compartido en las presentaciones y la cultura drag.
broader: LGBTQ+ communities
change note: Version 4.2.0
has top concept: LGBTQ+ communities
in scheme: v3
narrower: Drag families
preferred label: Comunidad drag
related: Ball culture
related: Drag
related: Drag balls
related: Drag bars
related: Drag kings
related: Drag queens
related: Reading (LGBTQ+ culture)
related: Drag performers

Drag kings
type: Concept
issued: 2019-05-14
modified: 2025-02-23
replaces: dragKings
comment: Performers, often people assigned female at birth, who dress in stereotypically masculine attire and enact masculine personas for the purpose of entertainment.
comment: Artistas, a menudo personas asignadas al sexo femenino al nacer, que se visten con atuendos estereotípicamente masculinos y representan personajes masculinos con el propósito de entretener.
alternative label: Reyes drag
change note: Version 4.2.0
in scheme: v3
related: Crossdressers
related: Drag
related: Drag community
related: Drag families
related: Drag fathers
related: Drag mothers
related: Drag queens
related: Male impersonators
related: Drag performers

Drag queens
type: Concept
issued: 2019-05-14
modified: 2025-02-23
replaces: dragQueens
comment: Performers, often people assigned male at birth, who dress in stereotypically feminine attire and enact feminine personas for the purpose of entertainment.
comment: Artistas, a menudo personas asignadas al sexo masculino al nacer, que se visten con atuendos estereotípicamente femeninos y representan personajes femeninos con el propósito de entretener.
alternative label: Reinas drag
broader: Queens (Gay culture)
change note: Version 4.2.0
has top concept: Subcultures
in scheme: v3
related: Crossdressers
related: Drag
related: Drag community
related: Drag families
related: Drag fathers
related: Drag kings
related: Drag mothers
related: Female impersonators
related: Drag performers

Cocaine
type: Concept
is replaced by: homoit0000380
issued: 2019-05-14
modified: 2022-08-22
modified: 2022-08-15
modified: 2025-02-23
replaces: cocaine
replaces: crystalMeth
replaces: drugs
replaces: MDMA
comment: The use of substances (that are typically deemed harmful or are subject to legal restriction, such as drugs or alcohol) and discussions surrounding the particular impact of substance use within LGBTQ+ communities.
comment: El uso de sustancias (que normalmente se consideran dañinas o están sujetas a restricciones legales, como drogas o alcohol) y debates sobre el impacto particular del uso de sustancias dentro de las comunidades LGBTQ+.
comment: A type of methamphetamine commonly referred to as ecstasy or molly
alternative label: Tina
alternative label: Alcohol use (LGBTQ)
alternative label: Alcohol use in LGBTQ+ communities
alternative label: Drug use (LGBTQ)
alternative label: Drug use in LGBTQ+ communities
alternative label: LGBTQ+ substance use
alternative label: Substance use (LGBTQ)
alternative label: Consumo de substancias en la comunidad LGBTQ
alternative label: Uso de alcohol (LGBTQ)
alternative label: Consumo de alcohol (LGBTQ)
alternative label: Uso de drogas en la comunidad LGBTQ
alternative label: Uso de drogas (LGBTQ)
alternative label: Consumo de drogas (LGBTQ)
alternative label: Uso de substancias (LGBTQ)
alternative label: Ecstacy
alternative label: Molly
alternative label: XTC
broader: Party drugs
change note: Version 4.2.0
in scheme: v3
narrower: LGBTQ+ people with addictions
preferred label: Crystal meth
preferred label: Substance use in LGBTQ+ communities
preferred label: Uso de substancias en la comunidad LGBTQ+
preferred label: MDMA
related: Substance abuse
related: Medication
related: Poppers
related: Party drugs
related: LGBTQ+ people in recovery
related: LGBTQ+ people who use substances for medical purposes

Gender binaries
type: Concept
issued: 2019-05-14
modified: 2025-02-23
replaces: genderBinary
comment: Cultural conceptions of gender as two distinct and opposing categories, typically man and woman or masculine and feminine.
comment: Concepciones culturales del género como dos categorías distintas y opuestas, típicamente hombre y mujer o masculino y femenino.
change note: Version 4.2.0
in scheme: v3
preferred label: Binarios de género
related: Boys
related: Gender
related: Gender identity
related: Gender roles
related: Gender segregation
related: Girls
related: Males
related: Females
related: Gender role stereotypes

Goddess movement
type: Concept
issued: 2019-05-14
modified: 2025-02-23
replaces: goddessMovementLesbian
comment: A spiritual movement that emerged in North America, Western Europe, Australia, and New Zealand in 1970s in response to male-dominated organized religion; involves worshiping the Goddess (or several goddesses), as well as a focus on women, femininity, and feminism; often associated with lesbian communities.
comment: Un movimiento espiritual que surgió en Norteamérica, Europa Occidental, Australia y Nueva Zelanda en la década de 1970 en respuesta a la religión organizada dominada por los hombres; implica adorar a la Diosa (o varias diosas), así como la centralidad de las mujeres, la feminidad y el feminismo; a menudo asociado con comunidades lésbicas.
alternative label: Goddess movement (Lesbians)
alternative label: Goddess religion
change note: Version 4.2.0
in scheme: v3
preferred label: Movimiento Goddess
related: LGBTQ+ Pagans
related: LGBTQ+ witches
related: Lesbian witches
related: Gay witches
related: Bisexual witches
related: Transgender witches
related: Queer witches
related: Intersex witches

Lesbian community
type: Concept
issued: 2019-05-14
modified: 2025-02-23
replaces: lesbianCommunity
comment: Groups of people who share the experience of being lesbians.
comment: Grupos de personas que comparten la experiencia de ser lesbianas.
alternative label: Comunidad lesbiana
broader: LGBTQ+ communities
change note: Version 4.2.0
has top concept: LGBTQ+ communities
in scheme: v3
preferred label: Comunidad lésbica
related: LGBT
related: Lesbian bars
related: Lesbian community centers
related: LGB
related: LGBTI
related: LGBTQ
related: LGBTQ+
related: LGBTQIA
related: 2SLGBTQ+

LGBTQ+ direct action
type: Concept
issued: 2019-05-14
modified: 2025-04-17
replaces: LGBTQDirectAction
comment: Use to describe a group of LGBTQ+ people taking action that is intended to reveal an existing problem, highlight an alternative, or demonstrate a possible solution to a social issue.
comment: Utilícese para describir a un grupo de personas LGBTQ+ que toman medidas destinadas a revelar un problema existente, resaltar una alternativa o demostrar una posible solución a un problema social.
alternative label: LGBTQ direct action
broader: LGBTQ+ activism
change note: Version 4.2.0
has top concept: LGBTQ+ activism
in scheme: v3
narrower: LGBTQ+ action campaigns
narrower: LGBTQ+ civil disobedience
narrower: LGBTQ+ conscientious objection
narrower: LGBTQ+ lobbying
narrower: LGBTQ+ nonviolent resistance
narrower: LGBTQ+ petitions
narrower: LGBTQ+ self-defense
narrower: Outing (LGBTQ+ culture)
preferred label: Acción directa LGBTQ+
related: Europride

LGBTQ+ domestic violence
type: Concept
issued: 2019-05-14
modified: 2025-02-23
replaces: LGBTQDomesticViolence
comment: Acts of violence and abuse directed toward individuals in private, domestic settings; can be used to describe singular or repeated incidents.
comment: Actos de violencia y abuso dirigidos a personas en entornos domésticos y privados; se puede utilizar para describir incidentes singulares o repetidos.
alternative label: LGBTQ domestic violence
broader: Anti-LGBTQ+ violence
broader: Sexual violence
change note: Version 4.2.0
has top concept: Anti-LGBTQ+ violence
in scheme: v3
narrower: Intimate partner violence
preferred label: Violencia doméstica LGBTQ+
related: Consent
related: LGBTQ+ sexual abuse
related: LGBTQ+ victims of sexual abuse
related: LGBTQ+ partners
related: Sexual assault
related: Significant others
related: LGBTQ+ survivors of sexual abuse

LGBTQIA
type: Concept
issued: 2019-05-14
modified: 2025-02-23
replaces: LGBTQIA
comment: Acronym used to describe describe lesbians, gay people, bisexuals, transgender people, queer people, intersex people, and asexual people as a group.
comment: Acrónimo utilizado para describir a lesbianas, hombres gay, personas bisexuales, personas transgénero, personas queer, personas intersexuales y personas asexuales como grupo.
change note: Version 4.2.0
in scheme: v3
narrower: LGB
narrower: LGBTQ
related: Asexuality
related: Bisexual community
related: Gay community
related: Intersex movement
related: Lesbian community
related: Queer community
related: Transgender community

LGBTQ+ night life
type: Concept
issued: 2019-05-14
modified: 2026-02-23
replaces: LGBTQNightLife
comment: Nighttime social activities and entertainment catering to LGBTQ+ people, often located at bars and clubs.
comment: Actividades sociales nocturnas y entretenimiento para personas LGBTQ+, a menudo ubicadas en bares y discotecas.
alternative label: LGBTQ night life
alternative label: Vida nocturna (LGBTQ)
change note: Version 4.2.0
in scheme: v3
narrower: Gay saunas
narrower: Gay discos
preferred label: Vida nocturna LGBTQ+
related: LGBTQ+ bars
related: LGBTQ+ literary salons
related: LGBTQ+ meeting places
related: LGBTQ+ restaurants
related: Police raids on LGBTQ+ nightclubs
related: LGBTQ+ bar signs

LGBTQ+ victims of war
type: Concept
issued: 2019-05-14
modified: 2025-02-23
replaces: victimsOfWarLGBTQ
comment: LGBTQ+ people who have experienced war and may or may not have survived; follow the individual's preference for "victims" or "survivors" whenever possible.
comment: Personas LGBTQ+ que han sufrido la guerra y que pueden haber sobrevivido o no; siga la preferencia de la persona sobre el uso de "víctimas" o "sobrevivientes" siempre que sea posible.
alternative label: LGBTQ war victims
alternative label: Victims of war (LGBTQ)
broader: LGBTQ+ people
change note: Version 4.2.0
has top concept: LGBTQ+ people
in scheme: v3
narrower: Bisexual victims of war
narrower: Gay victims of war
narrower: Lesbian victims of war
narrower: Queer victims of war
narrower: Transgender victims of war
narrower: Asexual victims of war
narrower: Intersex victims of war
preferred label: Víctimas LGBTQ+ de guerra
related: LGBTQ+ survivors of war
related: Two-Spirit victims of war

Mental health care for LGBTQ+ people
type: Concept
issued: 2019-05-14
modified: 2026-02-24
replaces: mentalHealthCareForLGBTQPeople
comment: Organized measures taken for the diagnosis, maintenance, treatment, or improvement of mental health or psychological well being; use in reference to mental health care addressing the particular needs of LGBTQ+ individuals or communities.
comment: Medidas organizadas tomadas para el diagnóstico, el mantenimiento, el tratamiento o la mejora de la salud mental o el bienestar psicológico; utilícese en referencia a los cuidados de salud mental que abordan las necesidades particulares de personas o comunidades LGBTQ+.
alternative label: Mental health care for LGBTQ people
alternative label: Salud mental para personas LGBTQ+
broader: Health care for LGBTQ+ people
change note: Version 4.2.0
has top concept: Health care for LGBTQ+ people
in scheme: v3
narrower: LGBTQ+ support groups
narrower: Recovery groups
preferred label: Cuidados de salud mental para las personas LGBTQ+
related: Detention of LGBTQ+ people under a hospital order
related: DSM (Diagnostic and Statistical Manual of Mental Disorders)
related: LGBTQ+ suicide
related: Therapies
related: LGBTQ+ psychology
related: LGBTQ+ people with depression
related: LGBTQ+ people with anxiety

LGBTQ+ musicals
type: Concept
issued: 2019-05-14
modified: 2025-02-23
replaces: musicals
comment: Films or theatrical productions in which singing and/or dancing are essential elements. Use for musicals created by LGBTQ+ directors, depicting LGBTQ+ people, or that are regarded as important within LGBTQ+ culture.
comment: Películas o producciones teatrales en las que el canto y/o el baile son elementos imprescindibles. Utilícese para musicales creados por directores LGBTQ+ o que son considerados importantes dentro de la cultura LGBTQ+.
alternative label: Musicals (LGBTQ)
alternative label: Musicales (LGBTQ)
broader: LGBTQ+ arts
change note: Version 4.2.0
has top concept: Subcultures
in scheme: v3
narrower: Gay musicals
narrower: Bisexual musicals
narrower: Transgender musicals
narrower: Asexual musicals
narrower: Intersex musicals
narrower: Lesbian musicals
preferred label: Musicales LGBTQ+
related: Gay theater groups
related: Lesbian theater groups
related: LGBTQ+ theater

LGBTQ+ Pagans
type: Concept
issued: 2019-05-14
modified: 2025-02-23
replaces: pagansLGBTQ
comment: LGBTQ+ people who are members of polytheistic religions or other religions outside of the dominant culture that typically incorporate nature worship and/or the sacred feminine, such as Wicca, Druidry, Heathenry, etc. Use to describe LGBTQ+ people who self-identify as Pagan.
comment: Personas LGBTQ+ que son miembros de religiones politeístas u otras religiones fuera de la cultura dominante que típicamente incorporan el culto a la naturaleza y/o lo sagrado femenino, como la Wicca, el druidismo, el paganismo, etc. Utilícese para describir a las personas LGBTQ+ que se autoidentifiquen como paganas.
alternative label: Pagans (LGBTQ)
alternative label: Paganos (LGBTQ)
broader: LGBTQ+ African religions
change note: Version 4.2.0
has top concept: LGBTQ+ African religions
in scheme: v3
narrower: Bisexual Pagans
narrower: Gay Pagans
narrower: Lesbian Pagans
narrower: Queer Pagans
narrower: Transgender Pagans
narrower: LGBTQ+ witches
narrower: Intersex Pagans
narrower: Asexual Pagans
preferred label: Paganos LGBTQ+
related: Goddess movement

LGBTQ+ people in the military
type: Concept
issued: 2019-05-14
modified: 2025-02-23
replaces: peopleInTheMilitaryLGBTQ
comment: LGBTQ+ people serving in state and national armed forces.
comment: Personas LGBTQ+ que sirven en las fuerzas armadas estatales y nacionales.
alternative label: People in the military (LGBTQ)
alternative label: Personas LGBTQ+ en las fuerzas armadas
broader: Legal status
change note: Version 4.2.0
has top concept: Legal status
in scheme: v3
narrower: Bisexual people in the military
narrower: Gay men in the military
narrower: Lesbians in the military
narrower: Queer people in the military
narrower: Transgender people in the military
narrower: Asexual people in the military
narrower: Intersex people in the military
preferred label: Personas LGBTQ+ en el ejército
related: LGBTQ+ veterans
related: Two-Spirit people in the military

Bathroom bans
type: Concept
issued: 2019-05-14
modified: 2025-02-23
replaces: publicBathroomBills
comment: Laws or policies instituted to prevent trans and non-binary individuals from using public bathrooms and facilities, such as locker rooms, shower rooms, changing rooms, and other sex-segregated spaces, on the basis of their gender identity.
alternative label: Changing room bans
alternative label: Locker room bans
alternative label: Restroom bans
broader: Anti-transgender legislation
change note: Version 4.2.0
has top concept: Law
in scheme: v3
related: Changing rooms
related: Locker rooms
related: Public bathrooms
related: Public facilities
related: Public showers

Public sex
type: Concept
issued: 2019-05-14
modified: 2025-02-23
replaces: publicSex
comment: Sex in public places such as beaches, parks, cottages, etc.
comment: Sexo en lugares públicos, como playas, parques, cabañas, etc.
broader: Sexual practices
change note: Version 4.2.0
has top concept: Sexual practices
in scheme: v3
preferred label: Sexo en público
related: Cottaging (Gay culture)
related: Cruising (LGBTQ+ culture)
related: Exhibitionism
related: Gay saunas
related: LGBTQ+ meeting places
related: Sex locations
related: Voyeurism
related: Sexuality
related: Tearoom sex

Queer (Verb)
type: Concept
issued: 2019-05-14
modified: 2025-02-23
replaces: queerVerb
comment: A term commonly used in academic disciplines to describe actions that address sexual and gender normativity, expose systems of oppression, and attempt to undermine those systems.
comment: Un término comúnmente utilizado en disciplinas académicas para describir acciones que abordan la normatividad sexual y de género, exponen sistemas de opresión e intentan socavar esos sistemas.
alternative label: Cuir
change note: Version 4.2.0
in scheme: v3
narrower: LGBTQ+ headcanons
preferred label: Queer
related: Gender studies
related: LGBTQ+ literature
related: Queer archives
related: Queer theory
related: Crip
related: Queer gaze
related: Queercrip

Restraints
type: Concept
issued: 2019-05-14
modified: 2025-03-20
replaces: restraints
comment: Binding tools, devices, and accessories such as handcuffs, legcuffs, ropes, chains, straps, or straitjackets.
comment: Objetos para atar como esposas, esposas, cuerdas, cadenas, correas o camisas de fuerza.
broader: Sex accessories
change note: Version 4.2.0
has top concept: Sex accessories
in scheme: v3
narrower: Straitjacket
narrower: Cuffs
preferred label: Restricciones
related: Bondage
related: Leashes
related: Kink accessories
related: Mummification (Erotic)
related: Rope bondage
related: Gags
related: Hogtie

Sexual dysfunction
type: Concept
issued: 2019-05-14
modified: 2025-02-23
replaces: sexualDysfunction
comment: Recurring problems or difficulties with sexual response, desire, or pleasure. Includes dysfunction occurring at any time in the sexual response cycle that causes distress or prevents one’s typical sexual function.
comment: Problemas o dificultades recurrentes con la respuesta, el deseo o el placer sexual. Incluye la disfunción que ocurre en cualquier momento del ciclo de respuesta sexual y que causa angustia o impide la función sexual típica.
alternative label: Sexual malfunction
alternative label: Disfuncionalidad sexual
change note: Version 4.2.0
in scheme: v3
narrower: Erectile dysfunction
narrower: Vaginismus
preferred label: Disfunción sexual
related: Sex therapy
related: Sexual excitement
related: Sexual function
related: Sexual health
related: Sexuality

LGBTQ+ survivors of hate crimes
type: Concept
issued: 2019-05-14
modified: 2025-02-23
replaces: survivorsOfHateCrimesLGBTQ
comment: LGBTQ+ people who have experienced and survived hate crimes; follow the individual's preference for "victims" or "survivors" whenever possible.
comment: Personas LGBTQ+ que han sufrido y sobrevivido crímenes de odio; siga la preferencia de la persona sobre el uso de "víctimas" o "sobrevivientes" siempre que sea posible.
alternative label: Survivors of hate crimes (LGBTQ)
alternative label: Sobrevientes de crimines de odio (LGBTQ)
broader: LGBTQ+ victims of hate crimes
change note: Version 4.2.0
has top concept: LGBTQ+ people
in scheme: v3
narrower: Bisexual survivors of hate crimes
narrower: Gay survivors of hate crimes
narrower: Lesbian survivors of hate crimes
narrower: Queer survivors of hate crimes
narrower: Transgender survivors of hate crimes
narrower: Asexual survivors of hate crimes
narrower: Intersex survivors of hate crimes
preferred label: Sobrevivientes LGBTQ+ de crímenes de odio
related: Police interactions with LGBTQ+ people
related: Two-Spirit survivors of hate crimes

LGBTQ+ survivors of rape
type: Concept
issued: 2019-05-14
modified: 2025-02-23
replaces: survivorsOfRapeLGBTQ
comment: LGBTQ+ people who have experienced and survived rape; follow the individual's preference for "victims" or "survivors" whenever possible.
comment: Personas LGBTQ+ que han sufrido y sobrevivido la violación; siga la preferencia de la persona sobre el uso de "víctimas" o "sobrevivientes" siempre que sea posible.
alternative label: Survivors of rape (LGBTQ)
alternative label: Sobrevivientes de violacion (LGBTQ)
broader: LGBTQ+ victims of rape
change note: Version 4.2.0
has top concept: LGBTQ+ people
in scheme: v3
narrower: Bisexual survivors of rape
narrower: Gay survivors of rape
narrower: Lesbian survivors of rape
narrower: Queer survivors of rape
narrower: Transgender survivors of rape
narrower: Asexual survivors of rape
narrower: Intersex survivors of rape
preferred label: Sobrevivientes LGBTQ+ de violación
related: Rape/non-con (Content warning)
related: Two-Spirit survivors of rape

LGBTQ+ survivors of war
type: Concept
issued: 2019-05-14
modified: 2025-02-23
replaces: survivorsOfWarLGBTQ
comment: LGBTQ+ people who have experienced and survived war; follow the individual's preference for "victims" or "survivors" whenever possible.
comment: Personas LGBTQ+ que han sufrido y sobrevivido la guerra; siga la preferencia de la persona sobre el uso de "víctimas" o "sobrevivientes" siempre que sea posible.
alternative label: Survivors of war (LGBTQ)
alternative label: Sobrevivientes de guerra (LGBTQ)
broader: LGBTQ+ people
change note: Version 4.2.0
has top concept: LGBTQ+ people
in scheme: v3
narrower: Bisexual survivors of war
narrower: Gay survivors of war
narrower: Lesbian survivors of war
narrower: Queer survivors of war
narrower: Transgender survivors of war
narrower: Asexual survivors of war
narrower: Intersex survivors of war
preferred label: Sobrevivientes LGBTQ+ de guerra
related: LGBTQ+ victims of war
related: Two-Spirit survivors of war

Therapies
type: Concept
issued: 2019-05-14
modified: 2025-04-23
replaces: therapies
comment: Treatments addressing impairments, illnesses, diseases, or disorders through counseling and rehabilitation.
comment: Tratamientos que abordan discapacidades, enfermedades, dolencias o trastornos a través del asesoramiento y la rehabilitación.
broader: Medical care
change note: Version 4.2.0
has top concept: Medical care
in scheme: v3
narrower: Behavioral therapy
narrower: Conversion therapy
narrower: Hormone therapy (Gender)
narrower: Electroshock therapy
narrower: Herbal treatments
narrower: Medication
narrower: Sex therapy
narrower: Voice therapy (Gender)
preferred label: Terapias
related: Mental health care for LGBTQ+ people
related: LGBTQ+ psychology

Transgender children
type: Concept
issued: 2019-05-14
modified: 2025-02-23
replaces: transgenderChildren
comment: Transgender people who have not yet reached the age of adolescence.
comment: Niños menores de 18 años que se autoidentifican como transgénero.
broader: LGBTQ+ children
broader: Transgender people
broader: Transgender youth
change note: Version 4.2.0
has top concept: Family members
in scheme: v3
narrower: Transgender daughters
narrower: Transgender sons
preferred label: Niños transgénero
related: Puberty blockers
related: Transgender characters
related: Transgender identity
related: Transgender health care bans for children and youth
related: Health care for transgender children and youth

Undocumented LGBTQ+ residents
type: Concept
issued: 2019-05-14
modified: 2025-02-23
replaces: undocumentedLGBTQResidents
comment: LGBTQ+ people who do not have official documentation to remain legal residents of the countries in which they live.
comment: Personas LGBTQ+ que no cuentan con documentación oficial para seguir siendo residentes legales de los países en los que viven.
alternative label: Undocumented LGBTQ residents
alternative label: Residentes LGBTQ indocumentados
broader: LGBTQ+ people
change note: Version 4.2.0
has top concept: LGBTQ+ people
in scheme: v3
preferred label: Residentes LGBTQ+ indocumentados
related: Law
related: Legal status
related: LGBTQ+ people of shared ethnic or national identities
related: LGBTQ+ immigration rights
related: LGBTQ+ migrants
related: LGBTQ+ refugees
related: LGBTQ+ persecutions
related: LGBTQ+ immigrants
related: LGBTQ+ asylum seekers

Vagina
type: Concept
issued: 2019-05-14
modified: 2025-02-23
replaces: vaginas
comment: Internal muscular channel connected to external genital organs.
comment: Canal muscular interno conectado a los órganos genitales externos.
alternative label: Cunt
alternative label: Pussy
alternative label: Snatch
alternative label: Twat
alternative label: Vag
alternative label: Vaginas
alternative label: Pepe
alternative label: Coño
alternative label: Chocho
alternative label: Chocha
alternative label: Borrego
alternative label: Crica
alternative label: Panocha
broader: Erogenous body parts
broader: Genitals
change note: Version 4.2.0
has top concept: Erogenous body parts
in scheme: v3
narrower: G-spot
narrower: Neovagina
related: Cunnilingus
related: Sex assigned at birth
related: Vaginismus
related: Labiaplasty
related: Vaginectomy
related: Vaginoplasty

Alcoholics
type: Concept
is replaced by: homoit0001540
issued: 2020-06-02
issued: 2020-06-03
modified: 2022-08-22
modified: 2025-04-24
replaces: alcoholics
replaces: alcoholism
replaces: LGBTQAlcoholics
comment: Individuals who are addicted to alcohol or have alcohol dependencies
comment: LGBTQ+ people who have been diagnosed with or regard themselves as having an alcohol use disorder, a medical condition that involves a pattern of alcohol use that is difficult to control, negatively impacts the individual's life, and results in withdrawal symptoms upon cessation. Only use to refer to individuals who describe themselves as having an alcohol use disorder. Follow the individual's preference for "use disorder" or "addiction" whenever possible.
comment: Personas LGBTQ+ que han sido diagnosticadas o que reconocen que tienen un trastorno por consumo de alcohol, una condición médica que implica un patrón de consumo de alcohol difícil de controlar, que afecta negativamente la vida de la persona y que provoca síntomas de abstinencia al dejar de consumirlo. Utilícese únicamente para referirse a personas que se describen a sí mismas como padeciendo de un trastorno por consumo de alcohol. Siga la preferencia de la persona sobre el uso de "trastorno por consumo" o "adicción" siempre que sea posible.
alternative label: Alcoholics (LGBTQ)
alternative label: LGBTQ+ alcoholics
alternative label: Alcohólicos (LGBTQ)
alternative label: Alcohólicos LGBTQ+
alternative label: LGBTQ+ alcohólicos
broader: LGBTQ+ people who use substances
broader: LGBTQ+ people with addictions
change note: Version 4.2.0
has top concept: LGBTQ+ people
in scheme: v3
preferred label: Alcoholism
preferred label: LGBTQ+ people with alcohol use disorders
preferred label: Personas LGBTQ+ con trastornos por consumo de alcohol
related: LGBTQ+ children
related: LGBTQ+ partners
related: LGBTQ+ people in Adult Children of Alcoholics
related: Recovery groups
related: LGBTQ+ people in recovery
related: Two-Spirit people with alcohol use disorders

Consensual non-monogamy
type: Concept
issued: 2021-06-30
modified: 2025-02-23
replaces: consensualNonMonogamy
comment: Practice of romantic or sexual relationships with more than one person simultaneously and with all the consent of all partners involved.
comment: Práctica de relaciones románticas o sexuales con más de una persona simultáneamente y con el consentimiento de todas las parejas involucradas.
alternative label: Ethical Non-monogamy
alternative label: No monogamia ética
alternative label: NMC
alternative label: NME
broader: Non-monogamy
change note: Version 4.2.0
has top concept: Relationship orientation
in scheme: v3
narrower: Polyamory
narrower: DADT relationships
narrower: Swinging
narrower: Relationship anarchists
narrower: Relationship anarchy
narrower: Open marriage
preferred label: No monogamia consensual
related: Metamours
related: Compersion
related: Paramours

Lesbian authors
type: Concept
issued: 2021-11-02
modified: 2025-03-13
comment: Lesbian creators of written works.
comment: Creadoras de obras escritas conocidas por ser lesbianas.
broader: LGBTQ+ authors
change note: Version 4.2.0
has top concept: LGBTQ+ people
in scheme: v3
preferred label: Autoras lesbianas
related: Lesbian drama
related: Lesbian fiction
related: Lesbian literature
related: Lesbian poetry
related: Lesbian literary criticism
related: Lesbian autobiographies
related: Lesbians in fandom
related: Lesbian biographies
related: Lesbians' writings

Transgender authors
type: Concept
issued: 2021-11-02
modified: 2025-02-23
comment: Transgender creators of written works.
comment: Creadores de obras escritas conocidos por ser transgénero.
broader: LGBTQ+ authors
change note: Version 4.2.0
has top concept: LGBTQ+ people
in scheme: v3
preferred label: Autores transgénero
related: Transgender drama
related: Transgender fiction
related: Transgender literature
related: Transgender poetry
related: Transgender literary criticism
related: Transgender autobiographies
related: Transgender people in fandom
related: Transgender biographies

Queer authors
type: Concept
issued: 2021-11-02
modified: 2025-03-13
comment: Queer creators of written works.
comment: Creadores de obras escritas conocidos por ser queer.
broader: LGBTQ+ authors
change note: Version 4.2.0
has top concept: LGBTQ+ people
in scheme: v3
preferred label: Autores queer
related: Queer drama
related: Queer fiction
related: Queer literature
related: Queer poetry
related: Queer literary criticism
related: Queer autobiographies
related: Queer people in fandom
related: Queer biographies
related: Queer people's writings

Asexual authors
type: Concept
issued: 2021-11-09
modified: 2025-03-13
comment: Asexual creators of written works.
comment: Creadores de obras escritas conocidos por ser asexuales.
alternative label: Ace authors
alternative label: Ace writers
alternative label: Asexual writers
alternative label: Autores ace
alternative label: Escritores ace
alternative label: Escritores asexuales
alternative label: Autoras ace
alternative label: Escritoras ace
alternative label: Escritoras asexuales
broader: LGBTQ+ authors
change note: Version 4.2.0
has top concept: LGBTQ+ people
in scheme: v3
preferred label: Autores asexuales
related: Asexual fiction
related: Asexual people in fandom
related: Asexual poetry
related: Asexual literature
related: Asexual autobiographies
related: Asexual biographies
related: Asexual literary criticism
related: Asexual people's writings

Gender creative
type: Concept
issued: 2021-11-23
modified: 2025-02-23
comment: Term used to describe people, typically children, who do not conform to traditional gender norms and instead creatively interweave their internal and external experiences to understand their gender identity and expression. May also be used to describe a way of raising children outside of traditional gender norms.
comment: Término utilizado para describir a personas, generalmente niños, que no se ajustan a las normas de género tradicionales y, en cambio, entrelazan creativamente sus experiencias internas y externas para comprender su identidad y expresión de género. También puede utilizarse para describir una forma de criar a los niños fuera de las normas tradicionales de género.
broader: Gender expression
broader: Gender identity
change note: Version 4.2.0
has top concept: Gender
in scheme: v3
preferred label: Género creativo
related: Androgyny
related: LGBTQ+ children
related: Gender bending
related: Gender non-conforming people
related: Gender roles
related: LGBTQ+ youth
related: Gender non-conforming identity
related: Non-binary children

LGBTQ+ chefs
type: Concept
issued: 2021-12-07
modified: 2025-02-23
comment: LGBTQ+ people who are trained, professional cooks, typically holding a leadership role in the kitchen in which they are employed.
comment: Personas LGBTQ+ que son cocineros profesionales capacitados y que generalmente desempeñan un papel de liderazgo en la cocina en la que trabajan.
alternative label: Chefs (LGBTQ)
alternative label: Cocineros (LGBTQ)
alternative label: Chefs LGBTQ+
broader: LGBTQ+ people
change note: Version 4.2.0
has top concept: LGBTQ+ people
in scheme: v3
narrower: Lesbian chefs
narrower: Gay chefs
narrower: Bisexual chefs
narrower: Transgender chefs
narrower: Queer chefs
narrower: Intersex chefs
narrower: Asexual chefs
preferred label: Cocineros LGBTQ+
related: LGBTQ+ employment
related: Two-Spirit chefs

Vaginectomy
type: Concept
issued: 2022-02-14
modified: 2025-02-23
comment: Surgical removal of the vagina.
comment: Extirpación quirúrgica de la vagina.
broader: Bottom surgery
change note: Version 4.2.0
has top concept: Medical care
in scheme: v3
preferred label: Vaginectomía
related: Clitoris
related: Transitioning (Gender)
related: Vagina
related: Vulva
related: Metoidioplasty
related: Scrotoplasty
related: Phalloplasty
related: Neophallus

LGBTQ+ hard of hearing people
type: Concept
issued: 2022-02-17
modified: 2026-02-23
comment: LGBTQ+ people with significant or total hearing loss who may or may not consider themselves d/Deaf.
comment: Personas LGBTQ+ con pérdida auditiva significativa o total, que pueden o no considerarse S/sordas.
alternative label: Hard of hearing people (LGBTQ)
alternative label: Hearing impaired people (LGBTQ)
alternative label: HoH people (LGBTQ)
alternative label: LGBTQ+ HoH people
alternative label: LGBTQ+ hearing impaired people
alternative label: Personas LGBTQ+ con dificultades de audición
alternative label: Personas LGBTQ+ con dificultades auditivas
broader: LGBTQ+ disabled people
change note: Version 4.2.0
has top concept: LGBTQ+ people
in scheme: v3
narrower: Lesbian hard of hearing people
narrower: Gay hard of hearing men
narrower: Bisexual hard of hearing people
narrower: Transgender hard of hearing people
narrower: Queer hard of hearing people
narrower: Asexual hard of hearing people
preferred label: Personas LGBTQ+ con problemas de audición
related: LGBTQ+ Deaf culture
related: Two-Spirit hard of hearing people
related: LGBTQ+ hand signs (Language)

LGBTQ+ Deaf people
type: Concept
issued: 2022-02-17
modified: 2026-02-23
comment: LGBTQ+ people with significant or total hearing loss. Some but not all Deaf people prefer to capitalize Deaf in recognition of the cultural and linguistic identity they share with other Deaf people.
comment: Personas LGBTQ+ con pérdida auditiva significativa o total. Algunas personas sordas, pero no todas, prefieren escribir “Sorda/o” con mayúscula en reconocimiento de la identidad cultural y lingüística que comparten con otras personas sordas.
alternative label: Deaf people (LGBTQ)
alternative label: Personas sordas (LGBTQ)
broader: LGBTQ+ disabled people
change note: Version 4.2.0
has top concept: LGBTQ+ people
in scheme: v3
narrower: Lesbian Deaf people
narrower: Gay Deaf men
narrower: Bisexual Deaf people
narrower: Transgender Deaf people
narrower: Queer Deaf people
narrower: Asexual Deaf people
preferred label: Personas LGBTQ+ sordas
related: LGBTQ+ Deaf culture
related: Two-Spirit Deaf people
related: LGBTQ+ hand signs (Language)

Transmisogyny
type: Concept
issued: 2022-02-24
modified: 2025-02-23
comment: The intersection of transphobia and misogyny as directed toward trans women and transfeminine people.
comment: La intersección de la transfobia y la misoginia dirigida hacia las mujeres trans y las personas transfemeninas.
change note: Version 4.2.0
in scheme: v3
narrower: Trans-exclusionary radical feminism
preferred label: Transmisoginia
related: Anti-transgender discrimination
related: Intolerance towards LGBTQ+ people
related: Misogyny
related: Transphobia
related: Transmisogynoir
related: Misogynoir
related: QTPOC
related: Transfeminism

Transmisogynoir
type: Concept
issued: 2022-03-29
modified: 2025-02-23
comment: Term coined by coined by Trudy of the womanist blog Gradient Lair to describe the intersection of transphobia, misogyny, and anti-Black racism as directed toward Black trans women.
comment: Término acuñado por Trudy del blog mujerista Gradient Lair para describir la intersección de la transfobia, la misoginia y el racismo anti-negro dirigido hacia las mujeres trans negras.
change note: Version 4.2.0
in scheme: v3
preferred label: Transmisoginoir
related: Anti-transgender discrimination
related: Intolerance towards LGBTQ+ people
related: Misogyny
related: Transphobia
related: Transmisogyny
related: Critical race theory
related: Misogynoir
related: Racism
related: Anti-Blackness

Kānaka Maoli LGBTQ+ people
type: Concept
issued: 2022-05-11
modified: 2025-02-23
comment: LGBTQ+ people who are part of the Indigenous people of Mokupuni o Hawai‘i, or the Hawaiian Islands; only use to refer to people who identify as Kanaka Maoli.
comment: Personas LGBTQ+ que pertenecen al pueblo indígena mokupuni o hawai‘i, o a las islas hawaianas. Utilícese únicamente para describir a las personas que se identifiquen como kānaka maoli.
alternative label: Indigenous Hawaiian LGBTQ+ people
alternative label: Indigenous Hawaiians (LGBTQ)
alternative label: Kānaka Maoli (LGBTQ)
alternative label: Kānaka Maoli people (LGBTQ)
alternative label: LGBTQ+ Indigenous Hawaiians
alternative label: LGBTQ+ Kānaka Maoli
alternative label: LGBTQ+ Kānaka ʻŌiwi
alternative label: LGBTQ+ Native Hawaiians
alternative label: Native Hawaiian LGBTQ+ people
alternative label: Native Hawaiians (LGBTQ)
broader: Indigenous LGBTQ+ people
change note: Version 4.2.0
has top concept: LGBTQ+ people
in scheme: v3
narrower: Kānaka Maoli lesbians
narrower: Kānaka Maoli gay men
narrower: Kānaka Maoli bisexual people
narrower: Kānaka Maoli transgender people
narrower: Kānaka Maoli queer people
narrower: Kānaka Maoli intersex people
narrower: Kānaka Maoli asexual people
narrower: Kānaka Maoli non-binary people
preferred label: Personas LGBTQ+ kānaka maoli
related: Māhū

Hispanic LGBTQ+ people
type: Concept
issued: 2022-05-16
modified: 2025-02-23
comment: LGBTQ+ people who are from or descended from Spain or other regions formerly colonized by Spain that are primarily Spanish-speaking. Only use for individuals who self-identify as Hispanic; do not conflate with Latino/a/x or Chicano/a/x.
comment: Personas LGBTQ+ que hablan español, son de países de habla hispana y/o descienden de culturas de habla hispana; utilícese únicamente para personas que se autoidentifiquen como hispanas. No debe combinarse con Latino/a/x o Chicano/a/x.
alternative label: Hispanic people (LGBTQ)
alternative label: LGBTQ+ Hispanic people
alternative label: LGBTQ+ Hispanics
alternative label: Personas hispanas (LGBTQ)
alternative label: Personas hispanas LGBTQ+
alternative label: Hispanos LGBTQ+
broader: LGBTQ+ people of shared ethnic or national identities
change note: Version 4.2.0
has top concept: LGBTQ+ people
in scheme: v3
narrower: Hispanic lesbians
narrower: Hispanic gay men
narrower: Hispanic bisexual people
narrower: Hispanic transgender people
narrower: Hispanic queer people
narrower: Hispanic intersex people
narrower: Hispanic non-binary people
narrower: Hispanic asexual people
narrower: Hispanic American LGBTQ+ people
preferred label: Personas LGBTQ+ hispanas

Assamese LGBTQ+ people
type: Concept
issued: 2022-06-15
modified: 2025-02-23
comment: LGBTQ+ people who are a part of the socio-ethnic Assamese peoples, speak the Assamese language, or reside in the Indian state of Assam. Only use for people who identify as Assamese.
comment: Personas LGBTQ+ que forman parte de los pueblos socioétnicos asameses, hablan la lengua asamesa o residen en el estado indio de Assam.
alternative label: Asomiya (LGBTQ)
alternative label: Assamese people (LGBTQ)
alternative label: LGBTQ+ Asomiya
alternative label: LGBTQ+ Assamese people
alternative label: Personas asamesas (LGBTQ)
alternative label: Asameses LGBTQ+
alternative label: Personas asamesas LGBTQ+
alternative label: Asamesas LGBTQ+
broader: LGBTQ+ people of shared ethnic or national identities
broader: LGBTQ+ people of color
change note: Version 4.2.0
has top concept: LGBTQ+ people
in scheme: v3
narrower: Assamese lesbians
narrower: Assamese gay men
narrower: Assamese bisexual people
narrower: Assamese queer people
narrower: Assamese intersex people
narrower: Assamese transgender people
narrower: Assamese asexual people
narrower: Assamese non-binary people
preferred label: Personas LGBTQ+ asamesas

Awadhi LGBTQ+ people
type: Concept
issued: 2022-06-27
modified: 2025-02-23
comment: LGBTQ+ people who speak the Awadhi dialect and reside in or are descended from those who resided in the Awadh region of Uttar Pradesh.
comment: Personas LGBTQ+ que hablan el dialecto awadi, residen o descienden de quienes residieron en la región awadi de Uttar Pradesh, en el norte de India.
alternative label: Awadhi people (LGBTQ)
alternative label: Awadhis (LGBTQ)
alternative label: LGBTQ Awadhis
alternative label: LGBTQ+ Awadhi people
alternative label: Personas awadi (LGBTQ)
alternative label: Awadi (LGBTQ)
alternative label: LGBTQ+ awadi
alternative label: Personas awadi LGBTQ+
broader: LGBTQ+ people of shared ethnic or national identities
broader: LGBTQ+ people of color
change note: Version 4.2.0
has top concept: LGBTQ+ people
in scheme: v3
narrower: Awadhi lesbians
narrower: Awadhi gay men
narrower: Awadhi bisexual people
narrower: Awadhi queer people
narrower: Awadhi transgender people
narrower: Awadhi intersex people
narrower: Awadhi asexual people
narrower: Awadhi non-binary people
preferred label: Personas LGBTQ+ awadi

Bhojpuri LGBTQ+ people
type: Concept
issued: 2022-06-27
modified: 2025-02-23
comment: LGBTQ+ people who speak the Bhojpuri language and live in or are descended from those who inhabited the Bhojpuri-Purvanchal region of India and Nepal.
comment: Personas LGBTQ+ que hablan el idioma bhojpuri y viven, pertenecen o son descendientes de quienes habitaron la región de Bhojpuri-Purvanchal de India y Nepal.
alternative label: Bhojpuri people (LGBTQ)
alternative label: Bhojpuriyas (LGBTQ)
alternative label: LGBTQ+ Bhojpuri people
alternative label: LGBTQ+ Bhojpuriyas
alternative label: Personas bhojpuri (LGBTQ)
alternative label: Personas bhojpuriyas LGBTQ+
alternative label: Bhojpuriyas LGBTQ+
broader: LGBTQ+ people of shared ethnic or national identities
broader: LGBTQ+ people of color
change note: Version 4.2.0
has top concept: LGBTQ+ people
in scheme: v3
narrower: Bhojpuri lesbians
narrower: Bhojpuri gay men
narrower: Bhojpuri bisexual people
narrower: Bhojpuri queer people
narrower: Bhojpuri transgender people
narrower: Bhojpuri intersex people
narrower: Bhojpuri asexual people
narrower: Bhojpuri non-binary people
preferred label: Personas LGBTQ+ bhojpuri

Bengali LGBTQ+ people
type: Concept
issued: 2022-06-27
modified: 2025-02-23
comment: LGBTQ+ people who speak the Bengali language or are of Bengali descent.
comment: Personas LGBTQ+ que hablan el idioma bengalí o son de ascendencia bengalí. Correferenciar con personas LGBTQ+ de Bangladesh cuando una persona es tanto de etnia bengalí como de nacionalidad bangladesí.
alternative label: Bengali people (LGBTQ)
alternative label: Bengalis (LGBTQ)
alternative label: LGBTQ+ Bengali people
alternative label: LGBTQ+ Bengalis
alternative label: Personas bengalíes (LGBTQ)
alternative label: Bengalíes (LGBTQ)
alternative label: Personas bengalíes LGBTQ+
alternative label: Bengalíes LGBTQ+
broader: LGBTQ+ people of shared ethnic or national identities
broader: LGBTQ+ people of color
change note: Version 4.2.0
has top concept: LGBTQ+ people
in scheme: v3
narrower: Bengali lesbians
narrower: Bengali gay men
narrower: Bengali bisexual people
narrower: Bengali queer people
narrower: Bengali transgender people
narrower: Bengali intersex people
narrower: Bengali asexual people
narrower: Bengali non-binary people
preferred label: Personas LGBTQ+ bengalíes

Bhil LGBTQ+ people
type: Concept
issued: 2022-06-27
modified: 2025-02-23
comment: LGBTQ+ people who speak the Bhil language and belong to or are descended from the Bhil tribal group.
comment: Personas LGBTQ+ que hablan el idioma bhil y pertenecen o son descendientes del grupo tribal bhil.
alternative label: Bheel LGBTQ+ people
alternative label: Bheel people (LGBTQ)
alternative label: Bhil people (LGBTQ)
alternative label: LGBTQ+ Bhil people
alternative label: LGBTQ+ Bhils
alternative label: Personas bhils LGBTQ+
alternative label: Personas bhils (LGBTQ)
alternative label: Bhils LGBTQ+
broader: LGBTQ+ people of shared ethnic or national identities
broader: LGBTQ+ people of color
change note: Version 4.2.0
has top concept: LGBTQ+ people
in scheme: v3
narrower: Bhil lesbians
narrower: Bhil gay men
narrower: Bhil queer people
narrower: Bhil transgender people
narrower: Bhil intersex people
narrower: Bhil asexual people
narrower: Bhil non-binary people
narrower: Bhil bisexual people
preferred label: Personas LGBTQ+ bhil

Chakma LGBTQ+ people
type: Concept
issued: 2022-06-27
modified: 2025-02-23
comment: LGBTQ+ people who belong to or are descended from the Chakma tribal group.
comment: Personas LGBTQ+ que pertenecen o son descendientes del grupo tribal chakma.
alternative label: Chakma people (LGBTQ)
alternative label: LGBTQ+ Chakma people
alternative label: Personas chakma LGBTQ+
alternative label: Personas chakma (LGBTQ)||
broader: LGBTQ+ people of shared ethnic or national identities
broader: LGBTQ+ people of color
change note: Version 4.2.0
has top concept: LGBTQ+ people
in scheme: v3
narrower: Chakma lesbians
narrower: Chakma gay men
narrower: Chakma bisexual people
narrower: Chakma queer people
narrower: Chakma intersex people
narrower: Chakma transgender people
narrower: Chakma asexual people
narrower: Chakma non-binary people
preferred label: Personas LGBTQ+ chakma

Kho LGBTQ+ people
type: Concept
issued: 2022-06-27
modified: 2025-02-23
comment: LGBTQ+ people who belong to or are descended from the people indigenous to the Chitral and Ghizer districts of modern-day Pakistan.
comment: Personas LGBTQ+ que pertenecen a o son descendientes de las personas nativas de los distritos de Chitral y Ghizer del actual Pakistán.
alternative label: Chitrali LGBTQ+ people
alternative label: Chitrali people (LGBTQ)
alternative label: Kho people (LGBTQ)
alternative label: LGBTQ+ Kho people
broader: LGBTQ+ people of shared ethnic or national identities
broader: LGBTQ+ people of color
change note: Version 4.2.0
has top concept: LGBTQ+ people
in scheme: v3
narrower: Kho lesbians
narrower: Kho gay men
narrower: Kho bisexual people
narrower: Kho transgender people
narrower: Kho queer people
narrower: Kho intersex people
narrower: Kho asexual people
narrower: Kho non-binary people
preferred label: Personas LGBTQ+ kho

Maldivian LGBTQ+ people
type: Concept
issued: 2022-06-27
modified: 2025-02-23
comment: LGBTQ+ people who belong to or are descended from the people native to the Maldives (including the island of Minicoy) and speak the Maldivian language.
comment: Personas LGBTQ+ que pertenecen a o son descendientes de las personas nativas de las Maldivas (incluyendo la isla Minicoy) y que hablan el idioma maldivo.
alternative label: Dhivehin LGBTQ+ people
alternative label: Dhivehin people (LGBTQ)
alternative label: LGBTQ+ Maldivians
alternative label: Maldivian people (LGBTQ)
alternative label: Personas maldivas LGBTQ+
broader: LGBTQ+ people of shared ethnic or national identities
broader: LGBTQ+ people of color
change note: Version 4.2.0
has top concept: LGBTQ+ people
in scheme: v3
narrower: Maldivian lesbians
narrower: Maldivian gay men
narrower: Maldivian bisexual people
narrower: Maldivian queer people
narrower: Maldivian transgender people
narrower: Maldivian intersex people
narrower: Maldivian asexual people
narrower: Maldivian non-binary people
preferred label: Personas LGBTQ+ maldivas

Dogra LGBTQ+ people
type: Concept
issued: 2022-06-27
modified: 2025-02-23
comment: LGBTQ+ people who are of the Dogra people of India and Pakistan and speak the Dogri language.
comment: Personas LGBTQ+ que son de las personas dogra de India y Pakistán, y hablan el idioma dogrí.
alternative label: Dogra people (LGBTQ)
alternative label: Dogras (LGBTQ)
alternative label: LGBTQ+ Dogra people
alternative label: LGBTQ+ Dogras
broader: LGBTQ+ people of shared ethnic or national identities
broader: LGBTQ+ people of color
change note: Version 4.2.0
has top concept: LGBTQ+ people
in scheme: v3
narrower: Dogra lesbians
narrower: Dogra gay men
narrower: Dogra bisexual people
narrower: Dogra queer people
narrower: Dogra transgender people
narrower: Dogra intersex people
narrower: Dogra asexual people
narrower: Dogra non-binary people
preferred label: Personas LGBTQ+ dogra

Garhwali LGBTQ+ people
type: Concept
issued: 2022-06-27
modified: 2025-02-23
comment: LGBTQ+ people who belong to or are descended from those native to Garhwal in Uttarakhand and who speak Garhwali.
comment: Personas LGBTQ+ que pertenecen a o son descendientes de las personas nativas de Garhwal en Uttarakhand y que hablan garhwali.
alternative label: Garhwali people (LGBTQ)
alternative label: Garhwalis (LGBTQ)
alternative label: LGBTQ+ Garhwali people
alternative label: LGBTQ+ Garhwalis
broader: LGBTQ+ people of shared ethnic or national identities
broader: LGBTQ+ people of color
change note: Version 4.2.0
has top concept: LGBTQ+ people
in scheme: v3
narrower: Garhwali lesbians
narrower: Garhwali gay men
narrower: Garhwali bisexual people
narrower: Garhwali queer people
narrower: Garhwali transgender people
narrower: Garhwali intersex people
narrower: Garhwali asexual people
narrower: Garhwali non-binary people
preferred label: Personas LGBTQ+ garhwali

Gujarati LGBTQ+ people
type: Concept
issued: 2022-07-20
modified: 2025-02-23
comment: LGBTQ+ people who reside in or are descended from those indigenous to the Indian state of Gujarat.
comment: Personas LGBTQ+ que residen en o son descendientes de las personas indígenas del estado indio de Gujarat.
alternative label: Gujarati people (LGBTQ)
alternative label: Gujaratis (LGBTQ)
alternative label: LGBTQ+ Gujarati people
alternative label: LGBTQ+ Gujaratis
broader: LGBTQ+ people of shared ethnic or national identities
broader: LGBTQ+ people of color
change note: Version 4.2.0
has top concept: LGBTQ+ people
in scheme: v3
narrower: Gujarati lesbians
narrower: Gujarati gay men
narrower: Gujarati bisexual people
narrower: Gujarati transgender people
narrower: Gujarati asexual people
narrower: Gujarati queer people
narrower: Gujarati intersex people
narrower: Gujarati non-binary people
preferred label: Personas LGBTQ+ guyaratí

Haryanvi LGBTQ+ people
type: Concept
issued: 2022-07-28
modified: 2025-02-23
comment: LGBTQ+ people who are indigenous to or descended from those indigenous to what is now the Indian state of Haryana. This term can also apply to those who currently reside in Haryana.
comment: Personas LGBTQ+ que son indígenas o son descendientes de personas indígenas de lo que hoy es el estado de Haryana. Este término también es aplicable a quienes actualmente residen en Haryana.
alternative label: Haryanvi people (LGBTQ)
alternative label: Haryanvis (LGBTQ)
alternative label: LGBTQ+ Haryanvi people
alternative label: LGBTQ+ Haryanvis
broader: LGBTQ+ people of shared ethnic or national identities
broader: LGBTQ+ people of color
change note: Version 4.2.0
has top concept: LGBTQ+ people
in scheme: v3
narrower: Haryanvi lesbians
narrower: Haryanvi gay men
narrower: Haryanvi bisexual people
narrower: Haryanvi transgender people
narrower: Haryanvi queer people
narrower: Haryanvi intersex people
narrower: Haryanvi asexual people
narrower: Haryanvi non-binary people
preferred label: Personas LGBTQ+ haryanvi

Kalash LGBTQ+ people
type: Concept
issued: 2022-07-28
modified: 2025-02-23
comment: LGBTQ+ people who belong to the indigenous Kalasha people and reside in the Chitral District of Khyber-Pakhtunkhwa province in Pakistan.
comment: Personas LGBTQ+ que pertenecen al pueblo indígena kalasha y residen en el distrito Chitral de la provincia Khyber-Pakhtunkhwa en Pakistán.
alternative label: Kalasha (LGBTQ)
alternative label: Kalasha LGBTQ+ people
alternative label: LGBTQ+ Kalasha
broader: LGBTQ+ people of shared ethnic or national identities
broader: LGBTQ+ people of color
change note: Version 4.2.0
has top concept: LGBTQ+ people
in scheme: v3
narrower: Kalash lesbians
narrower: Kalash gay men
narrower: Kalash bisexual people
narrower: Kalash transgender people
narrower: Kalash queer people
narrower: Kalash intersex people
narrower: Kalash asexual people
narrower: Kalash non-binary people
preferred label: Personas LGBTQ+ kalash

Kashmiri LGBTQ+ people
type: Concept
issued: 2022-11-15
modified: 2025-02-23
comment: LGBTQ+ people who live in or are descended from those native to the Kashmir Valley in the Indian subcontinent.
comment: Personas LGBTQ+ que viven en o son descendientes de las personas nativas del valle de Cachemira en el subcontinente indio.
alternative label: LGBTQ+ Kashmiri people
alternative label: LGBTQ+ Kashmiris
broader: LGBTQ+ people of shared ethnic or national identities
broader: LGBTQ+ people of color
change note: Version 4.2.0
has top concept: LGBTQ+ people
in scheme: v3
narrower: Kashmiri lesbians
narrower: Kashmiri gay men
narrower: Kashmiri bisexual people
narrower: Kashmiri queer people
narrower: Kashmiri transgender people
narrower: Kashmiri intersex people
narrower: Kashmiri asexual people
narrower: Kashmiri non-binary people
preferred label: Personas LGBTQ+ cachemires

Konkan LGBTQ+ people
type: Concept
issued: 2022-11-15
modified: 2025-02-23
comment: LGBTQ+ people who are from or descended from those native to the Konkan region of the Indian subcontinent, and who speak any of the dialects of the Konkani language.
comment: Personas LGBTQ+ que pertenecen a o son descendientes de las personas nativas de la región Konkan del subcontinente indio, y que hablan cualquiera de los dialectos de la lengua konkani.
alternative label: LGBTQ+ Konkani
broader: LGBTQ+ people of shared ethnic or national identities
broader: LGBTQ+ people of color
change note: Version 4.2.0
has top concept: LGBTQ+ people
in scheme: v3
narrower: Konkan lesbians
narrower: Konkan gay men
narrower: Konkan bisexual people
narrower: Konkan queer people
narrower: Konkan transgender people
narrower: Konkan intersex people
narrower: Konkan asexual people
narrower: Konkan non-binary people
preferred label: Personas LGBTQ+ konkani

Kumaoni LGBTQ+ people
type: Concept
issued: 2022-11-15
modified: 2025-02-23
comment: LGBTQ+ people who live mostly in Kumaon region in the Indian Himalayas. They might also speak the Kumaoni language as their first language.
comment: Personas LGBTQ+ que viven principalmente en la región de Kumaon, en el Himalaya indio. También pueden hablar la lengua kumaoni como su primera lengua.
alternative label: Kumain LGBTQ+ people
alternative label: Kumaiye LGBTQ+ people
alternative label: LGBTQ+ Kumaoni people
broader: LGBTQ+ people of shared ethnic or national identities
broader: LGBTQ+ people of color
change note: Version 4.2.0
has top concept: LGBTQ+ people
in scheme: v3
narrower: Kumaoni lesbians
narrower: Kumaoni gay men
narrower: Kumaoni bisexual people
narrower: Kumaoni transgender people
narrower: Kumaoni queer people
narrower: Kumaoni intersex people
narrower: Kumaoni asexual people
narrower: Kumaoni non-binary people
preferred label: Personas LGBTQ+ kumaoni

Kutchi LGBTQ+ people
type: Concept
issued: 2022-11-15
modified: 2025-02-23
comment: LGBTQ+ people who are from or are descended from those native to the Kutch district of the Indian state of Gujarat and the Sindh region of Pakistan.
comment: Personas LGBTQ+ que pertenecen a o son descendientes de las personas nativas del distrito Konkan del estado indio de Guyarat y la región Sind de Pakistán.
alternative label: LGBTQ+ Kutchi people
broader: LGBTQ+ people of shared ethnic or national identities
broader: LGBTQ+ people of color
change note: Version 4.2.0
has top concept: LGBTQ+ people
in scheme: v3
narrower: Kutchi lesbians
narrower: Kutchi gay men
narrower: Kutchi bisexual people
narrower: Kutchi queer people
narrower: Kutchi intersex people
narrower: Kutchi transgender people
narrower: Kutchi asexual people
narrower: Kutchi non-binary people
preferred label: Personas LGBTQ+ kutchi

Greyromantic fiction
type: Concept
issued: 2023-04-11
modified: 2025-02-23
comment: Written works describing imagined events or people; use in reference to fictional works focusing on greyromantic characters or themes.
comment: Obras escritas que describen eventos o personas imaginadas; utilícese en referencia a obras de ficción que se centran en personajes o temas grisrománticos.
broader: LGBTQ+ fiction
change note: Version 4.2.0
has top concept: Subcultures
in scheme: v3
preferred label: Ficción grisromántica
related: Bisexual characters
related: Bisexual fiction
related: Bisexual literature
related: Intersex fiction
related: Asexual fiction
related: Bisexual people in fandom
related: Greyromantic authors
related: Greyromantic literature

Assisted reproduction
type: Concept
issued: 2023-04-14
modified: 2025-02-23
comment: The process by which a fetus is conceived through donor insemination, egg donation, surrogacy, IVF, and/or other reproductive technologies.
comment: Proceso por el que se concibe un feto mediante ila nseminación de un donante, la donación de óvulos, la gestación subrogada, la FIV y/u otras tecnologías reproductivas.
broader: Assisted reproductive technology
change note: Version 4.2.0
has top concept: Assisted reproductive technology
in scheme: v3
narrower: In vitro fertilization
narrower: Self-insemination
narrower: Surrogacy
narrower: Artificial insemination
narrower: Donor insemination
narrower: Egg donation
narrower: Sperm donation
preferred label: Reproducción asistida
related: Insemination
related: Anonymous donors (Reproduction)

Trans-exclusionary radical feminism
type: Concept
issued: 2024-01-02
modified: 2025-02-23
comment: A transphobic and transantagonistic ideology that rejects trans and gender diverse identities and rights, and believes that recognition of these identities and rights constitutes discrimination and oppression towards cisgender women. Though originally considered a fringe offshoot of feminism, trans-exclusionary radical feminist groups have formed alliances with right-wing, far-right extremists, and anti-feminist organizations in order to spread misinformation and further anti-trans sentiment and legislation.
comment: Una ideología transfóbica y transantagonista que rechaza las identidades y los derechos trans y de género diverso, y cree que el reconocimiento de estas identidades y estos derechos constituye discriminación y opresión hacia las mujeres cisgénero. Aunque originalmente se les consideró una rama marginal del feminismo, los grupos feministas radicales trans-excluyente han formado alianzas con organizaciones antifeministas, de derecha y de extrema derecha para difundir información errónea y promover el sentimiento y la legislación anti-trans.
alternative label: Gender critical feminism
alternative label: TERF ideology
alternative label: Trans-exclusionary feminism
alternative label: Ideología TERF
alternative label: Femismo trans-excluyente
alternative label: Feminismo crítico de género
broader: Essentialism
broader: Genderism
broader: Transphobia
broader: Transmisogyny
change note: Version 4.2.0
has top concept: Theories
in scheme: v3
preferred label: Feminismo radical trans-excluyente
related: Anti-transgender discrimination
related: Feminism
related: Second-wave feminism
related: Anti-Two-Spirit discrimination
related: Trans-exclusionary radical feminists
related: Anti-gender movement

Palestinian LGBTQ+ people
type: Concept
issued: 2024-05-24
modified: 2025-02-23
comment: LGBTQ+ people who were born in, reside in, and/or are descended from those indigenous to the country of Palestine.
alternative label: LGBTQ+ Palestinian people
alternative label: LGBTQ+ Palestinians
alternative label: Palestinian people (LGBTQ)
alternative label: Palestinians (LGBTQ)
broader: Indigenous LGBTQ+ people
broader: Arab LGBTQ+ people
change note: Version 4.2.0
has top concept: LGBTQ+ people
in scheme: v3
narrower: Palestinian gay men
narrower: Palestinian lesbians
narrower: Palestinian bisexual people
narrower: Palestinian queer people
narrower: Palestinian transgender people
narrower: Palestinian non-binary people
narrower: Palestinian asexual people
narrower: Palestinian intersex people

Arab American LGBTQ+ people
type: Concept
issued: 2024-07-11
modified: 2025-02-23
comment: LGBTQ+ people who are descended from Arab peoples and were born in the United States, or LGBTQ+ people born in Arab countries who live in or have a strong connection to the United States. Do not conflate with Muslim people.
alternative label: Arab American people (LGBTQ
alternative label: Arab Americans (LGBTQ)
alternative label: LGBTQ+ Arab Americans
broader: Arab LGBTQ+ people
change note: Version 4.2.0
has top concept: LGBTQ+ people
in scheme: v3
narrower: Arab American lesbians
narrower: Arab American gay men
narrower: Arab American bisexual people
narrower: Arab American transgender people
narrower: Arab American queer people
narrower: Arab American non-binary people
narrower: Arab American asexual people
narrower: Arab American intersex people
narrower: Arab American aromantic people

Anti-transgender legislation
type: Concept
issued: 2024-07-31
modified: 2025-02-23
comment: Efforts to propose, enact, amend, or strike down laws as a means of restricting the legal rights of transgender people. This includes legislation regarding access to gender-affirming healthcare, participation in sporting events, administrative and judicial procedures such as sex and name registration, and policies affecting the medical treatment, education, and mental health care of transgender youth.
alternative label: Anti-trans law-making
alternative label: Anti-trans legislation
alternative label: Anti-transgender law-making
broader: Law
change note: Version 4.2.0
has top concept: Law
in scheme: v3
narrower: Bathroom bans
narrower: Transgender health care bans for children and youth
narrower: Gender marker change bans
narrower: Transgender health care bans
narrower: Sports bans
related: Anti-transgender discrimination
related: Criminalization
related: Transphobia
related: Trans exclusivity

LGBTQ+ fashion designers
type: Concept
issued: 2025-04-23
modified: 2025-04-23
comment: LGBTQ+ people who design and create original clothing, accessories, and footwear.
alternative label: Fashion designers (LGBTQ)
alternative label: LGBTQ+ clothes designers
alternative label: LGBTQ+ clothing designers
broader: LGBTQ+ people
change note: Version 4.2.0
has top concept: LGBTQ+ people
in scheme: v4
narrower: Lesbian fashion designers
narrower: Gay fashion designers
narrower: Bisexual fashion designers
narrower: Transgender fashion designers
narrower: Queer fashion designers
narrower: Non-binary fashion designers
narrower: Intersex fashion designers
narrower: Two-Spirit fashion designers
related: LGBTQ+ fashion

LGBTQ+ people in mass media
type: Concept
issued: 2025-04-23
modified: 2025-04-23
comment: The depiction of LGBTQ+ people in various means of communication that reach large audiences simultaneously, including newspapers, television, radio, advertisements, and the internet.
alternative label: LGBTQ+ people in media
broader: LGBTQ+ people in arts and media
change note: Version 4.2.0
has top concept: LGBTQ+ people
in scheme: v4
narrower: Lesbians in mass media
narrower: Gay men in mass media
narrower: Bisexual people in mass media
narrower: Transgender people in mass media
narrower: Queer people in mass media
narrower: Intersex people in mass media
narrower: Non-binary people in mass media
related: LGBTQ+ celebrities
related: Two-Spirit people in mass media

LGBTQ+ people in literature
type: Concept
issued: 2025-04-23
modified: 2025-04-23
comment: The depiction of LGBTQ+ people in literature.
broader: LGBTQ+ people in arts and media
change note: Version 4.2.0
has top concept: LGBTQ+ people
in scheme: v4
narrower: Lesbians in literature
narrower: Gay men in literature
narrower: Bisexual people in literature
narrower: Transgender people in literature
narrower: Queer people in literature
narrower: Intersex people in literature
narrower: Non-binary people in literature
related: LGBTQ+ literature
related: Two-Spirit people in literature

Ryukyuan LGBTQ+ people
type: Concept
issued: 2025-04-24
modified: 2025-04-24
comment: LGBTQ+ people who belong to the Ryukyuan, an ethnic group indigenous to the Ryukyu archipelago in what is now known as Japan. Only use to refer to people who self-identify as Ryukyuan.
alternative label: LGBTQ+ Ryukyuan people
alternative label: LGBTQ+ Ryukyuans
alternative label: Ryukyuan people (LGBTQ)
alternative label: Ryukyuans (LGBTQ)
alternative label: Ryūkyūan LGBTQ+ people
alternative label: LGBTQ+ Ryūkyūan people
alternative label: LGBTQ+ Ryūkyūans
alternative label: Ryūkyūan people (LGBTQ)
alternative label: Ryūkyūans (LGBTQ)
broader: Asian LGBTQ+ people
broader: Indigenous LGBTQ+ people
change note: Version 4.2.0
has top concept: LGBTQ+ people
in scheme: v4
narrower: Ryukyuan lesbians
narrower: Ryukyuan gay men
narrower: Ryukyuan bisexual people
narrower: Ryukyuan transgender people
narrower: Ryukyuan queer people
narrower: Ryukyuan intersex people
narrower: Ryukyuan non-binary people
narrower: Ryukyuan asexual people

Sámi LGBTQ+ people
type: Concept
issued: 2025-04-24
modified: 2025-04-24
comment: LGBTQ+ people who belong to the traditionally Sámi-speaking Indigenous people of the Sápmi, which encompasses large parts of the regions now known as Norway, Sweden, Finland, and of the Kola Peninsula in Russia. Only use to refer to people who self-identify as Sámi.
alternative label: LGBTQ+ Sámi people
alternative label: LGBTQ+ Sámis
alternative label: Sámi people (LGBTQ)
broader: LGBTQ+ people of shared ethnic or national identities
broader: Indigenous LGBTQ+ people
change note: Version 4.2.0
has top concept: LGBTQ+ people
in scheme: v4
narrower: Sámi asexual people
narrower: Sámi bisexual people
narrower: Sámi gay men
narrower: Sámi lesbians
narrower: Sámi intersex people
narrower: Sámi non-binary people
narrower: Sámi queer people
narrower: Sámi transgender people

LGBTQ+ academic journals
type: Concept
issued: 2026-02-23
modified: 2026-02-23
comment: Academic journals focusing on LGBTQ+ identities, issues, or cultures; use a more specific term if possible.
alternative label: LGBTQ academic journals
broader: LGBTQ+ periodicals
change note: Version 4.2.0
has top concept: LGBTQ+ periodicals
in scheme: v4
narrower: Lesbian academic journals
narrower: Gay academic journals
narrower: Bisexual academic journals
narrower: Transgender academic journals
narrower: Queer academic journals
narrower: Intersex academic journals
narrower: Asexual academic journals
narrower: Non-binary academic journals
related: Two-Spirit academic journals

LGBTQ+ shepherds
type: Concept
issued: 2026-02-24
modified: 2026-02-24
comment: LGBTQ+ people who tend sheep.
alternative label: Shepherds (LGBTQ+)
broader: LGBTQ+ people
change note: Version 4.2.0
has top concept: LGBTQ+ people
in scheme: v4
narrower: Gay shepherds
narrower: Lesbian shepherds
narrower: Bisexual shepherds
narrower: Transgender shepherds
narrower: Queer shepherds
narrower: Non-binary shepherds
narrower: Intersex shepherds
narrower: Asexual shepherds
related: Two-Spirit shepherds

LGBTQ+ composers
type: Concept
issued: 2026-02-24
modified: 2026-02-24
comment: LGBTQ+ people who create and arrange original music.
alternative label: Composers (LGBTQ+)
alternative label: LGBTQ composers
broader: LGBTQ+ musicians
change note: Version 4.2.0
has top concept: LGBTQ+ people
in scheme: v4
narrower: Gay composers
narrower: Lesbian composers
narrower: Bisexual composers
narrower: Asexual composers
narrower: Intersex composers
narrower: Non-binary composers
narrower: Transgender composers
narrower: Queer composers
related: Two-Spirit composers

LGBTQ+ basketball players
type: Concept
issued: 2026-02-24
modified: 2026-02-24
comment: LGBTQ+ people who play basketball.
alternative label: Basketball players (LGBTQ+)
broader: LGBTQ+ athletes
change note: Version 4.2.0
has top concept: LGBTQ+ people
in scheme: v4
narrower: Gay basketball players
narrower: Lesbian basketball players
narrower: Bisexual basketball players
narrower: Asexual basketball players
narrower: Intersex basketball players
narrower: Non-binary basketball players
narrower: Transgender basketball players
narrower: Queer basketball players
related: Two-Spirit basketball players

LGBTQ+ nurses
type: Concept
issued: 2026-03-03
modified: 2026-03-04
comment: LGBTQ+ people who are licensed nurses and practice independently or in collaboration with a multidisciplinary team.
broader: LGBTQ+ medical professionals
change note: Version 4.2.0
has top concept: LGBTQ+ people
in scheme: v4
narrower: Gay nurses
narrower: Lesbian nurses
narrower: Bisexual nurses
narrower: Asexual nurses
narrower: Intersex nurses
narrower: Non-binary nurses
narrower: Transgender nurses
narrower: Queer nurses
related: Two-Spirit nurses

Asian LGBTQ+ people
type: Concept
issued: 2019-05-14
modified: 2025-04-24
replaces: asiansLGBTQ
comment: LGBTQ+ people of Asian heritage or descent, living in Asia or part of the Asian diaspora. Only use for people who self-identify as Asian.
comment: Personas LGBTQ+ nacidas o descendientes de países asiáticos. Utilícese únicamente para personas que se autoidentifican como asiáticas.
alternative label: Asian people (LGBTQ)
alternative label: Asians (LGBTQ)
alternative label: LGBTQ+ Asian people
alternative label: LGBTQ+ Asians
alternative label: Personas asiáticas (LGBTQ)
alternative label: Asiáticos (LGBTQ)
alternative label: Personas asiáticas LGBTQ+
alternative label: Asiáticos LGBTQ+ Asiáticas (LGBTQ)
alternative label: Asiáticas LGBTQ+
broader: LGBTQ+ people of color
change note: Version 4.2.0
has top concept: LGBTQ+ people
in scheme: v3
narrower: Asian American LGBTQ+ people
narrower: Asian bisexual people
narrower: Asian gay men
narrower: Asian lesbians
narrower: Asian queer people
narrower: Asian transgender people
narrower: Asian intersex people
narrower: Asian asexual people
narrower: Asian non-binary people
narrower: Ryukyuan LGBTQ+ people
preferred label: Personas LGBTQ+ asiáticas

Biological parenthood
type: Concept
issued: 2019-05-14
modified: 2025-02-23
replaces: biologicalParenthood
comment: The experience of being a biological parent to a child. This relationship can be genetic, gestational, or both.
comment: Persona que tiene una relación biológica con un hijo o hijos. Esta relación puede ser genética, gestacional o ambas.
alternative label: Maternidad biológica
alternative label: Paternidad biológica
broader: LGBTQ+ biological parents
broader: LGBTQ+ parenthood
change note: Version 4.2.0
has top concept: LGBTQ+ families
in scheme: v3
narrower: Genetic parenthood
narrower: Gestational parenthood
preferred label: Maternidad y paternidad biológica
related: Birth parents
related: Donors
related: Social parenthood
related: Motherhood
related: Fatherhood
related: Donor siblings
related: Half-siblings

Latino/a/x LGBTQ+ people
type: Concept
issued: 2019-05-14
modified: 2025-02-23
replaces: latinxLGBTQ
comment: Latin American people who are LGBTQ+; only use to describe individuals who self-identify as Latino, Latina, or Latinx. Do not conflate with Chicano/a/x or Hispanic.
comment: Personas latinoamericanas que son LGBTQ+; utilícese únicamente para describir a personas que se autoidentifican como latinos, latinas o latinxs. No debe confundirse con chicano/a/x o hispano/a/x.
alternative label: Latinas (LGBTQ)
alternative label: Latinos (LGBTQ)
alternative label: Latine people (LGBTQ)
alternative label: Latinx people (LGBTQ)
alternative label: LGBTQ+ Latinas
alternative label: LGBTQ+ Latine people
alternative label: LGBTQ+ Latinos
alternative label: LGBTQ+ Latinx people
broader: LGBTQ+ people of shared ethnic or national identities
change note: Version 4.2.0
has top concept: LGBTQ+ people
in scheme: v3
narrower: Afro-Latin American LGBTQ+ people
narrower: Latino/a/x bisexual people
narrower: Latino/a/x gay men
narrower: Latino/a/x lesbians
narrower: Latino/a/x queer people
narrower: Latino/a/x transgender people
narrower: Latino/a/x intersex people
narrower: Latino/a/x asexual people
narrower: Latino/a/x non-binary people
preferred label: Personas LGBTQ+ Latinx
related: Banjees

Closeted bisexual people
type: Concept
issued: 2019-05-14
modified: 2025-02-23
replaces: closetedBisexualPeople
comment: Bisexual people who do not identify as such to others.
comment: Personas bisexuales que no se autoidentifican como tales ante los demás.
broader: Bisexual people
broader: Closeted LGBTQ+ people
change note: Version 4.2.0
has top concept: LGBTQ+ people
in scheme: v3
preferred label: Personas bisexuales en el clóset
related: Closeted gay men
related: Closeted lesbians
related: Coming out
related: Down-low
related: Outing (LGBTQ+ culture)
related: Secrecy
related: Closeted transgender people
related: Closeted queer people
related: Closeted asexual people

Closeted gay men
type: Concept
issued: 2019-05-14
modified: 2025-02-23
replaces: closetedGayMen
comment: Gay men who do not identify as such to others.
comment: Hombres gay que no se autoidentifican como tales ante los demás.
broader: Gay men
broader: Closeted LGBTQ+ people
change note: Version 4.2.0
has top concept: LGBTQ+ people
in scheme: v3
preferred label: Hombres gay en el clóset
related: Closeted bisexual people
related: Closeted lesbians
related: Coming out
related: Down-low
related: Outing (LGBTQ+ culture)
related: Secrecy
related: Closeted transgender people
related: Closeted queer people
related: Closeted asexual people

LGBTQ+ couples
type: Concept
issued: 2019-05-14
modified: 2025-02-23
replaces: couplesLGBTQ
comment: Partnerships in which both people are LGBTQ+.
comment: Relaciones en las que ambas personas son LGBTQ+.
alternative label: Couples (LGBTQ)
alternative label: Parejas (LGBTQ)
broader: Relationship satisfaction
change note: Version 4.2.0
has top concept: Relationship satisfaction
in scheme: v3
narrower: Bisexual couples
narrower: Boston marriages
narrower: Gay couples
narrower: Lesbian couples
narrower: Queer couples
narrower: Transgender couples
narrower: Asexual couples
narrower: Intersex couples
preferred label: Parejas LGBTQ+
related: LGBTQ+ partners
related: Two-Spirit couples

Crossdressing
type: Concept
issued: 2019-05-14
modified: 2025-02-23
replaces: crossdressing
comment: The practice of wearing clothing stereotypical to a gender other than the individual's predominantly-identified gender.
comment: La práctica de usar ropa estereotipada de un género distinto al género bajo el cual se identifica una persona predominantemente.
broader: Gender expression
change note: Version 4.2.0
has top concept: Gender
in scheme: v3
preferred label: Transformismo
related: Clothing
related: Crossdressers
related: Eonism
related: Kabuki
related: Lingerie
related: Reading (Gender)
related: Transvestism
related: Masquerading
related: Dollification
related: Drag in film

Intersex
type: Concept
issued: 2019-05-14
modified: 2025-02-23
replaces: intersex
comment: An umbrella term used to refer to people born with variations in their physical sex characteristics--including genitals, gonads, chromosomes, and hormonal factors--that do not fit typical definitions of male or female bodies.
comment: Un término general utilizado para referirse a personas que nacen con variaciones en sus características sexuales físicas (incluidos genitales, gónadas, cromosomas y factores hormonales) que no se ajustan a las definiciones típicas de cuerpos masculinos o femeninos.
alternative label: Differences in sex development
alternative label: Divergences in sex development
alternative label: DSDs
alternative label: Hermaphroditism
alternative label: Intersexuality
alternative label: Variations in sex development
alternative label: VSDs
alternative label: Intersexual
broader: Sex (Body)
change note: Version 4.2.0
has top concept: Sex (Body)
in scheme: v3
narrower: Disorders of sexual development
narrower: Intersex variations
narrower: Early genital surgery model
narrower: Hopkins model
related: Intersex people
related: Intersexphobia
related: Intersex genital mutilation
related: Intersex identity
related: Intersex movement
related: Hermaphrodites

Gay community
type: Concept
issued: 2019-05-14
modified: 2025-02-23
replaces: gayCommunity
comment: Groups of people who share the experience of being gay men.
comment: Grupos de personas que comparten la experiencia de ser hombres gay.
broader: LGBTQ+ communities
change note: Version 4.2.0
has top concept: LGBTQ+ communities
in scheme: v3
preferred label: Comunidad gay
related: Gay bars
related: Gay community centers
related: Gay men
related: LGBT
related: LGB
related: LGBTI
related: LGBTQ
related: LGBTQ+
related: LGBTQIA
related: 2SLGBTQ+

Gender markers
type: Concept
issued: 2019-05-14
modified: 2025-02-23
replaces: genderMarkers
comment: Markers used to designate an individual's gender on official documentation, including passports, birth certificates, driver’s licenses, etc. Different jurisdictions vary significantly in the number and types of gender markers they allow on official documentation.
comment: Marcadores utilizados para designar el género de una persona en la documentación oficial, incluidos pasaportes, certificados de nacimiento, licencias de conducir, etc. Diferentes jurisdicciones varían significativamente en la cantidad y los tipos de marcadores de género que permiten en la documentación oficial.
broader: Birth certificates
broader: Driver's licenses
broader: Passports
change note: Version 4.2.0
has top concept: Legal status
in scheme: v3
narrower: X gender markers
preferred label: Indicadores de género
related: Gender assigned at birth
related: Court orders
related: Medical practitioners' statements
related: Social security cards
related: Transgender people
related: Transitioning (Gender)
related: Gender marker change bans

LGBTQ+ information centers
type: Concept
issued: 2019-05-14
modified: 2025-02-23
replaces: informationCentresLGBTQ
comment: An institution that locates and compiles information for the LGBTQ+ community into a central database that can be accessed by the public.
comment: Una institución que localiza y compila información para la comunidad LGBTQ+ en una base de datos central a la que el público puede acceder.
broader: LGBTQ+ centers
change note: Version 4.2.0
has top concept: LGBTQ+ centers
in scheme: v3
narrower: AIDS information centers
narrower: Bisexual information centers
narrower: Gay information centers
narrower: Lesbian information centers
narrower: Queer information centers
narrower: Transgender information centers
narrower: Intersex information centers
narrower: Asexual information centers
preferred label: Centros de información LGBTQ+
preferred label: LGBTQ+ information centres
related: Information provision
related: Two-Spirit information centers

Inuit LGBTQ+ people
type: Concept
issued: 2019-05-14
modified: 2025-02-23
replaces: LGBTQInuit
comment: LGBTQ+ people who are Inuit, or part of several Indigenous peoples inhabiting the Inuit homeland in the Arctic and subarctic regions of Greenland, Canada, and Alaska. Only use for people who identify as Inuit.
comment: Personas LGBTQ+ que son inuit o que son parte de varios pueblos indígenas que habitan los territorios ancestrales inuit en las regiones árticas o subárticas de Groenlandia, Canadá y Alaska. Utilícese únicamente para personas que se identifiquen como inuit.
alternative label: Inuit (LGBTQ)
alternative label: Inuit people (LGBTQ)
alternative label: LGBTQ+ Inuit
alternative label: LGBTQ+ Inuit people
alternative label: Personas inuit (LGBTQ)
alternative label: Personas inuit LGBTQ+
broader: Indigenous LGBTQ+ people
change note: Version 4.2.0
has top concept: LGBTQ+ people
in scheme: v3
narrower: Inuit lesbians
narrower: Inuit gay men
narrower: Inuit bisexual people
narrower: Inuit transgender people
narrower: Inuit queer people
narrower: Inuit intersex people
narrower: Inuit asexual people
narrower: Inuit non-binary people
preferred label: Personas LGBTQ+ inuit
related: Indigiqueer people
related: Indigiqueer

Jewish LGBTQ+ people
type: Concept
is replaced by: homoit0000682
issued: 2019-05-14
modified: 2025-02-23
modified: 2022-10-04
replaces: jewsLGBTQ
replaces: LGBTQJudaism
comment: LGBTQ+ people who are Jewish.
comment: Personas LGBTQ + que son judías.
comment: Jewish religion and culture as practiced by LGBTQ+ people
alternative label: Jews (LGBTQ)
alternative label: LGBTQ+ Jews
alternative label: Judíos (LGBTQ)
alternative label: Judíos (LGBTQ+)
alternative label: LGBTQ Judaism
broader: LGBTQ+ people of shared ethnic or national identities
broader: LGBTQ+ African religions
change note: Version 4.2.0
has top concept: LGBTQ+ people
has top concept: LGBTQ+ African religions
in scheme: v3
narrower: Jewish bisexual people
narrower: Jewish gay men
narrower: Jewish lesbians
narrower: Jewish queer people
narrower: Jewish transgender people
narrower: Jewish intersex people
narrower: Jewish asexual people
narrower: Jewish non-binary people
narrower: Androgynos
preferred label: Personas LGBTQ+ judías
preferred label: LGBTQ+ Judaism

LGBTQ+
type: Concept
issued: 2019-05-14
modified: 2025-02-23
replaces: LGBTQ+
comment: Acronym used to describe lesbians, gay men, bisexual people, transgender people, queer people, and any other sexual and gender minorities as a group.
comment: Acrónimo utilizado para describir a lesbianas, hombres gay, personas bisexuales, personas transgénero, personas queer y cualquier otra minoría sexual y de género como grupo.
broader: 2SLGBTQ+
change note: Version 4.2.0
has top concept: 2SLGBTQ+
in scheme: v3
narrower: LGB
narrower: LGBTQ
related: Asexuality
related: Bisexual community
related: Gay community
related: Intersex movement
related: Lesbian community
related: Queer community
related: Sexual diversity
related: Transgender community

Papuan LGBTQ+ people
type: Concept
issued: 2019-05-14
modified: 2025-02-23
replaces: LGBTQPapuans
comment: LGBTQ+ people who are Papuan, or part of the Indigenous peoples of new Guinea; only use for people who identify as Papuan.
comment: Personas LGBTQ+ que son papúes o parte de los pueblos indígenas de Nueva Guinea. Utilícese únicamente para personas que se autoidentifiquen como papúes.
alternative label: Papuans (LGBTQ)
alternative label: Papuan people (LGBTQ)
alternative label: LGBTQ+ Papuan people
alternative label: LGBTQ+ Papuans
alternative label: Personas papúes LGBTQ+
broader: Indigenous LGBTQ+ people
change note: Version 4.2.0
has top concept: LGBTQ+ people
in scheme: v3
narrower: Papuan lesbians
narrower: Papuan gay men
narrower: Papuan bisexual people
narrower: Papuan transgender people
narrower: Papuan queer people
narrower: Papuan intersex people
narrower: Papuan asexual people
narrower: Papuan non-binary people
preferred label: Personas LGBTQ+ papúes
related: Indigiqueer people
related: Indigiqueer

Mothers
type: Concept
issued: 2019-05-14
modified: 2025-02-23
replaces: mothers
comment: People who are mothers.
comment: Personas que son madres.
alternative label: Mamás
broader: Family members
change note: Version 4.2.0
has top concept: Family members
in scheme: v3
narrower: LGBTQ+ co-mothers
narrower: LGBTQ+ single mothers
narrower: LGBTQ+ mothers
narrower: Mothers of LGBTQ+ people
narrower: Asexual mothers
narrower: Intersex mothers
narrower: Two-Spirit mothers
preferred label: Madres
related: Lesbian parents
related: LGBTQ+ motherhood
related: Motherhood

Pups (Roleplay)
type: Concept
issued: 2019-05-14
modified: 2025-02-23
replaces: pups
comment: Individuals who take on the pup or puppy role in puppy play, a form of animal roleplay that is often but not always associated with BDSM and kink communities.
comment: Personas que asumen el rol de cachorro o perrito en el juego de cachorros, una forma de juego de roles de animales que a menudo, aunque no siempre, se asocia con el BDSM y las comunidades kink.
alternative label: Puppers
alternative label: Puppies
alternative label: Cachorros
alternative label: Perritos
broader: Gay culture
broader: Gay men
broader: Leather community
broader: Roleplay
broader: Sexual identity
change note: Version 4.2.0
has top concept: Subcultures
in scheme: v3
preferred label: Cachorros (juego de roles)
related: Bears (Gay culture)
related: Gender expression
related: Otters (Gay culture)
related: Pup play
related: Leather people

Queer studies
type: Concept
issued: 2019-05-14
modified: 2026-02-24
replaces: queerStudies
comment: Academic field of research and study about queer people, queer identity, and queer communities.
comment: Campo académico de investigación y estudio sobre personas queer, la identidad queer y comunidades queer.
broader: LGBTQ+ studies
change note: Version 4.2.0
has top concept: LGBTQ+ studies
in scheme: v3
preferred label: Estudios queer
related: Bisexual studies
related: Gay studies
related: Gender studies
related: Lesbian studies
related: Queer theory
related: Transgender studies
related: Feminist theory
related: Two-Spirit studies
related: Asexual studies
related: Intersex studies

Significant others
type: Concept
issued: 2019-05-14
modified: 2025-02-23
replaces: significantOthers
comment: An individual's partner or partners in an established, ongoing romantic or sexual relationship.
comment: La pareja o las parejas de una persona en una relación romántica o sexual establecida y en curso.
change note: Version 4.2.0
in scheme: v3
preferred label: Parejas
related: Domestic partnerships
related: Intimate partner violence
related: LGBTQ+ domestic violence
related: LGBTQ+ lovers
related: Partner notification
related: Partner preference
related: Partner rights
related: Relationship satisfaction
related: Sexual preference
related: Partners

Social media
type: Concept
is replaced by: LGBTQ+ social media
issued: 2019-05-14
modified: 2025-07-16
replaces: socialMedia
comment: Web-based and mobile technologies used to turn communication into interactive dialogues.
comment: Tecnologías móviles y basadas en la web utilizadas para convertir la comunicación en diálogos interactivos.
alternative label: RR.SS.
change note: Version 4.2.0
in scheme: v3
preferred label: Redes sociales
related: LGBTQ+ victims of cyberbullying
related: LGBTQ+ social media

Transgender community
type: Concept
issued: 2019-05-14
modified: 2025-02-23
replaces: transgenderCommunity
comment: Groups of people who share the experience of being transgender.
comment: Grupos de personas que comparten la experiencia de ser transgénero.
broader: LGBTQ+ communities
change note: Version 4.2.0
has top concept: LGBTQ+ communities
in scheme: v3
preferred label: Comunidad transgénero
related: LGBT
related: LGB
related: LGBTI
related: LGBTQ
related: LGBTQ+
related: LGBTQIA
related: Transgender people
related: t4t
related: 2SLGBTQ+
related: Trans joy

Transgenderism
type: Concept
issued: 2019-05-14
modified: 2025-02-23
replaces: transgenderism
comment: Pathologizing term often used in the medicalization of transgender people; use only in historical contexts.
comment: Término patologizante a menudo utilizado en la medicalización de personas transgénero; utilícese sólo en contextos históricos.
broader: Medicalization
change note: Version 4.2.0
has top concept: Medical care
in scheme: v3
narrower: Transsexualism
preferred label: Transgenerismo
related: Eonism
related: Gender
related: Gender identity
related: LGBTI
related: Transgender people
related: Transgender information centers
related: Transgender movement
related: Transgender studies
related: Trans

LGBTQ+ victims' rights
type: Concept
issued: 2019-05-14
modified: 2025-02-23
replaces: victimsRightsLGBTQ
comment: LGBTQ+ people’s legal rights to be informed, present, and heard within the criminal justice system after having been harmed or injured as the result of a crime, accident, or other event.
comment: Los derechos legales de las personas LGBTQ+ a estar informadas, estar presentes y ser escuchadas dentro del sistema de justicia penal después de haber sido perjudicadas o lesionadas como resultado de un delito, accidente u otro evento.
alternative label: Victims' rights (LGBTQ)
broader: Law
change note: Version 4.2.0
has top concept: Law
in scheme: v3
narrower: Bisexual victims' rights
narrower: Gay victims' rights
narrower: Lesbian victims' rights
narrower: Queer victims' rights
narrower: Transgender victims' rights
narrower: Asexual victims' rights
narrower: Intersex victims' rights
preferred label: Derechos de víctimas LGBTQ+
related: LGBTQ+ civil rights
related: LGBTQ+ victims of crime
related: Two-Spirit victims' rights

Recovery groups
type: Concept
is replaced by: homoit0001551
issued: 2020-06-02
issued: 2020-06-03
modified: 2022-08-15
modified: 2022-08-22
modified: 2025-02-23
replaces: recoveryGroups
replaces: adultChildrenOfAlcoholics
replaces: al-Anon
replaces: alcoholicsAnonymous
replaces: cocaineAnonymous
replaces: crystalMethAnonymous
replaces: LGBTQRecoveryGroups
replaces: narcoticsAnonymous
comment: A twelve step program based in the U.S. that treats alcoholism as a disease and aims to address its impact on the adult lives of children of alcoholics; may be used in reference to LGBTQ+ members of ACA or LGBTQ+-focused chapters of ACA
comment: An international organization aimed toward supporting alcoholics in sobriety through a twelve-step program; may be used in reference to LGBTQ+ individuals in AA or LGBTQ+ chapters of AA
comment: Recovery groups, or voluntary associations of people in recovery from use disorders, conditions, or addictions, that are accepting and supportive of LGBTQ+ people and their identities.
comment: Grupos de recuperación, o asociaciones voluntarias de personas en recuperación de trastornos por consumo, condiciones o adicciones, que aceptan y apoyan a las personas LGBTQ+ y sus identidades.
alternative label: 12-step groups
alternative label: ACA
alternative label: ACOA
alternative label: AA
alternative label: CA
alternative label: CMA
alternative label: 12 step programs (LGBTQ)
alternative label: Recovery groups (LGBTQ)
alternative label: Step work (LGBTQ)
alternative label: LGBTQ+-affirming 12 step programs
alternative label: LGBTQ+-affirming step work
alternative label: NA
broader: Mental health care for LGBTQ+ people
change note: Version 4.2.0
has top concept: Health care for LGBTQ+ people
in scheme: v3
preferred label: Adult Children of Alcoholics
preferred label: Al-Anon
preferred label: Alcoholics Anonymous
preferred label: Cocaine Anonymous
preferred label: Crystal Meth Anonymous
preferred label: LGBTQ+-affirming recovery groups
preferred label: Grupos de recuperación que afirman las identidades LGBTQ+
preferred label: Narcotics Anonymous
related: Sobriety
related: Alcoholics
related: LGBTQ+ children
related: LGBTQ+ people in Adult Children of Alcoholics
related: Substance abuse
related: LGBTQ+ support groups

Hierarchical non-monogamy
type: Concept
issued: 2020-12-11
modified: 2025-02-23
replaces: hierarchicalNonmonogamy
comment: A form of consensual non-monogamy in which a person has multiple partners who are not "equal" to one another in terms of time, emotional intensity, financial, or scheduling matters.
comment: Una forma de no monogamia consensuada en la que una persona tiene múltiples parejas que no son "iguales" entre sí en términos de tiempo, intensidad emocional, cuestiones financieras o de calendarización.
alternative label: Hierarchical polyamory
alternative label: Hierarchical nonmonogamy
alternative label: Poliamor jerárquico
broader: Polyamory
broader: Non-monogamy
change note: Version 4.2.0
has top concept: Relationship orientation
in scheme: v3
narrower: Swinging
narrower: Monogamish
preferred label: No monogamia jerárquica
related: DADT relationships
related: Primary partners
related: Secondary partners
related: Anchor partners
related: Nesting partners
related: Polyfidelity
related: Polygamous people

Bisexual authors
type: Concept
issued: 2021-11-02
modified: 2025-03-13
comment: Bisexual creators of written works.
comment: Creadores de obras escritas conocidos por ser bisexuales.
broader: LGBTQ+ authors
change note: Version 4.2.0
has top concept: LGBTQ+ people
in scheme: v3
preferred label: Autores bisexuales
related: Bisexual drama
related: Bisexual fiction
related: Bisexual literature
related: Bisexual poetry
related: Bisexual literary criticism
related: Bisexual autobiographies
related: Bisexual people in fandom
related: Bisexual biographies
related: Bisexual people's writings

Two-Spirit fiction
type: Concept
issued: 2021-11-09
modified: 2026-02-23
comment: Written works describing imagined events or people; use in reference to fictional works focusing on Two-Spirit characters or themes.
comment: Obras de ficción escritas donde figuran personajes dos espíritus o se abordan temas dos espíritus.
alternative label: 2S fiction
alternative label: Two Spirit fiction
alternative label: Two Spirited fiction
alternative label: Two-Spirited fiction
broader: Two-Spirit literature
change note: Version 4.2.0
has top concept: Two-Spirit literature
in scheme: v3
narrower: Two-Spirit fantasy fiction
narrower: Two-Spirit horror fiction
narrower: Two-Spirit mystery and detective fiction
narrower: Two-Spirit romance fiction
narrower: Two-Spirit urban fantasy fiction
narrower: Two-Spirit science fiction
narrower: Two-Spirit historical fiction
preferred label: Ficción dos espíritus
related: LGBTQ+ fiction
related: Two-Spirit people in fandom

Closeted transgender people
type: Concept
issued: 2021-12-08
modified: 2025-02-23
comment: Transgender people who do not identify as such to others.
comment: Personas transgénero que no se autoidentifican como tales ante los demás.
alternative label: Closeted trans people
alternative label: Personas trans en el clóset
broader: Transgender people
broader: Closeted LGBTQ+ people
change note: Version 4.2.0
has top concept: LGBTQ+ people
in scheme: v3
preferred label: Personas transgénero en el clóset
related: Closeted bisexual people
related: Closeted gay men
related: Closeted lesbians
related: Stealth (Transgender)
related: Coming out
related: Outing (LGBTQ+ culture)
related: Secrecy
related: Closeted queer people
related: Closeted asexual people

Pacific Islander American LGBTQ+ people
type: Concept
issued: 2022-01-24
modified: 2025-02-23
comment: LGBTQ+ people who identify as both Pacific Islanders (or of Pacific Islander ancestry) and American.
comment: Personas LGBTQ+ que se identifican a la vez como isleñas del Pacífico (o de ascendencia isleña del Pacífico) y estadounidenses.
alternative label: AAPI LGBTQ+ people
alternative label: LGBTQ+ AAPIs
alternative label: LGBTQ+ Pacific Islander American people
alternative label: LGBTQ+ Pacific Islander Americans
alternative label: Pacific Islander American people (LGBTQ)
alternative label: Pacific Islander Americans (LGBTQ)
alternative label: Personas del Pacífico estadounidenses LGBTQ+
broader: LGBTQ+ people of shared ethnic or national identities
broader: LGBTQ+ people of color
broader: Indigenous LGBTQ+ people
change note: Version 4.2.0
has top concept: LGBTQ+ people
in scheme: v3
narrower: Pacific Islander American lesbians
narrower: Pacific Islander American gay men
narrower: Pacific Islander American bisexual people
narrower: Pacific Islander American transgender people
narrower: Pacific Islander American queer people
narrower: Pacific Islander American intersex people
narrower: Pacific Islander American asexual people
narrower: Pacific Islander American non-binary people
preferred label: Personas LGBTQ+ del Pacífico estadounidenses

Alloromantic people
type: Concept
issued: 2022-02-14
modified: 2025-02-23
comment: Individuals who experience romantic attraction or desire in a frequent and consistent manner, often alongside sexual attraction.
comment: Personas que experimentan atracción o deseo romántico de manera frecuente y constante, a menudo junto con la atracción sexual.
change note: Version 4.2.0
in scheme: v3
narrower: Biromantic people
narrower: Homoromantic people
narrower: Heteroromantic people
narrower: Panromantic people
preferred label: Personas alorrománticas
related: Aromantic people
related: Alloromanticism

LGBTQ+ survivors of bullying
type: Concept
issued: 2022-05-11
modified: 2025-02-23
comment: LGBTQ+ people who have experienced and survived bullying due to their gender or sexual identity; follow the individual's preference for "victims" or "survivors" whenever possible.
comment: Personas LGBTQ+ que han sufrido y sobrevivido al acoso debido a su género o identidad sexual; siga la preferencia de la persona sobre el uso de "víctimas" o "sobrevivientes" siempre que sea posible.
broader: LGBTQ+ victims of bullying
change note: Version 4.2.0
has top concept: LGBTQ+ people
in scheme: v3
narrower: Lesbian survivors of bullying
narrower: Gay survivors of bullying
narrower: Bisexual survivors of bullying
narrower: Transgender survivors of bullying
narrower: Queer survivors of bullying
narrower: Asexual survivors of bullying
narrower: Intersex survivors of bullying
narrower: LGBTQ+ youth survivors of bullying
preferred label: Sobrevivientes LGBTQ+ de acoso
related: Bullying
related: Two-Spirit survivors of bullying

LGBTQ+ people in the workplace
type: Concept
issued: 2022-06-15
modified: 2025-02-23
comment: The presence of LGBTQ+ people in the workplace, including acceptance of and issues faced by LGBTQ+ workers.
comment: La presencia de personas LGBTQ+ en el lugar de trabajo, incluida la aceptación de los trabajadores LGBTQ+ y los problemas a los que se enfrentan.
alternative label: People in the workplace (LGBTQ)
broader: LGBTQ+ employment
change note: Version 4.2.0
has top concept: LGBTQ+ employment
in scheme: v3
narrower: Lesbians in the workplace
narrower: Gay men in the workplace
narrower: Bisexual people in the workplace
narrower: Transgender people in the workplace
narrower: Queer people in the workplace
narrower: Intersex people in the workplace
narrower: Asexual people in the workplace
preferred label: Personas LGBTQ+ en el lugar de trabajo
related: LGBTQ+-owned businesses
related: LGBTQ+-focused businesses
related: Two-Spirit people in the workplace

South Asian LGBTQ+ people
type: Concept
issued: 2022-06-15
modified: 2025-02-23
comment: LGBTQ+ people who belong to or are descended from the ethnolinguistic groups of South Asia.
comment: Personas LGBTQ+ que pertenecen a o descienden de los grupos etnolingüísticos del sur de Asia.
alternative label: LGBTQ+ South Asian people
alternative label: LGBTQ+ South Asians
alternative label: South Asian people (LGBTQ)
alternative label: South Asians (LGBTQ)
alternative label: Personas sudasiáticas LGBTQ+
broader: LGBTQ+ people of shared ethnic or national identities
broader: LGBTQ+ people of color
change note: Version 4.2.0
has top concept: LGBTQ+ people
in scheme: v3
narrower: South Asian lesbians
narrower: South Asian gay men
narrower: South Asian bisexual people
narrower: South Asian queer people
narrower: South Asian intersex people
narrower: South Asian transgender people
narrower: South Asian asexual people
narrower: Indian LGBTQ+ people
narrower: South Asian non-binary people
preferred label: Personas LGBTQ+ sudasiáticas

Gender in fandom
type: Concept
issued: 2022-07-04
modified: 2025-02-23
comment: Issues and discussions about gender in fan spaces and works.
comment: Cuestiones y discusiones sobre el género en espacios y obras de fans.
broader: Fandom
change note: Version 4.2.0
has top concept: Subcultures
in scheme: v3
narrower: Homophobia in fandom
narrower: Intersex people in fandom
narrower: Men in fandom
narrower: Misogyny in fandom
narrower: Non-binary people in fandom
narrower: Transgender people in fandom
narrower: Transphobia in fandom
narrower: Two-Spirit people in fandom
narrower: Women in fandom
preferred label: Género en el fandom
related: Gender swapping

Internalized oppression
type: Concept
issued: 2023-04-14
modified: 2025-02-23
comment: The phenomenon in which someone in a marginalized group internalizes or adopts oppressive beliefs (i.e., negative perceptions of and intolerance toward any marginalized identities they hold) as a result of being raised or socialized within an oppressive environment or culture.
comment: El fenómeno a través del cual una persona de un grupo marginado internaliza o adopta creencias opresivas (es decir, percepciones negativas e intolerancia hacia cualquier identidad marginada que habite) como resultado de haber sido criada o socializada dentro de un entorno o una cultura opresiva.
change note: Version 4.2.0
in scheme: v3
narrower: Internalized homophobia
narrower: Internalized lesbophobia
narrower: Internalized biphobia
narrower: Internalized transphobia
narrower: Internalized queerphobia
narrower: Internalized intersexphobia
preferred label: Opresión internalizada
related: Denial of sexual orientation
related: LGBTQ+ phobia
related: LGBTQ+ self-repression
related: Lateral oppression

LGBTQ+ autistic people
type: Concept
issued: 2023-06-26
modified: 2025-02-23
comment: LGBTQ+ people who are autistic.
comment: Personas LGBTQ+ que son autistas.
alternative label: LGBTQ+ people with autism
alternative label: Personas LGBTQ+ con autismo
alternative label: Personas autistas LGBTQ+
broader: LGBTQ+ neurodivergent people
change note: Version 4.2.0
has top concept: LGBTQ+ people
in scheme: v3
narrower: Lesbian autistic people
narrower: Gay autistic men
narrower: Bisexual autistic people
narrower: Transgender autistic people
narrower: Queer autistic people
narrower: Non-binary autistic people
narrower: Intersex autistic people
narrower: Asexual autistic people
preferred label: Personas LGBTQ+ autistas
related: Two-Spirit autistic people
related: Autigender

Closeted asexual people
type: Concept
issued: 2023-06-29
modified: 2025-02-23
comment: Asexual people who do not identify as such to others.
comment: Personas asexuales que no se autoidentifican como tales ante los demás.
broader: Asexual people
broader: Closeted LGBTQ+ people
change note: Version 4.2.0
has top concept: Sexual minorities
in scheme: v3
preferred label: Personas asexuales en el clóset
related: Closeted bisexual people
related: Closeted gay men
related: Closeted lesbians
related: Coming out
related: Outing (LGBTQ+ culture)
related: Secrecy
related: Closeted transgender people
related: Closeted queer people
related: Closeted intersex people

Rural LGBTQ+ people
type: Concept
issued: 2024-07-11
modified: 2025-02-23
comment: LGBTQ+ people who are currently living in or consider themselves to be from agricultural or forested areas with low population densities.
alternative label: Rural LGBTQ people
alternative label: Rural people (LGBTQ+)
broader: LGBTQ+ people
change note: Version 4.2.0
has top concept: LGBTQ+ people
in scheme: v3
narrower: Rural lesbians
narrower: Rural gay men
narrower: Rural bisexual people
narrower: Rural transgender people
narrower: Rural queer people
narrower: Rural asexual people
narrower: Rural aromantic people
narrower: Rural intersex people
narrower: Rural non-binary people
related: Rural Two-Spirit people

LGBTQ+ children's literature
type: Concept
issued: 2024-07-31
modified: 2025-02-23
comment: Written literary works for an audience of readers up to 12 years of age, also known as kid lit or juvenile literature. Use in reference to children's literature focusing on LGBTQ+ characters or themes.
alternative label: Children's literature (LGBTQ+)
alternative label: LGBTQ+ juvenile literature
alternative label: LGBTQ+ kid lit
broader: LGBTQ+ literature
change note: Version 4.2.0
has top concept: Subcultures
in scheme: v3
narrower: Gay children's literature
narrower: Lesbian children's literature
narrower: Bisexual children's literature
narrower: Transgender children's literature
narrower: Queer children's literature
narrower: Non-binary children's literature
narrower: Asexual children's literature
narrower: Aromantic children's literature
narrower: Intersex children's literature
related: Two-Spirit children's literature

LGBTQ+ pornography
type: Concept
issued: 2024-10-30
modified: 2025-02-23
comment: Printed or visual materials that explicitly depict sexual acts. Use in reference to pornography featuring LGBTQ+ performers and/or made for LGBTQ+ people.
alternative label: Pornography (LGBTQ)
alternative label: Porn (LGBTQ)
broader: Pornography
change note: Version 4.2.0
has top concept: Sex industry
in scheme: v3
narrower: LGBTQ+ porn films
narrower: LGBTQ+ porn magazines
narrower: Lesbian pornography
narrower: Gay pornography
narrower: Bisexual pornography
narrower: Transgender pornography
narrower: Queer pornography
narrower: Intersex pornography
narrower: Non-binary pornography
related: Two-Spirit pornography

LGBTQ+ journalists
type: Concept
issued: 2025-02-27
modified: 2025-04-29
comment: LGBTQ+ people who gather information in the form of text, audio, or pictures, process it into a newsworthy form, and disseminate it to the public.
alternative label: Journalists (LGBTQ)
broader: LGBTQ+ people
change note: Version 4.2.0
has top concept: LGBTQ+ people
in scheme: v4
narrower: Gay journalists
narrower: Lesbian journalists
narrower: Bisexual journalists
narrower: Intersex journalists
narrower: Queer journalists
narrower: Transgender journalists
narrower: Non-binary journalists
narrower: Asexual journalists
related: LGBTQ+ journalism
related: Two-Spirit journalists

LGBTQ+ survival guides
type: Concept
issued: 2025-03-20
modified: 2025-03-20
comment: Written publications designed to support LGBTQ+ people by sharing common advice and community knowledge.
alternative label: Survival guides (LGBTQ)
broader: LGBTQ+ literature
change note: Version 4.2.0
has top concept: Subcultures
in scheme: v4
narrower: Lesbian survival guides
narrower: Gay survival guides
narrower: Bisexual survival guides
narrower: Transgender survival guides
narrower: Queer survival guides
narrower: Non-binary survival guides
narrower: Intersex survival guides
related: LGBTQ+ travel guides
related: LGBTQ+ communities
related: Two-Spirit survival guides

LGBTQ+ makeup artists
type: Concept
issued: 2025-04-23
modified: 2025-04-23
comment: LGBTQ+ people who apply makeup and/or prosthetics on themselves or others, either professionally or as a hobby.
alternative label: Makeup artists (LGBTQ)
alternative label: LGBTQ+ MUAs
alternative label: MUAs (LGBTQ)
broader: LGBTQ+ artists
change note: Version 4.2.0
has top concept: LGBTQ+ people
in scheme: v4
narrower: Lesbian makeup artists
narrower: Gay makeup artists
narrower: Bisexual makeup artists
narrower: Transgender makeup artists
narrower: Queer makeup artists
narrower: Non-binary makeup artists
narrower: Intersex makeup artists
related: LGBTQ+ fashion
related: Two-Spirit makeup artists
related: Makeup and LGBTQ+ communities

LGBTQ+ historical fiction
type: Concept
issued: 2026-02-23
modified: 2026-02-23
comment: Written works of fiction in which the plot takes place in the setting of particular real historical events; use in reference to historical fiction focusing on LGBTQ+ characters or themes.
alternative label: Historical fiction (LGBTQ)
alternative label: LGBTQ historial fiction
broader: LGBTQ+ fiction
change note: Version 4.2.0
has top concept: Subcultures
in scheme: v4
narrower: Asexual historical fiction
narrower: Bisexual historical fiction
narrower: Gay historical fiction
narrower: Intersex historical fiction
narrower: Lesbian historical fiction
narrower: Non-binary historical fiction
narrower: Queer historical fiction
narrower: Transgender historical fiction
related: Māhū historical fiction
related: Two-Spirit historical fiction

Canadian LGBTQ+ people
type: Concept
issued: 2026-02-23
modified: 2026-02-26
comment: LGBTQ+ people who were born, raised, or currently reside in Canada, or who hold Canadian citizenship. Only use to describe people who self-identify as Canadian and LGBTQ+.
alternative label: LGBTQ+ Canadian people
alternative label: LGBTQ+ Canadians
alternative label: Canadian people (LGBTQ+)
alternative label: Canadians (LGBTQ+)
broader: LGBTQ+ people of shared ethnic or national identities
change note: Version 4.2.0
has top concept: LGBTQ+ people
in scheme: v4
narrower: Canadian lesbians
narrower: Canadian gay men
narrower: Canadian bisexual people
narrower: Canadian transgender people
narrower: Canadian queer people
narrower: Canadian non-binary people
narrower: Canadian intersex people
narrower: Canadian asexual people
narrower: Canadian aromantic people
related: Canadian Two-Spirit people

LGBTQ+ law students
type: Concept
issued: 2026-02-24
modified: 2026-02-27
comment: LGBTQ+ people who are studying law at an institution of higher education in preparation to become lawyers.
broader: LGBTQ+ people
change note: Version 4.2.0
has top concept: LGBTQ+ people
in scheme: v4
narrower: Queer law students
narrower: Gay law students
narrower: Lesbian law students
narrower: Bisexual law students
narrower: Asexual law students
narrower: Intersex law students
narrower: Non-binary law students
narrower: Transgender law students
related: Two-Spirit law students
related: LGBTQ+ lawyers

LGBTQ+ cattle herders
type: Concept
issued: 2026-02-24
modified: 2026-02-24
comment: LGBTQ+ people who tend cattle.
alternative label: Cattle herders (LGBTQ+)
broader: LGBTQ+ people
change note: Version 4.2.0
has top concept: LGBTQ+ people
in scheme: v4
narrower: Lesbian cattle herders
narrower: Gay cattle herders
narrower: Bisexual cattle herders
narrower: Transgender cattle herders
narrower: Queer cattle herders
narrower: Non-binary cattle herders
narrower: Intersex cattle herders
narrower: Asexual cattle herders
related: Two-Spirit cattle herders
related: Cowboys (LGBTQ+ culture)

LGBTQ+ police officers
type: Concept
issued: 2026-02-24
modified: 2026-02-24
comment: LGBTQ+ people who are members of a police force.
alternative label: LGBTQ+ cops
broader: LGBTQ+ people
change note: Version 4.2.0
has top concept: LGBTQ+ people
in scheme: v4
narrower: Gay police officers
narrower: Lesbian police officers
narrower: Bisexual police officers
narrower: Asexual police officers
narrower: Intersex police officers
narrower: Non-binary police officers
narrower: Transgender police officers
narrower: Queer police officers
related: Police
related: Two-Spirit police officers

LGBTQ+ medical doctors
type: Concept
issued: 2026-02-24
modified: 2026-02-25
comment: LGBTQ+ people who are licensed, qualified practitioners of medicine.
alternative label: LGBTQ physicians
alternative label: Doctors (LGBTQ+)
alternative label: LGBTQ+ doctors
alternative label: Physicians (LGBTQ+)
broader: LGBTQ+ medical professionals
change note: Version 4.2.0
has top concept: LGBTQ+ people
in scheme: v4
narrower: Gay medical doctors
narrower: Lesbian medical doctors
narrower: Bisexual medical doctors
narrower: Asexual medical doctors
narrower: Intersex medical doctors
narrower: Non-binary medical doctors
narrower: Transgender medical doctors
narrower: Queer medical doctors
preferred label: LGBTQ+ medical practitioners
related: Medical care
related: Two-Spirit medical doctors

LGBTQ+ architects
type: Concept
issued: 2026-03-03
modified: 2026-03-03
comment: LGBTQ+ people who professionally design buildings and are qualified to plan and supervise their construction.
broader: LGBTQ+ people
change note: Version 4.2.0
has top concept: LGBTQ+ people
in scheme: v4
narrower: Gay architects
narrower: Lesbian architects
narrower: Bisexual architects
narrower: Intersex architects
narrower: Asexual architects
narrower: Non-binary architects
narrower: Transgender architects
narrower: Queer architects
related: Queer architecture
related: Two-Spirit architects

Aboriginal Australian LGBTQ+ people
type: Concept
issued: 2019-05-14
modified: 2025-02-23
replaces: LGBTQAboriginalPeople
comment: LGBTQ+ people who belong to one or more of the various Indigenous peoples of Australia; do not use to refer to the Indigenous people of the Torres Strait Islands, who are considered ethnically and culturally distinct. Only use to describe people who identify as Aboriginal Australian.
comment: Personas LGBTQ+ que pertenecen a uno o más de los diversos pueblos indígenas de Australia; no para referirse a los pueblos indígenas de las Islas del Estrecho de Torres, que se consideran étnica y culturalmente distintos. Utilícese únicamente para describir a las personas que se autoidentifiquen como aborígenes australianos.
alternative label: Aboriginal people (LGBTQ)
alternative label: Aboriginal Australian people (LGBTQ)
alternative label: LGBTQ+ Aboriginal Australian people
alternative label: LGBTQ+ Aboriginal Australians
alternative label: LGBTQ+ Aboriginal people
alternative label: LGBTQ+ Aboriginals
alternative label: Personas aborígenes australianas (LGBTQ)
alternative label: Personas aborígenes (LGBTQ)
alternative label: Aborígenes australianos LGBTQ+
alternative label: Aborígenes LGBTQ+
alternative label: Personas aborígenes australianas LGBTQ+
broader: Indigenous LGBTQ+ people
change note: Version 4.2.0
has top concept: LGBTQ+ people
in scheme: v3
narrower: Aboriginal Australian lesbians
narrower: Aboriginal Australian gay men
narrower: Aboriginal Australian bisexual people
narrower: Aboriginal Australian transgender people
narrower: Aboriginal Australian queer people
narrower: Aboriginal Australian intersex people
narrower: Aboriginal Australian asexual people
narrower: Aboriginal Australian non-binary people
preferred label: Personas LGBTQ+ aborígenes australianas
related: Sistergirls
related: Indigiqueer people
related: Indigiqueer

African American LGBTQ+ people
type: Concept
issued: 2019-05-14
modified: 2025-04-24
replaces: africanAmericansLGBTQ
comment: African American people who are also LGBTQ+; do not use for people of color broadly; follow the individual's preference for African American or Black whenever possible.
comment: Personas LGBTQ+ de ascendencia africana nacidas en los Estados Unidos o personas LGBTQ+ nacidas en países africanos que viven o tienen una conexión fuerte con los Estados Unidos. Utilícese para personas que se autoidentifiquen como afroamericanas.
alternative label: African Americans (LGBTQ)
alternative label: LGBTQ+ African American people
alternative label: LGBTQ+ African Americans
alternative label: Afroamericanos (LGBTQ)
alternative label: Afroamericanas (LGBTQ)
alternative label: Personas afroamericanas LGBTQ+
alternative label: Afroamericanos LGBTQ+
alternative label: Afroamericanas LGBTQ+
broader: Black LGBTQ+ people
change note: Version 4.2.0
has top concept: LGBTQ+ people
in scheme: v3
narrower: African American bisexual people
narrower: Down-low
narrower: African American gay men
narrower: African American lesbians
narrower: African American queer people
narrower: African American transgender people
narrower: African American asexual people
narrower: African American intersex people
narrower: African American non-binary people
preferred label: Personas LGBTQ+ afroamericanas
related: Banjees
related: Same-gender-loving

LGBTQ+ archives
type: Concept
issued: 2019-05-14
modified: 2026-02-23
replaces: archivesLGBTQ
comment: Collections of records and materials relating to LGBTQ+ people or LGBTQ+ communities; can include a variety of organizations and institutions from community to government archives.
comment: Colecciones de registros y materiales relacionados con personas LGBTQ+ o comunidades LGBTQ+; puede incluir una variedad de organizaciones e instituciones, desde archivos comunitarios hasta gubernamentales.
alternative label: LGBTQ archives
alternative label: Archives (LGBTQ)
alternative label: Archivos LGBTQ
alternative label: Archivos (LGBTQ)
broader: LGBTQ+ cultural heritage institutions
change note: Version 4.2.0
has top concept: LGBTQ+ cultural heritage institutions
in scheme: v3
narrower: Bisexual archives
narrower: Gay archives
narrower: Lesbian archives
narrower: Queer archives
narrower: Transgender archives
narrower: Asexual archives
narrower: Intersex archives
narrower: Black queer archives
preferred label: Archivos LGBTQ+
related: LGBTQ+ libraries
related: Two-Spirit archives
related: Metadata for LGBTQ+ resources

LGBTQ+ civil rights
type: Concept
issued: 2019-05-14
modified: 2025-02-23
replaces: civilRightsLGBTQ
comment: Legal rights of LGBTQ+ people to political and social freedom and equality.
comment: Derechos legales de las personas LGBTQ+ a la libertad y la igualdad política y social.
alternative label: LGBTQ rights
alternative label: Civil rights (LGBTQ)
alternative label: Derechos civiles (LGBTQ)
alternative label: Derechos LGBTQ
broader: Human rights
change note: Version 4.2.0
has top concept: Human rights
in scheme: v3
narrower: Bisexual rights
narrower: Gay rights
narrower: Lesbian rights
narrower: Queer rights
narrower: Transgender rights
narrower: Asexual rights
preferred label: Derechos civiles LGBTQ+
related: Decriminalization
related: Intersex rights
related: LGBTQ+ movement
related: LGBTQ+ victims' rights
related: Two-Spirit rights

Clothing
type: Concept
issued: 2019-05-14
modified: 2025-02-23
replaces: clothing
comment: Items worn on the body for protection, insulation, and self-expression; typically made of fabric or textiles.
comment: Artículos utilizados en el cuerpo para protección, aislamiento y autoexpresión; típicamente hechos de tela o textiles.
broader: Gender expression
change note: Version 4.2.0
has top concept: Gender
in scheme: v3
narrower: Lingerie
narrower: Costumes
narrower: Binders (Chest)
preferred label: Ropa
related: Crossdressers
related: Crossdressing
related: Drab (LGBTQ+ culture)
related: Drag
related: Masquerading
related: Fursuits
related: Uniform fetish
related: LGBTQ+ fashion

LGBTQ+ community centers
type: Concept
issued: 2019-05-14
modified: 2025-02-23
replaces: communityCentresLGBTQ
comment: Spaces in which people from LGBTQ+ communities meet for social, education, recreational, or organizing activities.
comment: Espacios en los que personas de comunidades LGBTQ+ se reúnen para realizar actividades sociales, educativas, recreativas u organizativas.
broader: LGBTQ+ centers
broader: LGBTQ+ meeting places
change note: Version 4.2.0
has top concept: LGBTQ+ centers
in scheme: v3
narrower: Bisexual community centers
narrower: Gay community centers
narrower: Lesbian community centers
narrower: Queer community centers
narrower: Transgender community centers
narrower: Women's community centers
narrower: Asexual community centers
narrower: Intersex community centers
preferred label: Centros comunitarios LGBTQ+
preferred label: LGBTQ+ community centres
related: LGBTQ+ communities
related: Two-Spirit community centers

Femmes
type: Concept
issued: 2019-05-14
modified: 2025-02-23
replaces: femmes
comment: Feminine people of any gender, though this term is commonly used in lesbian communities.
comment: Personas femeninas de cualquier género, aunque este término se utiliza comúnmente en las comunidades lésbicas.
broader: Gender roles
broader: Sexual identity
broader: Sexual roles
change note: Version 4.2.0
has top concept: Role behavior
in scheme: v3
related: Butch-femme relationships
related: Butches
related: Dykes
related: Femininities
related: Gender expression
related: Lipstick lesbians
related: Soft butches
related: Stone butches
related: Feminine of center

Friendships
type: Concept
issued: 2019-05-14
modified: 2025-02-23
replaces: friendships
comment: Connections based on affection and trust between two or more people.
comment: Conexiones basadas en el afecto y la confianza entre dos o más personas.
broader: Relationship satisfaction
change note: Version 4.2.0
has top concept: Relationship satisfaction
in scheme: v3
narrower: Boys' friendships
narrower: Women's friendships
narrower: Girls' friendships
narrower: Men's friendships
narrower: Romantic friendships
preferred label: Amistades
related: Dutch boys
related: Fag hags
related: Fag stags
related: Goldilocks (Gay culture)
related: Homosociality
related: Kiki (Social Gathering)

LGBTQ+ victims of hate crimes
type: Concept
issued: 2019-05-14
modified: 2025-02-23
replaces: victimsOfHateCrimesLGBTQ
comment: LGBTQ+ people who have experienced hate crimes and may or may not have survived; follow the individual's preference for "victims" or "survivors" whenever possible.
comment: Personas LGBTQ+ que han sufrido crímenes de odio y pueden o no haber sobrevivido; siga la preferencia de la persona sobre el uso de "víctimas" o "sobrevivientes" siempre que sea posible.
alternative label: Hate crime victims (LGBTQ)
alternative label: Victims of hate crimes (LGBTQ)
broader: LGBTQ+ victims of crime
change note: Version 4.2.0
has top concept: LGBTQ+ people
in scheme: v3
narrower: Bisexual victims of hate crimes
narrower: Gay victims of hate crimes
narrower: Lesbian victims of hate crimes
narrower: Queer victims of hate crimes
narrower: LGBTQ+ survivors of hate crimes
narrower: Transgender victims of hate crimes
narrower: Asexual victims of hate crimes
narrower: Intersex victims of hate crimes
preferred label: Víctimas LGBTQ+ de crímenes de odio
related: Anti-LGBTQ+ violence
related: Hate crimes
related: Two-Spirit victims of hate crimes

Heterosexism
type: Concept
issued: 2019-05-14
modified: 2025-04-23
replaces: heterosexism
comment: Discrimination, prejudice, or bias against non-heterosexual people based on the assumption or belief that heterosexuality is the only normal or natural expression of sexual identity.
comment: Discriminación, prejuicio o bias en contra de personas no heterosexuales basado en la suposición o creencia de que la heterosexualidad es la única expresión normal o natural de la identidad sexual.
alternative label: Heterocentrism
alternative label: Heterocentrismo
change note: Version 4.2.0
in scheme: v3
preferred label: Heterosexismo
related: Biphobia
related: Ex-gay movement
related: Heteronormativity
related: Heterosexuality
related: Homophobia
related: Intersexphobia
related: Lesbophobia
related: Queerphobia
related: Sexism
related: Transphobia
related: Compulsory heterosexuality

LGBTQ+ adoptive parenthood
type: Concept
issued: 2019-05-14
modified: 2025-02-23
replaces: LGBTQAdoptiveParenthood
comment: The experiences involved in adoptive parenting, as experienced by LGBTQ+ people.
comment: Las experiencias involucradas en la crianza adoptiva, tal como las viven las personas LGBTQ+.
alternative label: LGBTQ adoptive parenthood
alternative label: Maternidad y paternidad adoptiva LGBTQ
alternative label: Maternidad adoptiva LGBTQ+
alternative label: Paternidad adoptiva LGBTQ+
broader: LGBTQ+ adoption
broader: LGBTQ+ adoptive families
broader: LGBTQ+ parenthood
change note: Version 4.2.0
has top concept: LGBTQ+ family planning
in scheme: v3
preferred label: Maternidad y paternidad adoptiva LGBTQ+
related: LGBTQ+ families
related: LGBTQ+ family planning
related: LGBTQ+ foster families
related: LGBTQ+ foster parenthood
related: LGBTQ+ personal and family law
related: LGBTQ+ social parenthood
related: Motherhood
related: LGBTQ+ parents
related: Fatherhood

LGBTQ+ demonstrations
type: Concept
issued: 2019-05-14
modified: 2025-04-23
replaces: LGBTQDemonstrations
comment: Marches, rallies, and other large, public gatherings organized to protest discrimination against LGBTQ+ people and advocate for LGBTQ+ visibility, rights, and issues. For street processions of people recognizing and celebrating LGBTQ+ people and culture, use the term "Pride parades."
comment: Acción tomada por grandes grupos de personas en protesta por la discriminación o en apoyo a personas, comunidades, temas o derechos LGBTQ+; típicamente incluye marchas y concentraciones con oradores.
alternative label: Marches (LGBTQ)
alternative label: LGBTQ+ rallies
alternative label: Rallies (LGBTQ)
alternative label: Demonstrations (LGBTQ)
alternative label: LGBTQ+ protests
alternative label: Protests (LGBTQ)
alternative label: Marchas políticas LGBTQ
alternative label: Protestas LGBTQ
alternative label: Concentraciones LGBTQ
alternative label: Demostraciones LGBTQ+
broader: LGBTQ+ action campaigns
change note: Version 4.2.0
has top concept: LGBTQ+ activism
in scheme: v3
narrower: Zaps
narrower: Lesbian demonstrations
narrower: Gay demonstrations
narrower: Bisexual demonstrations
narrower: Transgender demonstrations
narrower: Queer demonstrations
narrower: Intersex demonstrations
preferred label: Manifestaciones LGBTQ+
related: LGBTQ+ riots
related: LGBTQ+ movement
related: Pride parades
related: Two-Spirit demonstrations

LGBTQ+ zines
type: Concept
issued: 2019-05-14
modified: 2025-02-23
replaces: LGBTQZines
comment: Independent, small-circulation publications usually reproduced via photocopier; use for zines created by LGBTQ+ people and/or focusing on LGBTQ+ identities, issues, or cultures.
comment: Publicaciones independientes de pequeña tirada generalmente reproducidas mediante fotocopiadora; utilícese para revistas creadas por personas LGBTQ+ y/o centradas en identidades, asuntos o culturas LGBTQ+.
alternative label: LGBTQ zines
alternative label: Zines LGBTQ
broader: LGBTQ+ press
change note: Version 4.2.0
has top concept: LGBTQ+ press
in scheme: v3
narrower: Intersex zines
narrower: Transgender zines
narrower: Aromantic zines
narrower: Asexual zines
narrower: Non-binary zines
narrower: Queer zines
narrower: Lesbian zines
narrower: Gay zines
preferred label: Zines LGBTQ+
related: LGBTQ+ magazines
related: LGBTQ+ periodicals
related: Two-Spirit zines

LGBTQ+ newsletters
type: Concept
issued: 2019-05-14
modified: 2025-02-23
replaces: newslettersLGBTQ
comment: Print or digital periodicals created by or for LGBTQ+ people, often with the purpose of sharing community news and information about related issues.
comment: Publicaciones periódicas impresas o digitales creadas por o para personas LGBTQ+, a menudo con el propósito de compartir noticias e información de la comunidad sobre temas relacionados.
alternative label: Newsletters (LGBTQ)
alternative label: Boletines (LGBTQ)
broader: LGBTQ+ press
broader: LGBTQ+ periodicals
change note: Version 4.2.0
has top concept: LGBTQ+ press
in scheme: v3
narrower: Bisexual newsletters
narrower: Gay newsletters
narrower: Lesbian newsletters
narrower: Queer newsletters
narrower: Transgender newsletters
narrower: Asexual newsletters
narrower: Intersex newsletters
preferred label: Boletines LGBTQ+
related: LGBTQ+ magazines
related: LGBTQ+ newspapers
related: Two-Spirit newsletters

Police
type: Concept
issued: 2019-05-14
modified: 2026-02-27
replaces: police
comment: A civil force empowered by the state to enforce the law and maintain public order.
comment: Fuerza civil facultada por el Estado para hacer cumplir la ley y mantener el orden público.
alternative label: Cops
change note: Version 4.2.0
in scheme: v3
preferred label: Policía
related: Police entrapment
related: Police raids
related: Defund the police movement
related: Police abolitionist movement
related: White supremacy in policing
related: LGBTQ+ police officers
related: Attitudes of LGBTQ+ people toward police
related: Digital identification of LGBTQ+ people by police
related: No Police at Pride
related: Performative LGBTQ+ activism by police
related: Police interactions with LGBTQ+ people

Public facilities
type: Concept
issued: 2019-05-14
modified: 2025-02-23
replaces: publicFacilities
comment: Buildings, recreational areas, and other types of properties that are owned and maintained by state or local government and are thus available for use by the public.
comment: Edificios, áreas recreativas y otros tipos de propiedades que pertenecen a y son mantenidas por el gobierno estatal o local y, por lo tanto, están disponibles para el uso del público.
change note: Version 4.2.0
in scheme: v3
narrower: Changing rooms
narrower: Locker rooms
narrower: Public bathrooms
narrower: Public showers
preferred label: Instalaciones públicas
related: Anti-discrimination law
related: Anti-transgender discrimination
related: Bathroom bans

LGBTQ+ submissives
type: Concept
issued: 2019-05-14
modified: 2025-02-23
replaces: slaves
comment: The person who takes on the position of submission or service in a power exchange relationship or during kink activities.
comment: La persona que asume la posición de sumisión o servicio en una relación de intercambio de poder o durante actividades kink.
alternative label: LGBTQ+ S-type
alternative label: LGBTQ+ Slaves
alternative label: LGBTQ+ Subs
broader: Sexual identity
broader: Relationship minorities
broader: Kinky people
change note: Version 4.2.0
has top concept: Sexual identity
in scheme: v3
preferred label: Sumisos LGBTQ+
related: Sadomasochism
related: Bottoms (Sex)
related: LGBTQ+ dominatrices
related: Leather community
related: LGBTQ+ dominants
related: LGBTQ+ mistresses (BDSM culture)
related: Tops (Sex)
related: Power exchange

LGBTQ+ survivors of sexual abuse
type: Concept
issued: 2019-05-14
modified: 2025-02-23
replaces: survivorsOfSexualAbuseLGBTQ
comment: LGBTQ+ people who have experienced and survived sexual abuse; follow the individual's preference for "victims" or "survivors" whenever possible.
comment: Personas LGBTQ+ que han sufrido y sobrevivido abusos sexuales; siga la preferencia de la persona sobre el uso de "víctimas" o "sobrevivientes" siempre que sea posible.
alternative label: Survivors of sexual abuse (LGBTQ)
alternative label: Sobrevivientes de abuso sexual (LGBTQ)
broader: LGBTQ+ victims of sexual abuse
change note: Version 4.2.0
has top concept: LGBTQ+ people
in scheme: v3
narrower: Bisexual survivors of sexual abuse
narrower: Gay survivors of sexual abuse
narrower: Lesbian survivors of sexual abuse
narrower: Queer survivors of sexual abuse
narrower: Transgender survivors of sexual abuse
narrower: Asexual survivors of sexual abuse
narrower: Intersex survivors of sexual abuse
preferred label: Sobrevivientes LGBTQ+ de abuso sexual
related: LGBTQ+ domestic violence
related: LGBTQ+ sexual abuse
related: Rape/non-con (Content warning)
related: Two-Spirit survivors of sexual abuse

Closeted queer people
type: Concept
issued: 2021-12-08
modified: 2025-02-23
comment: Queer people who do not identify as such to others.
comment: Personas queer que no se autoidentifican como tales ante los demás.
broader: Queer people
broader: Closeted LGBTQ+ people
change note: Version 4.2.0
has top concept: LGBTQ+ people
in scheme: v3
preferred label: Personas queer en el clóset
related: Closeted bisexual people
related: Closeted gay men
related: Closeted lesbians
related: Stealth (Transgender)
related: Coming out
related: Down-low
related: Outing (LGBTQ+ culture)
related: Secrecy
related: Closeted transgender people
related: Closeted asexual people

LGBTQ+ culture
type: Concept
issued: 2022-02-14
modified: 2025-02-23
comment: Cultural experiences shared by members of LGBTQ+ communities or products of LGBTQ+ culture (e.g., art and media created by and for LGBTQ+ culture, activism focused on LGBTQ+ issues, slang commonly used in LGBTQ+ communities, etc.). Use a more specific term if possible.
comment: Experiencias culturales compartidas por miembros de comunidades LGBTQ+ o productos de la cultura LGBTQ+ (por ejemplo, arte y medios creados por y para la cultura LGBTQ+, activismo centrado en cuestiones LGBTQ+, jerga comúnmente utilizada en comunidades LGBTQ+, etc.). Utilícese un término más específico de ser posible.
broader: Subcultures
change note: Version 4.2.0
has top concept: Subcultures
in scheme: v3
narrower: Lesbian culture
narrower: Gay culture
narrower: LGBTQ+ arts
narrower: LGBTQ+ literature
narrower: Transgender culture
narrower: Queer culture
narrower: Bisexual culture
narrower: Asexual culture
narrower: Intersex culture
preferred label: Cultura LGBTQ+
related: LGBTQ+ cultural heritage institutions
related: LGBTQ+ punk community

LGBTQ+ athletes
type: Concept
issued: 2022-05-03
modified: 2026-02-24
comment: Professional or amateur sports players who self-identify as LGBTQ+.
comment: Deportistas profesionales o aficionados que se autoidentifican como LGBTQ+.
alternative label: LGBTQ+ sports players
alternative label: LGBTQ+ sportspeople
alternative label: LGBTQ+ sportspersons
alternative label: Atletas (LGBTQ)
alternative label: Deportistas (LGBTQ)
alternative label: Deportistas LGBTQ+
alternative label: Deportistas LGBTQ
alternative label: Jugadores deportivos LGBTQ+
broader: LGBTQ+ people
change note: Version 4.2.0
has top concept: LGBTQ+ people
in scheme: v3
narrower: Lesbian athletes
narrower: Gay athletes
narrower: Bisexual athletes
narrower: Transgender athletes
narrower: Queer athletes
narrower: Intersex athletes
narrower: Non-binary athletes
narrower: LGBTQ+ basketball players
preferred label: Atletas LGBTQ+
related: Eurogames
related: LGBTQ+ sports clubs
related: Two-Spirit athletes

Fandom
type: Concept
issued: 2022-07-04
modified: 2025-02-23
comment: Communities of people who are fans of a particular work or media property. Participation in fandom can include writing and reading fanfiction, creating and viewing fanart, attending conventions, cosplaying, and/or roleplaying.
comment: Comunidades de personas que son fanáticas de una obra o propiedad mediática en particular. La participación en el fandom puede incluir escribir y leer fanfiction, crear y ver fanart, asistir a convenciones, hacer cosplay y/o juegos de rol.
broader: Subcultures
change note: Version 4.2.0
has top concept: Subcultures
in scheme: v3
narrower: Anime and manga fandom
narrower: Fandom conventions
narrower: Fandom terminology
narrower: Fanworks
narrower: Furry fandom
narrower: Gender in fandom
narrower: LGBTQ+ people in fandom
narrower: People of color in fandom
narrower: Racism in fandom
narrower: Shipping in fandom
narrower: Slash fandom

LGBTQ+ neurodivergent people
type: Concept
issued: 2023-06-26
modified: 2026-03-05
comment: LGBTQ+ people with neurodevelopmental differences in areas such as cognition, sensory processing, emotionality, and sociality
comment: Personas LGBTQ+ cuyos cerebros procesan, aprenden y/o se comportan de manera diferente a lo que la sociedad considera típico. Algunas de estas diferencias neurológicas pueden presentarse como problemas de aprendizaje, trastornos médicos y otras condiciones.
alternative label: LGBTQ+ neuroatypical people
alternative label: Neurodivergent LGBTQ+ people
alternative label: Neuroatypical LGBTQ+ people
broader: LGBTQ+ disabled people
change note: Version 4.2.0
has top concept: LGBTQ+ people
in scheme: v3
narrower: Gay neurodivergent men
narrower: Lesbian neurodivergent people
narrower: Bisexual neurodivergent people
narrower: Transgender neurodivergent people
narrower: Queer neurodivergent people
narrower: Asexual neurodivergent people
narrower: Intersex neurodivergent people
narrower: LGBTQ+ autistic people
narrower: Neuroqueer
preferred label: Personas LGBTQ+ neurodivergentes
related: Two-Spirit neurodivergent people
related: Neurogender

Leather people
type: Concept
issued: 2023-12-18
modified: 2025-02-23
comment: People who participate in or identify with leather communities.
comment: Personas que participan en comunidades de cuero o se autoidentifican con ellas.
broader: Leather community
change note: Version 4.2.0
has top concept: LGBTQ+ communities
in scheme: v3
narrower: Leather daddies
narrower: Leather families
narrower: Leather mommies
narrower: Leathermen
narrower: Leatherwomen
narrower: Pup play
narrower: Leatherboys
narrower: Leathergirls
narrower: Bootblacks
preferred label: Personas leather
related: Pups (Roleplay)
related: Kinky people

LGBTQ+ Unitarian Universalists
type: Concept
issued: 2024-06-19
modified: 2025-02-23
comment: LGBTQ+ people who are members of the Unitarian Universalist church.
alternative label: LGBTQ Unitarian Universalists
alternative label: Unitarian Universalist LGBTQ+ people
broader: LGBTQ+ African religions
change note: Version 4.2.0
has top concept: LGBTQ+ African religions
in scheme: v3
narrower: Lesbian Unitarian Universalists
narrower: Gay Unitarian Universalists
narrower: Bisexual Unitarian Universalists
narrower: Transgender Unitarian Universalists
narrower: Queer Unitarian Universalists
narrower: Demisexual Unitarian Universalists
narrower: Megasexual Unitarian Universalists
narrower: Intersex Unitarian Universalists
narrower: Aromantic Unitarian Universalists
narrower: Greyromantic Unitarian Universalists
narrower: Non-binary Unitarian Universalists

LGBTQ+ brides
type: Concept
issued: 2026-02-23
modified: 2026-02-26
comment: LGBTQ+ people who are getting married and identify as a bride.
alternative label: Brides (LGBTQ+)
broader: LGBTQ+ people
change note: Version 4.2.0
has top concept: LGBTQ+ people
in scheme: v4
narrower: Transgender brides
narrower: Lesbian brides
narrower: Gay brides
narrower: Bisexual brides
narrower: Asexual brides
narrower: Non-binary brides
narrower: Queer brides
narrower: Intersex brides
related: LGBTQ+ weddings
related: Two-Spirit brides
related: LGBTQ+ grooms

LGBTQ+ grooms
type: Concept
issued: 2026-02-23
modified: 2026-02-26
comment: LGBTQ+ people who are getting married and identify as a groom.
alternative label: Grooms (LGBTQ+)
broader: LGBTQ+ people
change note: Version 4.2.0
has top concept: LGBTQ+ people
in scheme: v4
narrower: Transgender grooms
narrower: Lesbian grooms
narrower: Gay grooms
narrower: Bisexual grooms
narrower: Asexual grooms
narrower: Non-binary grooms
narrower: Queer grooms
narrower: Intersex grooms
related: LGBTQ+ weddings
related: Two-Spirit grooms
related: LGBTQ+ brides

LGBTQ+ lawyers
type: Concept
issued: 2026-02-24
modified: 2026-02-27
comment: LGBTQ+ people who are licensed to provide legal advice, draft legal documents, and represent others in legal matters.
alternative label: LGBTQ+ solicitors
alternative label: LGBTQ+ barristers
alternative label: LGBTQ+ law practitioners
broader: LGBTQ+ people
change note: Version 4.2.0
has top concept: LGBTQ+ people
in scheme: v4
narrower: Gay lawyers
narrower: Lesbian lawyers
narrower: Bisexual lawyers
narrower: Asexual lawyers
narrower: Intersex lawyers
narrower: Non-binary lawyers
narrower: Transgender lawyers
narrower: Queer lawyers
related: Law
related: Two-Spirit lawyers
related: LGBTQ+ law students

LGBTQ+ political activists
type: Concept
issued: 2019-05-14
modified: 2026-02-23
replaces: activistsLGBTQ
comment: LGBTQ+ people working to bring about political or social change through public organizing.
comment: Personas LGBTQ+ que se organizan o hacen campaña por objetivos y cambios sociales, culturales, políticos o económicos.
alternative label: Political activists (LGBTQ)
alternative label: Activists (LGBTQ)
alternative label: LGBTQ+ activists
alternative label: Activistas (LGBTQ)
alternative label: Activistas políticos (LGBTQ)
broader: LGBTQ+ people
change note: Version 4.2.0
has top concept: LGBTQ+ people
in scheme: v3
narrower: AIDS activists
narrower: Bisexual political activists
narrower: Gay political activists
narrower: Lesbian political activists
narrower: Queer political activists
narrower: Transgender political activists
narrower: Asexual political activists
narrower: Intersex political activists
narrower: Non-binary political activists
preferred label: Activistas LGBTQ+
related: LGBTQ+ activism
related: Zaps
related: Two-Spirit political activists

Sadomasochism
type: Concept
issued: 2019-05-14
modified: 2025-02-23
replaces: SM
comment: Eroticization of pain and intense sensation.
comment: Erotización del dolor y la sensación intensa.
alternative label: Algolagnia
alternative label: S&M
alternative label: SM
alternative label: Sexual Torture
alternative label: Tortura sexual
broader: BDSM
broader: Sexual preference
change note: Version 4.2.0
has top concept: Eroticism
in scheme: v3
narrower: Masochism
narrower: Sadism
narrower: Genital torture
narrower: Breast torture
narrower: Nipple torture
preferred label: Sadomasoquismo
related: Sexual identity
related: LGBTQ+ submissives
related: Leather and kink activism
related: Kinky people
related: Tickling
related: Anti-sadomasochism

Anal play
type: Concept
issued: 2019-05-14
modified: 2025-02-23
replaces: assplay
comment: Any kind of sexual play that involves anal stimulation.
comment: Término general para los actos sexuales que implican las nalgas y el ano.
alternative label: Assplay
broader: Sex (Act)
broader: Sexual practices
change note: Version 4.2.0
has top concept: Sex (Act)
in scheme: v3
narrower: Anal sex
narrower: Rimming
preferred label: Juegos anales
related: Anal beads
related: Anal fisting
related: Butt
related: Butt plugs
related: Enemas
related: Scat play
related: Spanking
related: Paddling
related: Douching

LGBTQ+ bars
type: Concept
issued: 2019-05-14
modified: 2026-02-27
replaces: barsLGBTQ
comment: Drinking establishments that primarily cater to LGBTQ+ people.
comment: Establecimientos que sirven alcohol y son frecuentados principalmente por personas LGBTQ+.
alternative label: Bars (LGBTQ)
alternative label: Bares (LGBTQ)
broader: LGBTQ+ meeting places
change note: Version 4.2.0
has top concept: LGBTQ+ meeting places
in scheme: v3
narrower: Bisexual bars
narrower: Drag bars
narrower: Gay bars
narrower: Lesbian bars
narrower: Queer bars
narrower: Transgender bars
narrower: Leather bars
preferred label: Bares LGBTQ+
related: Gay discos
related: LGBTQ+ night life
related: LGBTQ+ pubs
related: Police raids on LGBTQ+ bars
related: LGBTQ+ bar signs

Intolerance towards LGBTQ+ people
type: Concept
issued: 2019-05-14
modified: 2025-02-23
replaces: intoleranceTowardsLGBTQPeople
comment: Unwillingness to accept or affirm LGBTQ+ people or their identities in attitude or practice.
comment: Renuencia a aceptar o afirmar a las personas LGBTQ+ o sus identidades en actitud o en práctica.
alternative label: Bigotry towards LGBTQ people
alternative label: Prejudice towards LGBTQ people
alternative label: Intolerance towards LGBTQ people
change note: Version 4.2.0
in scheme: v3
preferred label: Intolerancia hacia personas LGBTQ+
related: Hate crimes
related: Hate speech
related: LGBTQ+ discrimination
related: Homonationalism
related: Misandry
related: Misogyny
related: Stigma
related: Anti-Two-Spirit discrimination
related: Transmisogyny
related: Anti-intersex discrimination
related: Transmisogynoir
related: Anti-asexual discrimination

Crossdressers
type: Concept
issued: 2019-05-14
modified: 2025-02-23
replaces: crossdressers
comment: Individuals who wear clothes stereotypical to or associated with a gender other than their predominantly-identified gender. Crossdressers often develop a persona while crossdressing. Only use to describe individuals who self-identify as crossdressers.
comment: Personas que usan ropa estereotipada o asociada con un género distinto al género bajo el cual se autoidentifican predominantemente. Los transformistas a menudo desarrollan una personalidad en relación a la práctica. Utilícese únicamente para describir a personas que se autoidentifican como transformistas.
alternative label: Cross-dressers
broader: Gender minorities
change note: Version 4.2.0
has top concept: Gender minorities
in scheme: v3
preferred label: Transformistas
related: Clothing
related: Crossdressing
related: Drag kings
related: Drag queens
related: Eonist people
related: Lingerie
related: Parents of crossdressers
related: Partners of crossdressers
related: Passing (Gender)
related: Transgender people
related: Transvestites
related: Clocking (Gender)

LGBTQ+ dominatrices
type: Concept
issued: 2019-05-14
modified: 2025-02-23
replaces: dominatricesLGBTQ
comment: The person who takes on the position of authority or power in a power exchange relationship or kink activity. Most commonly used by feminine identified people and professional dominants.
comment: Mujeres que desempeñan un papel dominante en las actividades de BDSM; utilícese para dominatrices que se autoidentifiquen como LGBTQ+.
alternative label: Dominatrices (LGBTQ)
alternative label: LGBTQ+ D-types
alternative label: LGBTQ+ Dommes
alternative label: LGBTQ+ Mistresses
broader: Relationship minorities
broader: Kinky people
change note: Version 4.2.0
has top concept: Relationship minorities
in scheme: v3
narrower: Bisexual dominatrices
narrower: Lesbian dominatrices
narrower: Queer dominatrices
narrower: Transgender dominatrices
narrower: Asexual dominatrices
preferred label: Dominatrices LGBTQ+
related: Kink community
related: Leather community
related: LGBTQ+ dominants
related: LGBTQ+ mistresses (BDSM culture)
related: LGBTQ+ submissives
related: Power exchange

Down-low
type: Concept
issued: 2019-05-14
modified: 2025-02-23
replaces: downLow
comment: African American slang term that describes a subculture of Black men who identify as heterosexual but have sex with men.
comment: Término de la jerga afroamericana que describe una subcultura de hombres negros que se autoidentifican como heterosexuales pero tienen relaciones sexuales con hombres.
broader: African American LGBTQ+ people
change note: Version 4.2.0
has top concept: LGBTQ+ people
in scheme: v3
preferred label: Down-low (Cultura gay)
related: African American bisexual people
related: Closeted bisexual people
related: Closeted gay men
related: African American gay men
related: Men who have sex with men
related: Secrecy
related: Closeted LGBTQ+ people
related: Closeted queer people
related: Closeted intersex people
related: Closeted Two-Spirit people
related: Beards (Gay culture)
related: MLM (Men Loving Men)

Human rights
type: Concept
issued: 2019-05-14
modified: 2025-02-23
replaces: humanRights
comment: Moral, social, and legal standards or principles for human behavior, commonly understood as fundamental to all human beings and subject to legal protection.
comment: Normas o principios morales, sociales y legales para el comportamiento humano, comúnmente entendidos como fundamentales para todo ser humano y sujetos a protección legal.
change note: Version 4.2.0
in scheme: v3
narrower: LGBTQ+ civil rights
narrower: Intersex rights
narrower: Gender equality
preferred label: Derechos humanos

LGBTI
type: Concept
issued: 2019-05-14
modified: 2025-02-23
replaces: LGBTI
comment: Acronym used to describe lesbians, gay men, bisexual people, transgender people, and intersex people as a group.
comment: Acrónimo utilizado para describir a lesbianas, hombres gay, personas bisexuales, personas transgénero e intersexuales como grupo.
change note: Version 4.2.0
in scheme: v3
narrower: LGBT
narrower: LGB
related: Bisexual community
related: Gay community
related: Intersex movement
related: Lesbian community
related: Sexual minorities
related: Transgender community
related: Transgenderism

LGBTQ+ books
type: Concept
issued: 2019-05-14
modified: 2025-02-23
replaces: LGBTQBooks
comment: Written works featuring LGBTQ+ characters or themes, or works intended to be read by LGBTQ+ people.
comment: Obras escritas que presenten a personajes o temas LGBTQ+, u obras destinadas a ser leídas por personas LGBTQ+.
alternative label: LGBTQ books
alternative label: Libros LGBTQ
change note: Version 4.2.0
in scheme: v3
narrower: LGBTQ+ challenged books
preferred label: Libros LGBTQ+
related: LGBTQ+ bookshops
related: LGBTQ+ book censorship
related: LGBTQ+ book clubs
related: LGBTQ+ libraries
related: LGBTQ+ literature
related: LGBTQ+ press
related: LGBTQ+ authors
related: Intersex fiction
related: Aromantic fiction
related: Asexual fiction

Masculinities
type: Concept
issued: 2019-05-14
modified: 2025-03-20
replaces: masculinity
comment: Culture-specific sets of attributes, behaviors, and roles generally associated with men or boys.
comment: Conjuntos de atributos, comportamientos y roles específicos de una cultura generalmente asociados con hombres o niños.
alternative label: Masculinity
alternative label: Masculinidad
broader: Gender expression
change note: Version 4.2.0
has top concept: Gender
in scheme: v3
narrower: Female masculinity
narrower: Toxic masculinity
narrower: Transmasculinity
narrower: Masculine of center
preferred label: Masculinidades
related: Androgyny
related: Butches
related: Femininities
related: Gender roles
related: Machismo
related: Macho men
related: Transmasculine people
related: Wolves (Gay culture)

LGBTQ+ mistresses (BDSM culture)
type: Concept
issued: 2019-05-14
modified: 2025-02-23
replaces: mistressesLGBTQ
comment: LGBTQ+ women who are part of the BDSM scene and assume the mistress role in sexual relationships with a mistress/submissive dynamic.
comment: Mujeres LGBTQ+ que forman parte de la escena BDSM y asumen el rol de ama en relaciones sexuales con una dinámica ama/esclava.
alternative label: Mistresses (LGBTQ)
alternative label: LGBTQ+ mistresses
alternative label: Amas (LGBTQ)
broader: Sexual identity
broader: Sexual roles
broader: Tops (Sex)
change note: Version 4.2.0
has top concept: Sexual identity
in scheme: v3
narrower: Bisexual mistresses (BDSM culture)
narrower: Lesbian mistresses (BDSM culture)
narrower: Queer mistresses (BDSM culture)
narrower: Transgender mistresses (BDSM culture)
narrower: Asexual mistresses (BDSM culture)
preferred label: Amas LGBTQ+
related: LGBTQ+ dominatrices
related: LGBTQ+ dominants
related: Social privilege
related: LGBTQ+ submissives

LGBTQ+ newspapers
type: Concept
issued: 2019-05-14
modified: 2025-02-23
replaces: newspapersLGBTQ
comment: Serialized print or digital publications about LGBTQ+ people and LGBTQ+ issues (typically produced by LGBTQ+ people or LGBTQ+ organizations) that contain news, articles, columns, correspondence, and advertisements.
comment: Publicaciones impresas o digitales serializadas sobre personas LGBTQ+ y temas LGBTQ+ (normalmente producidas por personas LGBTQ+ u organizaciones LGBTQ+) que contienen noticias, artículos, columnas, correspondencia y anuncios.
alternative label: Newspapers (LGBTQ)
alternative label: Diarios LGBTQ+
alternative label: Diarios (LGBTQ)
alternative label: Periódicos (LGBTQ)
broader: LGBTQ+ press
broader: LGBTQ+ periodicals
change note: Version 4.2.0
has top concept: LGBTQ+ press
in scheme: v3
narrower: Bisexual newspapers
narrower: Gay newspapers
narrower: Lesbian newspapers
narrower: LGBTQ+ obituaries
narrower: Queer newspapers
narrower: Transgender newspapers
narrower: Asexual newspapers
narrower: Intersex newspapers
preferred label: Periódicos LGBTQ+
related: LGBTQ+ magazines
related: LGBTQ+ newsletters
related: Two-Spirit newspapers

LGBTQ+ Protestants
type: Concept
issued: 2019-05-14
modified: 2025-02-23
replaces: protestantsLGBTQ
comment: LGBTQ+ people who are members of the Protestant Church.
comment: Personas LGBTQ+ que son miembros de la Iglesia protestante.
alternative label: Protestants (LGBTQ)
alternative label: Protestantes (LGBTQ)
broader: LGBTQ+ Christians
change note: Version 4.2.0
has top concept: LGBTQ+ African religions
in scheme: v3
narrower: LGBTQ+ Anglicans
narrower: LGBTQ+ Baptists
narrower: Bisexual Protestants
narrower: LGBTQ+ Calvinists
narrower: Gay Protestants
narrower: Lesbian Protestants
narrower: LGBTQ+ Quakers
narrower: Queer Protestants
narrower: Transgender Protestants
narrower: Intersex Protestants
narrower: Asexual Protestants
preferred label: Protestantes LGBTQ+

Sex work
type: Concept
issued: 2019-05-14
modified: 2025-02-23
replaces: sexWork
comment: The exchange of sexual services, performances, or companionship for money or goods. Use to describe the broad spectrum of sex work, and use more specific terms if possible. For individuals who perform sex work, use "Sex workers" or narrower terms. For sex work undertaken by individuals who cannot or have not consented, use "Sex trafficking."
comment: El intercambio de servicios, actuaciones o productos sexuales a cambio de una compensación material; incluye actividades que implican contacto físico directo entre quienes compran y quienes venden, así como estimulación sexual indirecta.
alternative label: Prostitution
broader: Sex industry
change note: Version 4.2.0
has top concept: Sex industry
in scheme: v3
narrower: Escort services
narrower: Phone sex work
narrower: Stripping
narrower: Cam modeling
narrower: Street sex work
narrower: Survival sex work
narrower: Sugaring
narrower: Gay for pay
preferred label: Trabajo sexual
related: Sex tourism
related: Sex trafficking
related: Sex workers

Sexual excitement
type: Concept
issued: 2019-05-14
modified: 2025-03-20
replaces: sexualExcitement
comment: Term describing the physiological and psychological response to sexual stimulation.
comment: Término que describe la respuesta fisiológica y psicológica a la estimulación sexual.
alternative label: Sexual arousal
broader: Hypersexuality
change note: Version 4.2.0
has top concept: Hypersexuality
in scheme: v3
preferred label: Excitación sexual
related: Cum
related: Eroticism
related: Getting off
related: Happy endings
related: Jizz
related: Libido
related: Sex (Act)
related: Sexual climax
related: Sexual dysfunction
related: Sexual function
related: Sexuality
related: Homoeroticism

Transphobia
type: Concept
issued: 2019-05-14
modified: 2025-02-23
replaces: transphobia
comment: Antagonism or disgust directed toward trans individuals (or others perceived to be transgressing gender norms) due to their gender identity and/or expression. Transphobia can include denial of the existence of trans identities, stereotypes, verbal harassment, and physical violence.
comment: Antagonismo o disgusto dirigido hacia personas trans (u otras personas percibidas como transgresoras de las normas de género) debido a su identidad y/o expresión de género. La transfobia puede incluir la negación de la existencia de identidades trans, estereotipos, acoso verbal y violencia física.
broader: LGBTQ+ phobia
change note: Version 4.2.0
has top concept: LGBTQ+ phobia
in scheme: v3
narrower: Transphobia in fandom
narrower: Internalized transphobia
narrower: Trans-exclusionary radical feminism
preferred label: Transfobia
related: Anti-transgender discrimination
related: Anti-transgender violence
related: Heterosexism
related: Transgender people
related: Trans exclusivity
related: Transmisogyny
related: Transmisogynoir
related: Anti-transgender legislation
related: Anti-gender movement

LGBTQ+ people with chronic illnesses
type: Concept
issued: 2022-02-17
modified: 2025-02-23
comment: LGBTQ+ people who have long-term health conditions that require continued medical attention and/or significantly impact or limit daily life; some but not all people with chronic illnesses consider themselves disabled.
comment: Personas LGBTQ+ que tienen condiciones de salud a largo plazo que requieren atención médica continua y/o impactan o limitan significativamente la vida diaria; algunas, pero no todas, las personas con enfermedades crónicas se consideran discapacitadas.
alternative label: Chronically ill people (LGBTQ)
alternative label: People with chronic illnesses (LGBTQ)
alternative label: Personas con enfermedades crónicas (LGBTQ)
alternative label: Enfermos crónicos LGBTQ+
alternative label: Enfermos crónicos (LGBTQ)
broader: LGBTQ+ people
change note: Version 4.2.0
has top concept: LGBTQ+ people
in scheme: v3
narrower: Lesbians with chronic illnesses
narrower: Gay men with chronic illnesses
narrower: Bisexual people with chronic illnesses
narrower: Transgender people with chronic illnesses
narrower: Queer people with chronic illnesses
narrower: Asexual people with chronic illnesses
narrower: Intersex people with chronic illnesses
preferred label: Personas LGBTQ+ con enfermedades crónicas
related: LGBTQ+ disabled people
related: Crip
related: LGBTQ+ people who use substances for medical purposes
related: Queercrip
related: Two-Spirit people with chronic illnesses

Arab LGBTQ+ people
type: Concept
issued: 2022-05-11
modified: 2025-02-23
comment: LGBTQ+ people who are from Arab countries and/or are descended from Arab peoples. Do not conflate with Muslim people.
comment: Personas LGBTQ+ que son de países árabes, hablan árabe y/o son descendientes de pueblos árabes. No se debe confundir con personas musulmanas.
alternative label: Arab people (LGBTQ)
alternative label: Arabs (LGBTQ)
alternative label: LGBTQ+ Arab people
alternative label: LGBTQ+ Arabs
alternative label: Personas árabes (LGBTQ)
alternative label: Árabes (LGBTQ)
alternative label: Árabes LGBTQ+
alternative label: Personas árabes LGBTQ+
broader: LGBTQ+ people of shared ethnic or national identities
broader: LGBTQ+ people of color
change note: Version 4.2.0
has top concept: LGBTQ+ people
in scheme: v3
narrower: Arab lesbians
narrower: Arab gay men
narrower: Arab bisexual people
narrower: Arab transgender people
narrower: Arab queer people
narrower: Arab asexual people
narrower: Arab intersex people
narrower: Palestinian LGBTQ+ people
narrower: Arab non-binary people
narrower: Arab American LGBTQ+ people
narrower: Arab aromantic people
preferred label: Personas LGBTQ+ árabes

LGBTQ+ erotic films
type: Concept
issued: 2023-04-12
modified: 2025-02-23
comment: Erotic films or movies, created by LGBTQ+ directors, depicting LGBTQ+ people, or that are regarded as important within LGBTQ+ culture. Use a more specific narrower term where applicable.
comment: Filmes o películas eróticas, creadas por directores LGBTQ+, que representan a personas LGBTQ+ o a personas consideradas importantes dentro de la cultura LGBTQ+.Utilicese un término más específico y restringido cuando corresponda.
broader: LGBTQ+ films
change note: Version 4.2.0
has top concept: Subcultures
in scheme: v3
narrower: Lesbian erotic films
narrower: Gay erotic films
narrower: Bisexual erotic films
narrower: Transgender erotic films
narrower: Queer erotic films
narrower: Intersex erotic films
narrower: Aromantic erotic films
narrower: Asexual erotic films
narrower: Demisexual erotic films
preferred label: Películas eróticas LGBTQ+
related: LGBTQ+ porn films
related: Two-Spirit erotic films
related: LGBTQ+ erotic art

Central American Indigenous LGBTQ+ people
type: Concept
issued: 2024-06-10
modified: 2025-02-23
comment: People who are part of the Native peoples of Central America and self-identify as LGBTQ. Use more specific terms when available.
alternative label: Central American Indigenous people (LGBTQ)
alternative label: Central American Native LGBTQ+ people
alternative label: Central American Native people (LGBTQ)
alternative label: Indigenous Central American LGBTQ+ people
alternative label: LGBTQ+ Central American Indigenous people
alternative label: LGBTQ+ Central American Native people
broader: Indigenous LGBTQ+ people
change note: Version 4.2.0
has top concept: LGBTQ+ people
in scheme: v3
narrower: Central American Indigenous asexual people
narrower: Central American Indigenous bisexual people
narrower: Central American Indigenous gay men
narrower: Central American Indigenous intersex people
narrower: Central American Indigenous lesbians
narrower: Central American Indigenous queer people
narrower: Central American Indigenous transgender people
narrower: Central American Indigenous non-binary people
narrower: Central American Indigenous demisexual people
narrower: Central American Indigenous megasexual people
narrower: Central American Indigenous greyromantic people
narrower: Central American Indigenous aromantic people

Belarusian LGBTQ+ people
type: Concept
issued: 2024-06-10
modified: 2025-02-23
comment: LGBTQ+ people who are ethnically Belarusian or have Belarusian nationality.
alternative label: Belarusian people (LGBTQ)
alternative label: Belarusians (LGBTQ)
alternative label: LGBTQ+ Belarusians
broader: LGBTQ+ people of shared ethnic or national identities
change note: Version 4.2.0
has top concept: LGBTQ+ people
in scheme: v3
narrower: Belarusian asexual people
narrower: Belarusian bisexual people
narrower: Belarusian gay men
narrower: Belarusian intersex people
narrower: Belarusian lesbians
narrower: Belarusian queer people
narrower: Belarusian non-binary people
narrower: Belarusian transgender people
narrower: Belarusian demisexual people
narrower: Belarusian megasexual people
narrower: Belarusian greyromantic people
narrower: Belarusian aromantic people

Russian LGBTQ+ people
type: Concept
issued: 2024-06-10
modified: 2025-02-23
comment: LGBTQ+ people who are ethnically Russian or have Russian nationality.
alternative label: LGBTQ+ Russians
alternative label: Russians (LGBTQ)
broader: LGBTQ+ people of shared ethnic or national identities
change note: Version 4.2.0
has top concept: LGBTQ+ people
in scheme: v3
narrower: Russian asexual people
narrower: Russian bisexual people
narrower: Russian gay men
narrower: Russian intersex people
narrower: Russian lesbians
narrower: Russian queer people
narrower: Russian non-binary people
narrower: Russian transgender people
narrower: Russian demisexual people
narrower: Russian megasexual people
narrower: Russian greyromantic people
narrower: Russian aromantic people

Ukrainian LGBTQ+ people
type: Concept
issued: 2024-06-19
modified: 2025-02-23
comment: LGBTQ+ people who are ethnically Ukrainian or have Ukrainian nationality.
alternative label: LGBTQ+ Ukrainians
alternative label: Ukrainians (LGBTQ)
broader: LGBTQ+ people of shared ethnic or national identities
change note: Version 4.2.0
has top concept: LGBTQ+ people
in scheme: v3
narrower: Ukrainian asexual people
narrower: Ukrainian bisexual people
narrower: Ukrainian gay men
narrower: Ukrainian intersex people
narrower: Ukrainian lesbians
narrower: Ukrainian queer people
narrower: Ukrainian non-binary people
narrower: Ukrainian transgender people
narrower: Ukrainian demisexual people
narrower: Ukrainian megasexual people
narrower: Ukrainian greyromantic people
narrower: Ukrainian aromantic people

Reproductive health care for LGBTQ+ people
type: Concept
issued: 2024-06-19
modified: 2026-03-05
comment: Access to and experiences with reproductive health care for LGBTQ+ people. Reproductive health care includes birth control, abortion, assisted reproduction, and prenatal and obstetric care.
alternative label: LGBTQ+ reproductive health care
alternative label: Reproductive health care (LGBTQ)
alternative label: Reproductive healthcare for LGBTQ+ people
broader: Health care for LGBTQ+ people
change note: Version 4.2.0
has top concept: Health care for LGBTQ+ people
in scheme: v3
narrower: Reproductive health care for non-binary people
narrower: Reproductive health care for transgender people
narrower: Abortion
narrower: Abortion access for LGBTQ+ people
narrower: Reproductive health care for intersex people
narrower: Abortion counseling for LGBTQ+ people
narrower: Abortion services for LGBTQ+ people
related: Abortion access for LGBTQ+ people
related: Reproductive health care for Two-Spirit people
related: Reproductive rights
related: Reproductive justice
related: LGBTQ+ abortion seekers

LGBTQ+ high school students
type: Concept
issued: 2024-10-22
modified: 2025-02-23
comment: LGBTQ+ people who attend high school, generally consisting of grades 9-12 (sometimes referred to as freshman through senior year) with students between the ages of 14 and 18.
alternative label: High school students (LGBTQ)
alternative label: LGBTQ+ secondary school students
alternative label: Secondary school students (LGBTQ)
broader: LGBTQ+ students
change note: Version 4.2.0
has top concept: LGBTQ+ people
in scheme: v3
narrower: Lesbian high school students
narrower: Gay high school students
narrower: Bisexual high school students
narrower: Transgender high school students
narrower: Queer high school students
narrower: Intersex high school students
narrower: Asexual high school students
narrower: Aromantic high school students
narrower: Non-binary high school students
narrower: Demisexual high school students
narrower: Greyromantic high school students
related: Two-Spirit high school students

LGBTQ+ middle school students
type: Concept
issued: 2024-10-22
modified: 2025-02-23
comment: LGBTQ+ people who attend middle school, generally consisting of grades 6 through 8 with students between the ages of 11 and 14.
alternative label: Middle school students (LGBTQ)
alternative label: LGBTQ+ junion high students
alternative label: Junior high students (LGBTQ)
broader: LGBTQ+ students
change note: Version 4.2.0
has top concept: LGBTQ+ people
in scheme: v3
narrower: Lesbian middle school students
narrower: Gay middle school students
narrower: Bisexual middle school students
narrower: Transgender middle school students
narrower: Queer middle school students
narrower: Intersex middle school students
narrower: Asexual middle school students
narrower: Aromantic middle school students
narrower: Non-binary middle school students
narrower: Demisexual middle school students
narrower: Greyromantic middle school students
related: Two-Spirit middle school students

LGBTQ+ people in arts and media
type: Concept
issued: 2025-04-23
modified: 2025-04-23
comment: Umbrella term for the depiction of LGBTQ+ people and communities in different forms of creative activity and cultural production, including literature, visual art, and popular media. Use more specific terms if possible.
broader: LGBTQ+ people
change note: Version 4.2.0
has top concept: LGBTQ+ people
in scheme: v4
narrower: Lesbians in arts and media
narrower: Gay men in arts and media
narrower: Bisexual people in arts and media
narrower: Transgender people in arts and media
narrower: Queer people in arts and media
narrower: Intersex people in arts and media
narrower: Non-binary people in arts and media
narrower: LGBTQ+ people in visual art
narrower: LGBTQ+ people in mass media
narrower: LGBTQ+ people in literature
related: LGBTQ+ arts
related: Two-Spirit people in arts and media

LGBTQ+ medical professionals
type: Concept
issued: 2026-02-24
modified: 2026-03-03
comment: LGBTQ+ people who are trained and licensed to provide healthcare services, such as diagnosing, treating, and preventing physical or mental illness.
alternative label: Medical professionals (LGBTQ+)
alternative label: LGBTQ medical professionals
broader: LGBTQ+ people
change note: Version 4.2.0
has top concept: LGBTQ+ people
in scheme: v4
narrower: Gay medical professionals
narrower: Lesbian medical professionals
narrower: Bisexual medical professionals
narrower: Asexual medical professionals
narrower: Intersex medical professionals
narrower: Non-binary medical professionals
narrower: Transgender medical professionals
narrower: Queer medical professionals
narrower: LGBTQ+ medical doctors
narrower: LGBTQ+ nurses
related: Medical care
related: Two-Spirit medical professionals

Anti-transgender discrimination
type: Concept
issued: 2019-05-14
modified: 2026-02-23
replaces: antiTransgenderDiscrimination
comment: The unjust or prejudicial treatment of transgender people (or others perceived to be transgressing gender norms) due to their gender identity and/or expression; may include the denial of legal rights, employment, and housing.
comment: El trato injusto o perjudicial hacia las personas transgénero (u otras personas percibidas como transgresoras de las normas de género) por su identidad y/o expresión de género; puede incluir la negación de derechos legales, empleo y vivienda.
broader: LGBTQ+ discrimination
change note: Version 4.2.0
has top concept: LGBTQ+ discrimination
in scheme: v3
narrower: Deadnaming
narrower: Trans exclusivity
preferred label: Discriminación anti-transgénero
related: Medicalization
related: Bathroom bans
related: Public bathrooms
related: Public facilities
related: Transphobia
related: Womyn
related: Transmisogyny
related: Transmisogynoir
related: Trans-exclusionary radical feminism
related: Anti-transgender legislation
related: Anti-gender movement
related: Detrans people

Aromantic people
type: Concept
issued: 2019-05-14
modified: 2025-02-23
replaces: aromanticPeople
comment: Individuals who do not generally experience romantic attraction or desire.
comment: Personas que generalmente no experimentan atracción o deseo romántico.
broader: Romantic minorities
change note: Version 4.2.0
has top concept: Romantic minorities
in scheme: v3
preferred label: Personas arrománticas
related: Asexuality
related: Relationship satisfaction
related: Amatonormativity
related: Aromanticism
related: Aromantic families
related: Aromantic parents
related: Children of aromantic people
related: Alloromantic people
related: Biromantic people
related: Homoromantic people
related: Heteroromantic people
related: Panromantic people
related: Aromantic people in fandom

Asexual people
type: Concept
issued: 2019-05-14
modified: 2025-02-23
replaces: asexualPeople
comment: Individuals who generally do not experience sexual attraction or desire; do not use to describe individuals practicing celibacy or abstinence for religious or cultural reasons.
comment: Personas que generalmente no experimentan atracción o deseo sexual; no debe utilizarse para describir a personas que practican el celibato o la abstinencia por razones religiosas o culturales.
alternative label: Aces
broader: Sexual minorities
change note: Version 4.2.0
has top concept: Sexual minorities
in scheme: v3
narrower: Asexual youth
narrower: Asexual athletes
narrower: Closeted asexual people
narrower: Asexual college students
preferred label: Personas asexuales
related: Asexuality
related: Celibacy
related: Compulsory sexuality
related: Megasexual people
related: Asexual families
related: Asexual parents
related: Children of asexual people
related: Asexual people in fandom
related: Persecution of asexual people

Bears (Gay culture)
type: Concept
issued: 2019-05-14
modified: 2025-02-23
replaces: bears
comment: Slang used in the U.S. and other English speaking countries to describe hairy and large or muscular gay men.
comment: Jerga utilizada en EE.UU. y otros países angloparlantes para describir a hombres gay peludos y grandes o musculosos.
alternative label: Bear men
alternative label: Bears
alternative label: Hombres osos
alternative label: Osos
broader: Gay culture
broader: Gay men
broader: Gender roles
broader: Sexual identity
change note: Version 4.2.0
has top concept: Subcultures
in scheme: v3
narrower: Cubs (Gay culture)
preferred label: Osos (Cultura gay)
related: Chubs (Gay culture)
related: Gender expression
related: Goldilocks (Gay culture)
related: Otters (Gay culture)
related: Pups (Roleplay)
related: Wolves (Gay culture)
related: Bara
related: Bara fandom
related: Bear bars

Breast
type: Concept
issued: 2019-05-14
modified: 2025-02-23
replaces: breasts
comment: One of the two soft, protruding organs on an individual's chest.
comment: Uno de los dos órganos blandos que sobresalen del pecho de una persona.
alternative label: Boobs
alternative label: Bosoms
alternative label: Bosom
alternative label: Tits
alternative label: Titties
alternative label: Boob
alternative label: Breasts
alternative label: Tit
alternative label: Titty
alternative label: Mamas
alternative label: Teta
alternative label: Tetas
alternative label: Bubis
alternative label: Chichis
broader: Erogenous body parts
broader: Secondary sex characteristics
change note: Version 4.2.0
has top concept: Erogenous body parts
in scheme: v3
preferred label: Seno
related: Binding (Chest)
related: Breast augmentation
related: Breast fetish
related: Breast reduction
related: Breast size
related: Large breasts
related: Mastectomy
related: Small breasts
related: Chest
related: Breast torture
related: Breast play
related: Chest play

Children of LGBTQ+ people
type: Concept
issued: 2019-05-14
modified: 2025-02-23
replaces: childrenOfLGBTQPeople
comment: Children who have one or more LGBTQ+ parent.
comment: Hijos o hijas que tienen uno o más madres o padres LGBTQ+.
alternative label: Children of LGBTQ people
alternative label: Hijas de personas LGBTQ+
broader: Children
change note: Version 4.2.0
has top concept: Family members
in scheme: v3
narrower: Children of bisexual people
narrower: Children of gay men
narrower: Children of lesbians
narrower: Children of transgender people
narrower: Children of queer people
narrower: Children of aromantic people
narrower: Children of asexual people
narrower: Children of intersex people
narrower: Queerspawn
narrower: Bothies
narrower: LGBTQ+ children of LGBTQ+ parents
preferred label: Hijos de personas LGBTQ+
related: LGBTQ+ adoption
related: LGBTQ+ family generations

LGBTQ+ Christians
type: Concept
issued: 2019-05-14
modified: 2025-02-23
replaces: christiansLGBTQ
comment: LGBTQ+ people who are Christian. Use a more specific term if possible.
comment: Personas LGBTQ+ que son cristianas. Utilice un término más específico de ser posible.
alternative label: Christians (LGBTQ)
alternative label: Cristanos (LGBTQ)
broader: LGBTQ+ African religions
change note: Version 4.2.0
has top concept: LGBTQ+ African religions
in scheme: v3
narrower: Bisexual Christians
narrower: LGBTQ+ Eastern Orthodox Christians
narrower: Gay Christians
narrower: LGBTQ+ Jehovah's Witnesses
narrower: Lesbian Christians
narrower: LGBTQ+ Mormons
narrower: LGBTQ+ Old Catholics
narrower: LGBTQ+ Protestants
narrower: Queer Christians
narrower: LGBTQ+ Roman Catholics
narrower: Transgender Christians
narrower: Intersex Christians
narrower: Asexual Christians
preferred label: Cristianos LGBTQ+

Stealth (Transgender)
type: Concept
issued: 2019-05-14
modified: 2025-02-23
replaces: stealthTransgender
comment: Term used to describe the experience of a trans person who is not openly trans and is choosing to pass as cisgender.
comment: Término utilizado para describir la experiencia de una persona trans que no es abiertamente trans y elige hacerse pasar por cisgénero.
alternative label: Stealth
change note: Version 4.2.0
in scheme: v3
preferred label: Discreción (transgénero)
related: Assigned gender
related: Coming out
related: Gender
related: Outing (LGBTQ+ culture)
related: Passing (Gender)
related: Secrecy
related: Transgender people
related: Clocking (Gender)
related: Closeted LGBTQ+ people
related: Closeted transgender people
related: Closeted queer people
related: Closeted intersex people
related: Closeted Two-Spirit people

Gender dysphoria
type: Concept
issued: 2019-05-14
modified: 2025-04-23
replaces: genderDysphoria
comment: A psychological diagnosis (replacing the outdated and offensive "gender identity disorder") used to describe the sense of unease or dissatisfaction an individual feels as a result of incongruence between their gender identity and their assigned gender, gender expression, and/or the way their gender is perceived by others. This term is also used colloquially by individuals to describe the discomfort and distress they experience as a result of this incongruence. Though gender dysphoria is often associated with trans people, people of any identity may experience gender dysphoria when they do not feel "right" in their body or the way their gender is being expressed.
comment: Un diagnóstico psicológico (que reemplaza al término anticuado y ofensivo de "trastorno de identidad de género") utilizado para describir la sensación de malestar o insatisfacción que siente una persona como resultado de la incongruencia entre su identidad de género y su género asignado, su expresión de género y/o la forma en que su género es percibido por otras personas. Este término también se utiliza coloquialmente por personas para describir el malestar y la angustia que experimentan como resultado de esta incongruencia. Aunque la disforia de género a menudo se asocia con las personas trans, las personas de cualquier identidad pueden experimentar disforia de género cuando no se sienten "bien" con su cuerpo o con la forma en que se expresan su género.
change note: Version 4.2.0
in scheme: v3
narrower: Gender dysphoria in children
narrower: Gender dysphoria in youth
preferred label: Disforia de género
related: Gender assigned at birth
related: Gender expression
related: Gender identity
related: Gender identity disorder
related: Medicalization
related: Gender euphoria
related: Transmedicalism
related: Transmedicalists

Queer theory
type: Concept
issued: 2019-05-14
modified: 2025-04-23
replaces: queerTheory
comment: Field of critical theory that emerged in the 1990s out of queer studies and women's studies. Queer theory involves the study and theorization of gender and sexual practices and identities that exist outside of heterosexuality and which challenge heteronormativity and essentialism.
comment: Campo de la teoría crítica que surgió en la década de 1990 a partir de los estudios queer y los estudios de la mujer. La teoría queer implica el estudio y la teorización de las prácticas e identidades sexuales y de género que existen fuera de la heterosexualidad y que desafían la heteronormatividad y el esencialismo.
broader: Theories
change note: Version 4.2.0
has top concept: Theories
in scheme: v3
narrower: Queer gaze
narrower: Queer architecture
narrower: Queer ecology
narrower: Decolonial queer theory
narrower: Queer bodies
narrower: Queer desire
narrower: Queer time
preferred label: Teoría queer
related: Essentialism
related: Gender studies
related: Queer (Verb)
related: Queer studies
related: Queer theology
related: Social constructionism

LGBTQ+ sex workers
type: Concept
issued: 2019-05-14
modified: 2025-02-23
replaces: sexWorkersLGBTQ
comment: LGBTQ+ people who receive money or goods in exchange for sexual services, performances, or companionship. Use to describe LGBTQ+ people working across the broad spectrum of sex work.
comment: Personas LGBTQ+ que reciben dinero o bienes a cambio de servicios o actuaciones sexuales. Utilícese para describir a las personas LGBTQ+ que trabajan en el amplio espectro del trabajo sexual.
alternative label: LGBTQ+ prostitutes
alternative label: LGBTQ+ prostitution
alternative label: LGBTQ+ sex work
alternative label: Prostitutes (LGBTQ)
alternative label: Prostitution (LGBTQ)
alternative label: Sex work (LGBTQ)
alternative label: Trabajadores sexuales LGBTQ
alternative label: Prostitutos LGBTQ+
alternative label: Prostitutas LGBTQ+
alternative label: Prostitutxs LGBTQ+
alternative label: Trabajo sexual LGBTQ+
broader: Sex workers
broader: LGBTQ+ people
change note: Version 4.2.0
has top concept: Sex workers
in scheme: v3
narrower: Bisexual sex workers
narrower: Gay sex workers
narrower: Lesbian sex workers
narrower: Queer sex workers
narrower: Transgender sex workers
narrower: Intersex sex workers
narrower: Non-binary sex workers
narrower: LGBTQ+ strippers
narrower: LGBTQ+ porn stars
preferred label: Trabajadores sexuales LGBTQ+
related: LGBTQ+ sex tourism
related: Two-Spirit sex workers
related: Māhū sex workers

Sexual violence
type: Concept
issued: 2019-05-14
modified: 2025-02-23
replaces: sexualViolence
comment: Sexual acts or attempts to coerce sexual acts that involve the use of non-consensual violence. This term encompasses sexual assault, rape, and sexual abuse.
comment: Actos sexuales o intentos de coercer a actos sexuales que impliquen el uso de violencia no consentida. Este término abarca la agresión sexual, la violación y el abuso sexual.
change note: Version 4.2.0
in scheme: v3
narrower: Corrective rape
narrower: LGBTQ+ domestic violence
narrower: LGBTQ+ sexual abuse
narrower: LGBTQ+ victims of rape
narrower: Sexual assault
narrower: Child sexual abuse content
preferred label: Violencia sexual
related: Anti-LGBTQ+ violence
related: Rape/non-con (Content warning)
related: Rape culture

Tops (Sex)
type: Concept
issued: 2019-05-14
modified: 2025-02-23
replaces: tops
comment: Slang term for individuals who act as the giving partner in sexual encounters.
comment: Término de la jerga para personas que asumen el rol de pareja que da en encuentros sexuales.
alternative label: Pitchers (Sex)
alternative label: Pitchers
alternative label: Tops
alternative label: Activo
broader: Sexual identity
broader: Sexual roles
change note: Version 4.2.0
has top concept: Sexual identity
in scheme: v3
narrower: LGBTQ+ mistresses (BDSM culture)
preferred label: Tops (sexo)
related: Kink community
related: Bottoms (Sex)
related: LGBTQ+ dominants
related: Social privilege
related: LGBTQ+ submissives
related: Switches (Sex)
related: Vers (Sex)
related: Seme (Yaoi)
related: Power exchange
related: Kinky people

Racism
type: Concept
issued: 2022-06-15
modified: 2025-02-23
comment: The belief that groups of human beings possess different inherent behavioral traits that correspond to inherited attributes and can be divided based on the superiority of one race over another. This term also encompasses prejudice, discrimination, and antagonism (whether personal or systematic) directed against other people because of their race and its perceived inferiority.
comment: La creencia de que grupos de seres humanos poseen diferentes rasgos de comportamiento inherentes que corresponden a atributos heredados y que pueden dividirse en función de la superioridad de una raza sobre otra. Este término también abarca prejuicios, discriminación y antagonismo (ya sea personal o sistemático) dirigido contra otras personas debido a su raza y su percibida inferioridad.
change note: Version 4.2.0
in scheme: v3
narrower: Racism in fandom
narrower: Anti-Blackness
preferred label: Racismo
related: Critical race theory
related: Transmisogynoir
related: Misogynoir
related: Anti-racism
related: Black feminism
related: White feminism
related: Womanism
related: Gentrification
related: Redlining

LGBTQ+ erotic art
type: Concept
issued: 2023-04-12
modified: 2025-02-23
comment: Umbrella term for different forms of creative activity dealing with or engaging with erotic themes, including visual, material, and performing art, by LGBTQ+ artists or about LGBTQ+ topics and communities. Use a more specific term if possible.
comment: Término general para diferentes formas de actividad creativa que tratan o interactúan con temas eróticos, incluido el arte visual, material y escénico, por parte de artistas LGBTQ+ o sobre temas y comunidades LGBTQ+. Utilícese un término más específico de ser posible.
broader: LGBTQ+ arts
change note: Version 4.2.0
has top concept: Subcultures
in scheme: v3
narrower: LGBTQ+ porn films
narrower: Lesbian erotic art
narrower: Gay erotic art
narrower: Bisexual erotic art
narrower: Transgender erotic art
narrower: Queer erotic art
narrower: Intersex erotic art
narrower: Aromantic erotic art
narrower: Asexual erotic art
narrower: Demisexual erotic art
preferred label: Arte erótico LGBTQ+
related: Nude art
related: LGBTQ+ erotic films
related: Two-Spirit erotic art

Māhū fiction
type: Concept
issued: 2023-06-23
modified: 2026-02-23
comment: Written works describing imagined events or people; use in reference to fictional works focusing on Māhū characters or themes.
comment: Obras escritas que describen eventos o personas imaginadas; utilícese en referencia a obras de ficción que se centran en personajes o temas māhū.
alternative label: Mahu fiction
change note: Version 4.2.0
in scheme: v3
narrower: Māhū fantasy fiction
narrower: Māhū horror fiction
narrower: Māhū mystery and detective fiction
narrower: Māhū romance fiction
narrower: Māhū science fiction
narrower: Māhū historical fiction
preferred label: Ficción māhū
related: LGBTQ+ fiction

LGBTQ+ alumni groups
type: Concept
issued: 2023-12-05
modified: 2025-02-23
comment: Alumni groups or associations whose membership is specifically comprised of LGBTQ+ former students of the same university, college, or school
comment: Grupos o asociaciones de ex estudiantes cuya membresía esté compuesta específicamente por ex estudiantes LGBTQ+ de la misma universidad, colegio o escuela.
alternative label: LGBTQ+ alumni associations
alternative label: Agrupaciones de ex estudiantes LGBTQ+
alternative label: Asociaciones de ex estudiantes LGBTQ+
broader: LGBTQ+ communities
change note: Version 4.2.0
has top concept: LGBTQ+ communities
in scheme: v3
preferred label: Grupos de ex estudiantes LGBTQ+
related: Aromantic college students
related: Asexual college students
related: Bisexual college students
related: Demisexual college students
related: Gay college students
related: Greyromantic college students
related: Intersex college students
related: Lesbian college students
related: Megasexual college students
related: Non-binary college students
related: Queer college students
related: Transgender college students
related: Two-Spirit college students

LGBTQ+ college students
type: Concept
issued: 2023-12-05
modified: 2025-02-23
comment: LGBTQ+ people who are attending college.
comment: Personas LGBTQ+ que asisten a la universidad.
alternative label: LGBT college students
alternative label: Estudiantes universitarios LGBTQ
broader: LGBTQ+ students
change note: Version 4.2.0
has top concept: LGBTQ+ people
in scheme: v3
narrower: Aromantic college students
narrower: Asexual college students
narrower: Bisexual college students
narrower: Demisexual college students
narrower: Gay college students
narrower: Greyromantic college students
narrower: Intersex college students
narrower: Lesbian college students
narrower: Megasexual college students
narrower: Non-binary college students
narrower: Queer college students
narrower: Transgender college students
preferred label: Estudiantes universitarios LGBTQ+
related: Two-Spirit college students

Kinky people
type: Concept
issued: 2023-12-18
modified: 2025-02-23
comment: People who participate in kink and/or power exchange relationships.
comment: Personas que participan en relaciones kinki o de intercambio de poder.
alternative label: BDSMers
alternative label: Fetishists
alternative label: Kinksters
alternative label: Sadomasochists
broader: Sexual identity
broader: Sexual minorities
change note: Version 4.2.0
has top concept: Sexual identity
in scheme: v3
narrower: LGBTQ+ dominatrices
narrower: LGBTQ+ dominants
narrower: LGBTQ+ submissives
preferred label: Personas kinky
related: Sadomasochism
related: Kink community
related: Bottoms (Sex)
related: BDSM
related: Leather community
related: Tops (Sex)
related: Power exchange
related: Leather people
related: Anti-kink discrimination

LGBTQ+ urban fantasy fiction
type: Concept
issued: 2024-01-17
modified: 2025-02-23
comment: A subgenre of fantasy fiction featuring magic and supernatural creatures in contemporary urban settings; use for urban fantasy focusing on LGBTQ+ characters or themes.
comment: Un subgénero de la ficción fantástica que presenta a criaturas mágicas y sobrenaturales en entornos urbanos contemporáneos; utilícese para la ficción fantástica urbana centrada en personajes o temas LGBTQ+.
broader: LGBTQ+ fantasy fiction
change note: Version 4.2.0
has top concept: Subcultures
in scheme: v3
narrower: Gay urban fantasy fiction
narrower: Lesbian urban fantasy fiction
narrower: Bisexual urban fantasy fiction
narrower: Queer urban fantasy fiction
narrower: Transgender urban fantasy fiction
narrower: Asexual urban fantasy fiction
narrower: Aromantic urban fantasy fiction
narrower: Megasexual urban fantasy fiction
narrower: Demisexual urban fantasy fiction
narrower: Intersex urban fantasy fiction
narrower: Non-binary urban fantasy fiction
narrower: Greyromantic urban fantasy fiction
preferred label: Ficción fantástica urbana LGBTQ+
related: Two-Spirit urban fantasy fiction

LGBTQ+ academics
type: Concept
issued: 2024-05-24
modified: 2025-02-23
comment: LGBTQ+ researchers and/or educators working in higher education.
alternative label: Academics (LGBTQ)
alternative label: LGBTQ+ college teachers
alternative label: LGBTQ+ professors
alternative label: LGBTQ+ researchers
broader: LGBTQ+ people
change note: Version 4.2.0
has top concept: LGBTQ+ people
in scheme: v3
narrower: Aromantic academics
narrower: Asexual academics
narrower: Bisexual academics
narrower: Demisexual academics
narrower: Gay academics
narrower: Greyromantic academics
narrower: Intersex academics
narrower: Lesbian academics
narrower: Megasexual academics
narrower: Non-binary academics
narrower: Queer academics
narrower: Transgender academics
related: Two-Spirit academics

South American Indigenous LGBTQ+ people
type: Concept
issued: 2024-06-10
modified: 2025-04-23
comment: People who are part of the Native peoples of South America and self-identify as LGBTQ. Use more specific terms when available.
alternative label: Indigenous South American LGBTQ+ people
alternative label: LGBTQ+ South American Indigenous people
alternative label: LGBTQ+ South American Native people
alternative label: South American Indigenous people (LGBTQ)
alternative label: South American Native LGBTQ+ people
alternative label: South American Native people (LGBTQ)
broader: Indigenous LGBTQ+ people
change note: Version 4.2.0
has top concept: LGBTQ+ people
in scheme: v3
narrower: South American Indigenous asexual people
narrower: South American Indigenous bisexual people
narrower: South American Indigenous gay men
narrower: South American Indigenous intersex people
narrower: South American Indigenous lesbians
narrower: South American Indigenous queer people
narrower: South American Indigenous non-binary people
narrower: South American Indigenous transgender people
narrower: South American Indigenous demisexual people
narrower: South American Indigenous megasexual people
narrower: South American Indigenous greyromantic people
narrower: South American Indigenous aromantic people
related: Warmipangui

LGBTQ+ photographers
type: Concept
issued: 2024-07-31
modified: 2025-02-23
comment: LGBTQ+ people who take photographs, either professionally or as a hobby.
alternative label: LGBTQ photographers
alternative label: Photographers (LGBTQ)
broader: LGBTQ+ artists
change note: Version 4.2.0
has top concept: LGBTQ+ people
in scheme: v3
narrower: Lesbian photographers
narrower: Gay photographers
narrower: Bisexual photographers
narrower: Transgender photographers
narrower: Queer photographers
narrower: Intersex photographers
narrower: Non-binary photographers
narrower: Aromantic photographers
narrower: Asexual photographers
narrower: Demisexual photographers
narrower: Greyromantic photographers
narrower: Megasexual photographers
related: Two-Spirit photographers

LGBTQ+ youth survivors of bullying
type: Concept
issued: 2024-07-31
modified: 2025-04-29
comment: LGBTQ+ youth between the ages of 12-18 who have experienced and survived bullying due to their gender or sexual identity. Follow the individual's preference for "victims" or "survivors" whenever possible.
alternative label: Survivors of bullying (LGBTQ+)
broader: LGBTQ+ youth
broader: LGBTQ+ survivors of bullying
change note: Version 4.2.0
has top concept: Youth
in scheme: v3
narrower: Gay youth survivors of bullying
narrower: Lesbian youth survivors of bullying
narrower: Bisexual youth survivors of bullying
narrower: Queer youth survivors of bullying
narrower: Intersex youth survivors of bullying
narrower: Non-binary youth survivors of bullying
narrower: Transgender youth survivors of bullying
narrower: Asexual youth survivors of bullying
narrower: Aromantic youth survivors of bullying
narrower: Greyromantic youth survivors of bullying
related: Two-Spirit youth survivors of bullying
related: Social work with LGBTQ+ youth

LGBTQ+ painters
type: Concept
issued: 2024-07-31
modified: 2025-02-23
comment: LGBTQ+ people who paint, either professionally or as a hobby.
alternative label: Painters (LGBTQ)
broader: LGBTQ+ artists
change note: Version 4.2.0
has top concept: LGBTQ+ people
in scheme: v3
narrower: Queer painters
narrower: Intersex painters
narrower: Non-binary painters
narrower: Aromantic painters
narrower: Asexual painters
narrower: Demisexual painters
narrower: Greyromantic painters
narrower: Megasexual painters
narrower: Gay painters
narrower: Lesbian painters
narrower: Bisexual painters
narrower: Transgender painters
related: Two-Spirit painters

LGBTQ+ scientists
type: Concept
issued: 2024-10-22
modified: 2025-02-23
comment: LGBTQ+ people who either study or have expert knowledge in one of the fields of the physical and/or natural sciences, including but not limited to chemists, biologists, physicists, psychologists, and multidisciplinary researchers.
alternative label: Scientists (LGBTQ+)
broader: LGBTQ+ people
change note: Version 4.2.0
has top concept: LGBTQ+ people
in scheme: v3
narrower: Lesbian scientists
narrower: Gay scientists
narrower: Bisexual scientists
narrower: Transgender scientists
narrower: Queer scientists
narrower: Intersex scientists
narrower: Asexual scientists
narrower: Aromantic scientists
narrower: Non-binary scientists
narrower: Greyromantic scientists
narrower: Demisexual scientists
narrower: Megasexual scientists
related: Two-Spirit scientists

LGBTQ+ poets
type: Concept
issued: 2024-10-22
modified: 2025-02-23
comment: Creators of written or spoken verse who identify as LGBTQ+.
alternative label: Poets (LGBTQ)
broader: LGBTQ+ authors
change note: Version 4.2.0
has top concept: LGBTQ+ people
in scheme: v3
narrower: Lesbian poets
narrower: Gay poets
narrower: Bisexual poets
narrower: Transgender poets
narrower: Queer poets
narrower: Non-binary poets
narrower: Intersex poets
narrower: Asexual poets
narrower: Aromantic poets
narrower: Demisexual poets
narrower: Greyromantic poets
narrower: Megasexual poets
related: Two-Spirit poets

LGBTQ+ documentaries
type: Concept
issued: 2024-10-23
modified: 2025-02-23
comment: Non-fictional films that center LGBTQ+ people or topics, created for the purposes of education, advocacy, or personal expression.
alternative label: Documentaries (LGBTQ)
alternative label: LGBTQ+ documentary films
alternative label: Documentary films (LGBTQ)
broader: LGBTQ+ films
change note: Version 4.2.0
has top concept: Subcultures
in scheme: v3
narrower: Lesbian documentaries
narrower: Gay documentaries
narrower: Bisexual documentaries
narrower: Transgender documentaries
narrower: Queer documentaries
narrower: Non-binary documentaries
narrower: Intersex documentaries
narrower: Asexual documentaries
narrower: Aromantic documentaries
narrower: Demisexual documentaries
narrower: Greyromantic documentaries
narrower: Megasexual documentaries
related: Two-Spirit documentaries

LGBTQ+ studies
type: Concept
issued: 2026-02-24
modified: 2026-02-27
comment: Academic field of research and study about LGBTQ+ people, LGBTQ+ identities, and LGBTQ+ communities.
change note: Version 4.2.0
in scheme: v4
narrower: Gay studies
narrower: Lesbian studies
narrower: Bisexual studies
narrower: Asexual studies
narrower: Intersex studies
narrower: Transgender studies
narrower: Queer studies
related: Two-Spirit studies
related: Gender studies
related: Sexual studies

Hate crimes
type: Concept
issued: 2019-05-14
modified: 2025-02-23
replaces: hateCrimes
comment: Criminal acts motivated by the victim’s actual or perceived race, nationality, religion, sexual identity, gender identity, or ability status.
comment: Actos delictivos motivados por la raza, nacionalidad, religión, identidad sexual, identidad de género o estado de capacidad real o percibido de la víctima.
alternative label: Bias-related crimes
change note: Version 4.2.0
in scheme: v3
preferred label: Crímenes de odio
related: Anti-bisexual violence
related: Anti-gay violence
related: Anti-lesbian violence
related: Anti-queer violence
related: Anti-transgender violence
related: Intolerance towards LGBTQ+ people
related: Hate speech
related: LGBTQ+ victims of hate crimes
related: Murders of LGBTQ+ people
related: Anti-Two-Spirit violence
related: Anti-intersex violence
related: Anti-asexual violence
related: Anti-sex worker violence
related: Murder of sex workers

Lesbian movement
type: Concept
issued: 2019-05-14
modified: 2025-04-17
replaces: lesbianMovement
comment: Umbrella term for activism focused on the rights of lesbians and issues faced by lesbian communities.
comment: Término general para el activismo centrado en los derechos de las lesbianas y los problemas que enfrentan las comunidades de lesbianas.
alternative label: Lesbian organisations
alternative label: Lesbian organizations
alternative label: Organizaciones lesbianas
alternative label: Organizaciones lésbicas||
broader: LGBTQ+ movement
change note: Version 4.2.0
has top concept: Social movements
in scheme: v3
narrower: Lesbian trade union groups
preferred label: Movimiento lésbico
related: Women's movement
related: Gay liberation
related: Lesbian community centers
related: Lesbian information centers
related: Lesbian feminism
related: Lesbian land
related: Lesbian nation
related: Lesbian press
related: Lesbian radio
related: Lesbian television
related: Lesbian feminists
related: Lesbian demonstrations

LGBTQ+ mystery and detective fiction
type: Concept
issued: 2019-05-14
modified: 2025-02-23
replaces: mysteryAndDetectiveFictionLGBTQ
comment: Written literary works about the investigation of crime or the work of detectives; use in reference to mystery and detective fiction focusing on LGBTQ+ characters and themes.
comment: Obras literarias escritas sobre la investigación de crímenes o el trabajo de detectives; utilícese en referencia a la ficción de misterio y de detectives centrada en personajes y temas LGBTQ+.
alternative label: Mystery and detective fiction (LGBTQ)
broader: LGBTQ+ fiction
change note: Version 4.2.0
has top concept: Subcultures
in scheme: v3
narrower: Lesbian mystery and detective fiction
narrower: Gay mystery and detective fiction
narrower: Bisexual mystery and detective fiction
narrower: Transgender mystery and detective fiction
narrower: Queer mystery and detective fiction
narrower: Asexual mystery and detective fiction
narrower: Demisexual mystery and detective fiction
narrower: Aromantic mystery and detective fiction
narrower: Intersex mystery and detective fiction
narrower: Megasexual mystery and detective fiction
narrower: Greyromantic mystery and detective fiction
narrower: Non-binary mystery and detective fiction
preferred label: Ficción LGBTQ+ de misterio y de detectives
related: Māhū mystery and detective fiction
related: Two-Spirit mystery and detective fiction

LGBTQ+ personal and family law
type: Concept
issued: 2019-05-14
modified: 2025-03-20
replaces: LGBTQPersonalAndFamilyLaw
comment: Legal regulations and laws addressing changes to LGBTQ people’s legal names or gender markers, as well as LGBTQ people’s family relationships, including cohabitation, marriage, adoption, parent-child relationships, divorce, and child custody.
comment: Regulaciones legales y leyes que abordan cambios en los nombres legales o marcadores de género de las personas LGBTQ, así como en las relaciones familiares de las personas LGBTQ, incluida la cohabitación, el matrimonio, la adopción, las relaciones entre padres e hijos, el divorcio y la custodia de los hijos.
alternative label: LGBTQ personal and family law
alternative label: Leyes personales y familiares LGBTQ
broader: Law
change note: Version 4.2.0
has top concept: Law
in scheme: v3
narrower: Legal name change
narrower: Marriage law
preferred label: Derecho personal y familiar LGBTQ+
related: Birth certificate amendments
related: Child custody
related: Civil unions
related: Second parent adoption
related: Domestic partnership contracts
related: Domestic partnership retirement benefits
related: Donors
related: Intimate partner violence
related: LGBTQ+ adoption
related: LGBTQ+ adoptive parenthood
related: Official documentation
related: Parental rights

LGBTQ+ social media
type: Concept
issued: 2019-05-14
modified: 2025-03-20
replaces: LGBTQSocialMedia
comment: Web-based and mobile technologies that facilitate interactive dialogue, as used by or designed for LGBTQ+ people.
comment: Tecnologías móviles y basadas en la web que facilitan el diálogo interactivo, tal como las utilizan o están diseñadas para personas LGBTQ+.
alternative label: LGBTQ social media
alternative label: Redes sociales LGBTQ
change note: Version 4.2.0
in scheme: v3
narrower: Blogs
narrower: Chatrooms
narrower: Dating applications
narrower: Internet forums
preferred label: Redes sociales LGBTQ+
related: LGBTQ+ meeting places
related: LGBTQ+ websites
related: LGBTQ+ vlogs

LGBTQ+ victims of rape
type: Concept
issued: 2019-05-14
modified: 2025-02-23
replaces: victimsOfRapeLGBTQ
comment: LGBTQ+ people who have experienced rape and may or may not have survived; follow the individual's preference for "victims" or "survivors" whenever possible.
comment: Personas LGBTQ+ que han sufrido una violación y pueden o no haber sobrevivido; siga la preferencia de la persona sobre el uso de "víctimas" o "sobrevivientes" siempre que sea posible.
alternative label: LGBTQ victims of rape
alternative label: Rape victims (LGBTQ)
alternative label: Victims of rape (LGBTQ)
broader: LGBTQ+ victims of crime
broader: LGBTQ+ victims of sexual abuse
broader: Sexual violence
change note: Version 4.2.0
has top concept: LGBTQ+ people
in scheme: v3
narrower: Bisexual victims of rape
narrower: Gay victims of rape
narrower: Lesbian victims of rape
narrower: Queer victims of rape
narrower: LGBTQ+ survivors of rape
narrower: Transgender victims of rape
narrower: Asexual victims of rape
preferred label: Víctimas LGBTQ+ de violación
related: Anti-LGBTQ+ violence
related: Consent
related: Sexually abused LGBTQ+ children
related: Rape/non-con (Content warning)
related: Two-Spirit victims of rape

Native American LGBTQ+ people
type: Concept
issued: 2019-05-14
modified: 2025-02-23
replaces: nativeAmericansLGBTQ
comment: People who are part of the Native peoples of the continental United States and Canada (excluding Inuit people) and self-identity as LGBTQ+. Use more specific terms when available.
comment: Personas LGBTQ+ que son nativoamericanas o parte de los pueblos indígenas de Norteamérica; utilícese únicamente para personas que se autoidentifiquen como nativoamericanas y LGBTQ+.
alternative label: American Indians (LGBTQ)
alternative label: Native Americans (LGBTQ)
alternative label: American Indian LGBTQ+ people
alternative label: LGBTQ+ American Indians
alternative label: LGBTQ+ Native Americans
alternative label: Personas nativoamericanas LGBTQ+
broader: Indigenous LGBTQ+ people
change note: Version 4.2.0
has top concept: LGBTQ+ people
in scheme: v3
narrower: Native American bisexual people
narrower: Native American gay men
narrower: Native American lesbians
narrower: Native American queer people
narrower: Native American transgender people
narrower: Native American asexual people
narrower: Native American intersex people
narrower: Native American non-binary people
preferred label: Personas LGBTQ+ nativoamericanas
related: Berdache
related: Two-Spirit people
related: Indigiqueer people
related: Indigiqueer
related: Two-Spirit identity

Non-binary people
type: Concept
issued: 2019-05-14
modified: 2025-02-23
replaces: nonBinaryPeople
comment: Individuals whose gender identity exists outside of the gender binary; only use to describe individuals who self-identify as non-binary.
comment: Personas cuya identidad de género existe fuera del binario de género; utilícese únicamente para describir a personas que se autoidentifiquen como no binarias.
alternative label: Nonbinary people
alternative label: Enbies
alternative label: NB-ies
alternative label: No binarios
broader: Transgender people
change note: Version 4.2.0
has top concept: LGBTQ+ people
in scheme: v3
narrower: Non-binary youth
narrower: Non-binary parents
narrower: Non-binary college students
narrower: Pregnant non-binary people
preferred label: Personas no binarias
related: Agender people
related: Androgynous people
related: Gender diversity
related: Gender identity
related: Demigirls
related: Demiboys
related: Xenogender identity
related: Xenogender people
related: Non-binary identity
related: Non-binary people in fandom

Secrecy
type: Concept
issued: 2019-05-14
modified: 2025-02-23
replaces: secrecy
comment: The state of being intentionally withheld, concealed, or kept secret; use in reference to LGBTQ+ individuals who conceal their (or others’) identities, whether out of preference or for safety reasons.
comment: El estado retener(se), ocultar(se) o mantener(se) en secreto intencionalmente; utilícese en referencia a personas LGBTQ+ que ocultan sus identidades (o las de otras personas), ya sea por preferencia o por razones de seguridad.
alternative label: Secretismo
change note: Version 4.2.0
in scheme: v3
preferred label: Discreción
related: Closeted bisexual people
related: Closeted gay men
related: Closeted lesbians
related: Stealth (Transgender)
related: Coming out
related: Down-low
related: Outing (LGBTQ+ culture)
related: Closeted LGBTQ+ people
related: Closeted transgender people
related: Closeted queer people
related: Closeted intersex people
related: Closeted Two-Spirit people
related: Beards (Gay culture)
related: Closeted asexual people

Sex assigned at birth
type: Concept
issued: 2019-05-14
modified: 2025-02-23
replaces: sexAssignedAtBirth
comment: The process of determining an individual’s sex relatively shortly after birth, usually documented on official records, such as a birth certificate. Determination is usually based on the appearance of external genitalia but may use other methodologies. In practice, sex assigned at birth is often culturally variable; the term “gender assigned at birth” is often more applicable or accurate.
comment: El proceso de determinar el sexo de una persona relativamente poco después del nacimiento, generalmente documentado en registros oficiales, como un certificado de nacimiento. La determinación suele basarse en la apariencia de los genitales externos, pero puede utilizar otras metodologías. En la práctica, el sexo asignado al nacer suele variar culturalmente; el término “género asignado al nacer” suele ser más aplicable o preciso.
alternative label: Birth sex
alternative label: Birth-assigned sex
alternative label: Natal sex
alternative label: Sex at birth
alternative label: Sex reported at birth
alternative label: ASAB
alternative label: SAAB
alternative label: Asignación de sexo
alternative label: Sexo al nacer
broader: Assigned sex
change note: Version 4.2.0
has top concept: Sex (Body)
in scheme: v3
narrower: Assigned female at birth
narrower: Assigned male at birth
narrower: Assigned X at birth
preferred label: Sexo asignado al nacer
related: Gender assigned at birth
related: Genitals
related: Gonads
related: Intersex children
related: Intersex variations
related: Intersex genital mutilation
related: Medicalization
related: Penis
related: Vagina
related: Endosex
related: Endosex people

Transitioning status
type: Concept
issued: 2019-05-14
modified: 2026-02-23
replaces: transitioningStatus
comment: Term used to describe a person’s current status in their gender transition.
comment: Término utilizado para describir el estado actual de una persona en su transición de género.
broader: Transitioning (Gender)
change note: Version 4.2.0
has top concept: Transitioning (Gender)
in scheme: v3
narrower: No hormone identity
narrower: Non-operative
narrower: Post-operative
narrower: Pre-operative
preferred label: Estado de transición
related: Gender-affirming surgery
related: Transgender people
related: Transsexual people
related: Detransitioning
related: Retransitioning
related: Desistance (Gender)
related: Facial gender affirming surgery
related: Facial masculinization surgery
related: Facial feminization surgery
related: Detrans people

LGBTQ+ youth literature
type: Concept
issued: 2019-05-14
modified: 2025-02-23
replaces: youthLiteratureLGBTQ
comment: Written literary works for an audience of readers from 12-18 years of age, also known as young adult literature or YA; use in reference to youth literature focusing on LGBTQ+ characters or themes.
comment: Obras literarias escritas para una audiencia de lectores de 12 a 18 años de edad, también conocidas como literatura para adultos jóvenes o YA (por sus siglas en inglés); utilícese en referencia a la literatura juvenil centrada en personajes o temas LGBTQ+.
alternative label: Young adult literature (LGBTQ)
alternative label: Youth literature (LGBTQ)
broader: LGBTQ+ literature
change note: Version 4.2.0
has top concept: Subcultures
in scheme: v3
narrower: Bisexual youth literature
narrower: Gay youth literature
narrower: Lesbian youth literature
narrower: Queer youth literature
narrower: Transgender youth literature
narrower: Aromantic youth literature
narrower: Asexual youth literature
narrower: Demisexual youth literature
narrower: Megasexual youth literature
narrower: Greyromantic youth literature
narrower: Intersex youth literature
preferred label: Literatura juvenil LGBTQ+
related: LGBTQ+ youth
related: LGBTQ+ fanfiction
related: Two-Spirit youth literature

LGBTQ+ horror fiction
type: Concept
issued: 2020-06-03
modified: 2025-02-23
replaces: horrorFictionLGBTQ
comment: Written works of fiction intended to frighten, scare, or disgust; use in reference to horror fiction focusing on LGBTQ+ characters or themes.
comment: Obras de ficción escritas con la intención de asustar, atemorizar o provocar disgusto; utilícese en referencia a la ficción de horror centrada en personajes o temas LGBTQ+.
alternative label: Horror fiction (LGBTQ)
alternative label: Ficción de horror (LGBTQ)
broader: LGBTQ+ fiction
change note: Version 4.2.0
has top concept: Subcultures
in scheme: v3
narrower: Lesbian horror fiction
narrower: Gay horror fiction
narrower: Bisexual horror fiction
narrower: Transgender horror fiction
narrower: Queer horror fiction
narrower: Demisexual horror fiction
narrower: Aromantic horror fiction
narrower: Intersex horror fiction
narrower: Asexual horror fiction
narrower: Megasexual horror fiction
narrower: Greyromantic horror fiction
narrower: Non-binary horror fiction
preferred label: Ficción de horror LGBTQ+
related: Māhū horror fiction
related: Two-Spirit horror fiction

LGBTQ+ romance fiction
type: Concept
issued: 2020-06-03
modified: 2025-02-23
replaces: romanceFictionLGBTQ
comment: Works of fiction revolving around romantic and/or sexual relationships between the main characters; use in reference to romance fiction focusing on LGBTQ+ characters.
comment: Obras de ficción que giran en torno a relaciones románticas y/o sexuales entre los personajes principales; utilícese en referencia a la ficción romántica centrada en personajes LGBTQ+.
alternative label: Romance fiction (LGBTQ)
alternative label: Ficción romántica (LGBTQ)
broader: LGBTQ+ fiction
change note: Version 4.2.0
has top concept: Subcultures
in scheme: v3
narrower: Lesbian romance fiction
narrower: Gay romance fiction
narrower: Bisexual romance fiction
narrower: Transgender romance fiction
narrower: Queer romance fiction
narrower: Asexual romance fiction
narrower: Aromantic romance fiction
narrower: Intersex romance fiction
narrower: Demisexual romance fiction
narrower: Megasexual romance fiction
narrower: Greyromantic romance fiction
narrower: Non-binary romance fiction
preferred label: Ficción romántica LGBTQ+
related: Māhū romance fiction
related: Two-Spirit romance fiction

LGBTQ+ short stories
type: Concept
issued: 2020-06-03
modified: 2025-02-23
replaces: shortStoriesLGBTQ
comment: Written literary works that are short in length and detail a self-contained incident or concept; use in reference to short stories focusing on LGBTQ+ characters or themes.
comment: Obras literarias escritas que son breves y detallan un incidente o concepto autónomo; utilícese en referencia a cuentos cortos que se centren en personajes o temas LGBTQ+.
alternative label: Short stories (LGBTQ)
alternative label: Cuentos cortos (LGBTQ)
alternative label: Relatos LGBTQ+
alternative label: Relatos (LGBTQ)
broader: LGBTQ+ fiction
change note: Version 4.2.0
has top concept: Subcultures
in scheme: v3
narrower: Lesbian short stories
narrower: Gay short stories
narrower: Bisexual short stories
narrower: Transgender short stories
narrower: Queer short stories
narrower: Asexual short stories
narrower: Aromantic short stories
narrower: Intersex short stories
narrower: Demisexual short stories
narrower: Megasexual short stories
narrower: Greyromantic short stories
narrower: Non-binary short stories
preferred label: Cuentos cortos LGBTQ+
related: Māhū short stories
related: Two-Spirit short stories

Romantic minorities
type: Concept
issued: 2022-02-14
modified: 2025-02-23
comment: Individuals whose romantic orientations and/or practices differ from those of the dominant culture.
comment: Personas cuyas orientaciones y/o prácticas románticas difieren de las de la cultura dominante.
change note: Version 4.2.0
in scheme: v3
narrower: Aromantic people
narrower: Biromantic people
narrower: Homoromantic people
narrower: Panromantic people
narrower: Demiromantic people
narrower: Greyromantic people
preferred label: Minorías románticas
related: Sexual minorities
related: Relationship minorities
related: Gender minorities
related: Romantic orientation

LGBTQ+ victims of bullying
type: Concept
issued: 2022-05-11
modified: 2026-02-24
comment: LGBTQ+ people who have experienced bullying due to their gender or sexual identity and may or may not have survived; follow the individual's preference for "victims" or "survivors" whenever possible.
comment: Personas LGBTQ+ que han sufrido acoso debido a su género o identidad sexual y pueden o no haber sobrevivido; siga la preferencia de la persona sobre el uso de "víctimas" o "sobrevivientes" siempre que sea posible.
alternative label: Victims of bullying (LGBTQ)
broader: LGBTQ+ people
change note: Version 4.2.0
has top concept: LGBTQ+ people
in scheme: v3
narrower: Lesbian victims of bullying
narrower: Gay victims of bullying
narrower: Bisexual victims of bullying
narrower: Transgender victims of bullying
narrower: Queer victims of bullying
narrower: Asexual victims of bullying
narrower: Intersex victims of bullying
narrower: LGBTQ+ survivors of bullying
narrower: LGBTQ+ youth victims of bullying
narrower: LGBTQ+ victims of cyberbullying
narrower: Non-binary victims of bullying
preferred label: Víctimas LGBTQ+ de acoso
related: Bullying
related: Two-Spirit victims of bullying
related: Two-Spirit youth victims of bullying

LGBTQ+ people in fandom
type: Concept
issued: 2022-07-04
modified: 2025-02-23
comment: The participation and inclusion of LGBTQ+ people in fan communities.
comment: La participación e inclusión de personas LGBTQ+ en las comunidades de fans.
alternative label: LGBTQ+ people in fan communities
alternative label: People in fandom (LGBTQ)
broader: LGBTQ+ people
broader: Fandom
change note: Version 4.2.0
has top concept: LGBTQ+ people
in scheme: v3
narrower: Aromantic people in fandom
narrower: Asexual people in fandom
narrower: Bisexual people in fandom
narrower: Gay men in fandom
narrower: Intersex people in fandom
narrower: Lesbians in fandom
narrower: Non-binary people in fandom
narrower: Queer people in fandom
narrower: Transgender people in fandom
preferred label: Personas LGBTQ+ en fandom
related: Homophobia in fandom
related: Kink in fandom
related: Transphobia in fandom
related: Two-Spirit people in fandom

LGBTQ+ youth victims of bullying
type: Concept
issued: 2024-07-31
modified: 2025-04-29
comment: LGBTQ+ youth between the ages of 12-18 who have experienced bullying due to their gender or sexual identity and may or may not have survived; follow the individual's preference for "victims" or "survivors" whenever possible.
broader: LGBTQ+ youth
broader: LGBTQ+ victims of bullying
change note: Version 4.2.0
has top concept: Youth
in scheme: v3
narrower: Asexual victims of bullying
narrower: Gay youth victims of bullying
narrower: Lesbian youth victims of bullying
narrower: Bisexual youth victims of bullying
narrower: Queer youth victims of bullying
narrower: Intersex youth victims of bullying
narrower: Non-binary youth victims of bullying
narrower: Transgender youth victims of bullying
narrower: Asexual youth victims of bullying
narrower: Aromantic youth victims of bullying
narrower: Greyromantic youth victims of bullying
related: Two-Spirit youth victims of bullying
related: Social work with LGBTQ+ youth

LGBTQ+ television personalities
type: Concept
issued: 2024-10-22
modified: 2025-03-20
comment: LGBTQ+ people who are well-known to the public through their appearances on television shows, typically as themselves rather than in scripted roles.
alternative label: Television personalities (LGBTQ)
alternative label: LGBTQ+ TV personalities
alternative label: TV personalities (LGBTQ)
broader: LGBTQ+ people
broader: LGBTQ+ celebrities
change note: Version 4.2.0
has top concept: LGBTQ+ people
in scheme: v3
narrower: Lesbian television personalities
narrower: Gay television personalities
narrower: Bisexual television personalities
narrower: Transgender television personalities
narrower: Queer television personalities
narrower: Intersex television personalities
narrower: Asexual television personalities
narrower: Aromantic television personalities
narrower: Non-binary television personalities
narrower: Demisexual television personalities
narrower: Greyromantic television personalities
narrower: Megasexual television personalities
related: Two-Spirit television personalities

LGBTQ+ people's writings
type: Concept
issued: 2025-03-13
modified: 2025-03-13
comment: Written works created by LGBTQ+ people.
alternative label: Writings of LGBTQ+ people
broader: LGBTQ+ literature
change note: Version 4.2.0
has top concept: Subcultures
in scheme: v4
narrower: Lesbians' writings
narrower: Gay men's writings
narrower: Bisexual people's writings
narrower: Transgender people's writings
narrower: Queer people's writings
narrower: Intersex people's writings
narrower: Non-binary people's writings
narrower: Asexual people's writings
narrower: Aromantic people's writings
narrower: Demisexual people's writings
narrower: Greyromantic people's writings
narrower: Megasexual people's writings
related: LGBTQ+ authors
related: Two-Spirit people's writings

LGBTQ+ porn films
type: Concept
issued: 2019-05-14
modified: 2025-02-23
replaces: pornFilmsLGBTQ
comment: Erotic or sexually explicit films featuring LGBTQ+ people.
comment: Películas eróticas o sexualmente explícitas protagonizadas por personas LGBTQ+.
alternative label: Adult films (LGBTQ)
alternative label: Porn videos (LGBTQ)
alternative label: X-rated films (LGBTQ)
alternative label: Porn films (LGBTQ)
alternative label: Películas pornográficas LGBTQ+
broader: LGBTQ+ erotic art
broader: LGBTQ+ pornography
change note: Version 4.2.0
has top concept: Subcultures
in scheme: v3
narrower: Bisexual porn films
narrower: Gay porn films
narrower: Lesbian porn films
narrower: Queer porn films
narrower: Transgender porn films
narrower: Demisexual porn films
narrower: Non-binary porn films
preferred label: Películas porno LGBTQ+
related: Sex cinemas
related: LGBTQ+ films
related: Porn industry
related: LGBTQ+ erotic films
related: Two-Spirit porn films
related: Māhū porn films
related: LGBTQ+ porn stars

Butches
type: Concept
issued: 2019-05-14
modified: 2025-02-23
replaces: butches
comment: A masculine person of any gender, though this term is most commonly used in lesbian communities.
comment: Una persona masculina de cualquier género, aunque este término se usa más comúnmente en comunidades de lesbianas.
alternative label: Machonas
alternative label: Camioneras
alternative label: Camionas
broader: Gender roles
broader: Sexual identity
broader: Sexual roles
change note: Version 4.2.0
has top concept: Role behavior
in scheme: v3
preferred label: Marimacha
related: Bois
related: Butch-femme relationships
related: Dykes
related: Female masculinity
related: Femmes
related: Lesbians
related: Gender expression
related: Masculinities
related: Soft butches
related: Stone butches
related: Tomboys
related: Whakatane
related: Masculine of center

Coming out
type: Concept
issued: 2019-05-14
modified: 2025-02-23
replaces: comingOut
comment: Process of accepting and sharing one’s sexual or gender identity with oneself and/or others.
comment: Proceso de aceptar y compartir la propia identidad sexual o de género con uno mismo y/o con los demás.
alternative label: Salir del armario
change note: Version 4.2.0
in scheme: v3
preferred label: Salir del clóset
related: Baby dykes
related: Baby gays
related: Closeted bisexual people
related: Closeted gay men
related: Closeted lesbians
related: Stealth (Transgender)
related: Outing (LGBTQ+ culture)
related: Secrecy
related: Closeted LGBTQ+ people
related: Closeted transgender people
related: Closeted queer people
related: Closeted intersex people
related: Closeted Two-Spirit people
related: Closeted asexual people
related: Questioning

LGBTQ+ drama
type: Concept
issued: 2019-05-14
modified: 2025-02-23
replaces: dramaLGBTQ
comment: Works of fiction written to be performed; use in reference to dramatic works focusing on LGBTQ+ characters or themes.
comment: Obras de ficción escritas para ser puestas en escena; utilícese en referencia a obras dramáticas que se centran en personajes o temas LGBTQ+.
alternative label: Drama (LGBTQ)
broader: LGBTQ+ literature
change note: Version 4.2.0
has top concept: Subcultures
in scheme: v3
narrower: Bisexual drama
narrower: Gay drama
narrower: Lesbian drama
narrower: Queer drama
narrower: Transgender drama
narrower: Aromantic drama
narrower: Asexual drama
narrower: Demisexual drama
narrower: Megasexual drama
narrower: Greyromantic drama
narrower: Intersex drama
preferred label: Drama LGBTQ+
related: LGBTQ+ plays
related: LGBTQ+ theater
related: LGBTQ+ authors
related: Two-Spirit drama

Bottom surgery
type: Concept
issued: 2019-05-14
modified: 2025-02-23
replaces: genitalReconstructionSurgery
comment: Colloquial term for gender-affirming surgical alterations of the genitalia and/or reproductive organs.
comment: Término coloquial para las alteraciones quirúrgicas de los genitales y/o los órganos reproductivos que afirman el género.
alternative label: Genital reconstruction surgery
alternative label: Cirugía de reconstrucción genital
broader: Gender-affirming surgery
change note: Version 4.2.0
has top concept: Medical care
in scheme: v3
narrower: Hysterectomy
narrower: Orchiectomy
narrower: Penectomy
narrower: Clitoroplasty
narrower: Labiaplasty
narrower: Metoidioplasty
narrower: Scrotoplasty
narrower: Vaginectomy
narrower: Phalloplasty
narrower: Vaginoplasty
narrower: Gonadectomy
preferred label: Reconstrucción genital
related: Transitioning (Gender)
related: Top surgery
related: Intersex surgery

LGBTQ+ adoption
type: Concept
issued: 2019-05-14
modified: 2025-02-23
replaces: LGBTQAdoption
comment: Adoption of a child or children, either by legal or informal processes, by LGBTQ+ people.
comment: La adopción de un niño o niños, ya sea por procesos legales o informales, por personas LGBTQ+.
alternative label: LGBTQ adoption
alternative label: Adopción (LGBTQ)
broader: LGBTQ+ family planning
change note: Version 4.2.0
has top concept: LGBTQ+ family planning
in scheme: v3
narrower: Second parent adoption
narrower: LGBTQ+ adoptive parenthood
narrower: LGBTQ+ adoptive parents
narrower: LGBTQ+ birth parents
preferred label: Adopción LGBTQ+
related: Adoptive parenthood
related: Adoptive parents
related: Birth parents
related: Child custody
related: Children of LGBTQ+ people
related: LGBTQ+ families
related: LGBTQ+ adoptive families
related: LGBTQ+ foster families
related: LGBTQ+ parenthood
related: LGBTQ+ personal and family law
related: LGBTQ+ parents

LGBTQ+ graphic novels
type: Concept
issued: 2019-05-14
modified: 2025-03-13
replaces: LGBTQGraphicNovels
comment: Works consisting of sequential images often accompanied by text that generally contain stand-alone stories; used in reference to graphic novels focusing on LGBTQ+ characters or themes.
comment: Obras que consisten en imágenes secuenciales, a menudo acompañadas de texto, que generalmente contienen historias independientes; utilizado en referencia a novelas gráficas que se centran en personajes o temas LGBTQ+.
alternative label: LGBTQ graphic novels
broader: LGBTQ+ fiction
broader: LGBTQ+ comics
change note: Version 4.2.0
has top concept: Subcultures
in scheme: v3
narrower: Asexual graphic novels
narrower: Demisexual graphic novels
narrower: Aromantic graphic novels
narrower: Intersex graphic novels
narrower: Non-binary graphic novels
narrower: Gay graphic novels
narrower: Lesbian graphic novels
narrower: Bisexual graphic novels
narrower: Megasexual graphic novels
narrower: Transgender graphic novels
narrower: Queer graphic novels
preferred label: Novelas gráficas LGBTQ+
related: Māhū graphic novels
related: Two-Spirit graphic novels
related: LGBTQ+ cartoonists

LGBTQ+ symbols
type: Concept
issued: 2019-05-14
modified: 2025-02-23
replaces: LGBTQSymbols
comment: Characters, signs, or objects used to represent LGBTQ+ people, identities, communities, and/or specific historical events.
comment: Personajes, símbolos u objetos utilizados para representar personas, identidades, comunidades y/o eventos históricos específicos LGBTQ+.
alternative label: LGBTQ symbols
alternative label: Símbolos LGBTQ
change note: Version 4.2.0
in scheme: v3
narrower: Red ribbons (AIDS)
narrower: Freedom rings
narrower: Handkerchief codes
narrower: Labrys
narrower: Lambda
narrower: Pink triangles
narrower: LGBTQ+ pride flags
preferred label: Símbolos LGBTQ+

Medicalization
type: Concept
issued: 2019-05-14
modified: 2025-03-20
replaces: medicalisation
comment: Process by which human conditions and experiences come to be defined and treated as medical conditions and thus become the subject of medical study, diagnosis, prevention, and/or treatment. Use in reference to non-medical problems, such as LGBTQ+ identities and practices, that have been wrongly treated as medical issues.
comment: Proceso por el cual las condiciones y experiencias humanas pasan a definirse y tratarse como condiciones médicas y, por tanto, a convertirse en objeto de estudio, diagnóstico, prevención y/o tratamiento médico. Utilícese en referencia a problemas no médicos, tales como identidades y prácticas LGBTQ+, que han sido erróneamente tratadas como problemas médicos.
broader: Medical care
change note: Version 4.2.0
has top concept: Medical care
in scheme: v3
narrower: Eonism
narrower: Gender identity disorder
narrower: Intersex variations
narrower: Sexual inversion
narrower: Transgenderism
narrower: Transsexualism
narrower: Transvestism
narrower: Transmedicalism
preferred label: Medicalización
preferred label: Medicalisation
related: Anti-transgender discrimination
related: Disorders of sexual development
related: Gender dysphoria
related: Sex assigned at birth
related: Social constructionism
related: Early genital surgery model
related: Hopkins model

Males
type: Concept
is replaced by: homoit0001008
issued: 2019-05-14
modified: 2022-10-25
modified: 2025-02-23
replaces: males
replaces: men
comment: Adults who self-identify as men and understand their gender in terms of Western conceptions of manliness, maleness, and/or masculinity. The term has typically been defined as adult male humans, though not all men identify with the term "male" depending on the context in which it is used.
comment: Adultos que se identifican como hombres y que entienden su género en términos de las concepciones occidentales de ser hombre, lo masculino y/o la masculinidad. El término normalmente se ha definido como humanos masculinos adultos, aunque no todos los hombres se identifican con el término "masculino" según el contexto en el que se utiliza.
broader: Gender identity
change note: Version 4.2.0
has top concept: Gender
in scheme: v3
narrower: Bisexual men
narrower: Cisgender men
narrower: Gay men
narrower: Heterosexual men
narrower: Men who have sex with men
narrower: Trans men
narrower: MLM (Men Loving Men)
narrower: Pregnant men
preferred label: Men
preferred label: Hombres
related: Cisgender people
related: Non-Euro-American gender and sexual identities
related: Gender binaries
related: Transgender people
related: Females
related: Men in fandom

LGBTQ+ movement
type: Concept
issued: 2019-05-14
modified: 2026-02-24
replaces: movementLGBTQ
comment: Refers to various social and political movements aimed at securing equity and equal representation for LGBTQ+ people.
comment: Se refiere a varios movimientos sociales y políticos destinados a garantizar la equidad y la representación equitativa de las personas LGBTQ+.
alternative label: Movement (LGBTQ)
alternative label: Movimento (LGBTQ)
broader: Social movements
change note: Version 4.2.0
has top concept: Social movements
in scheme: v3
narrower: Bisexual movement
narrower: Gay movement
narrower: Intersex movement
narrower: Lesbian movement
narrower: Queer movement
narrower: Transgender movement
narrower: Asexual movement
narrower: Homophile movement
preferred label: Movimiento LGBTQ+
related: AIDS activists
related: LGBTQ+ civil rights
related: Gay-straight alliances
related: Zaps
related: Two-Spirit movement
related: LGBTQ+ philanthropy
related: LGBTQ+ demonstrations

LGBTQ+ partners
type: Concept
is replaced by: homoit0001083
issued: 2019-05-14
issued: 2020-06-03
modified: 2025-02-23
modified: 2022-08-15
replaces: partnersLGBTQ
replaces: LGBTQPartnersOfAlcoholics
comment: Gender-neutral term for sexual, romantic, or play partners who are also LGBTQ+.
comment: Término de género neutro para parejas sexuales, románticas o de juego que también son LGBTQ+.
alternative label: Partners (LGBTQ)
alternative label: LGBTQ partners of alcoholics
broader: LGBTQ+ families
broader: Partners
broader: LGBTQ+ people
change note: Version 4.2.0
has top concept: LGBTQ+ families
has top concept: LGBTQ+ people
in scheme: v3
narrower: LGBTQ+ ex-partners
narrower: Lesbian partners
narrower: Gay partners
narrower: Bisexual partners
narrower: Transgender partners
narrower: Queer partners
narrower: Asexual partners
narrower: Intersex partners
preferred label: Parejas LGBTQ+
preferred label: LGBTQ+ partners of alcoholics
related: LGBTQ+ couples
related: LGBTQ+ domestic violence
related: LGBTQ+ lovers
related: Relationship satisfaction
related: Alcoholics
related: LGBTQ+ people in Adult Children of Alcoholics

Penis
type: Concept
issued: 2019-05-14
modified: 2025-02-23
replaces: penises
comment: External genital organ.
comment: Órgano genital externo.
alternative label: Cock
alternative label: Dick
alternative label: Dong
alternative label: Penises
alternative label: Phallus
alternative label: Prick
alternative label: Wang
alternative label: Pito
alternative label: Pico
alternative label: Polla
alternative label: Bicho
alternative label: Falo
alternative label: Pipi
broader: Erogenous body parts
broader: Genitals
change note: Version 4.2.0
has top concept: Erogenous body parts
in scheme: v3
narrower: Neophallus
preferred label: Pene
related: Fellatio
related: Cock rings
related: Dildos
related: Erections
related: Packing (Phallus)
related: Penile plethysmography
related: Sex assigned at birth
related: Strap-on sex
related: Tucking (Phallus)
related: Packers (Phallus)
related: Metoidioplasty
related: Scrotoplasty
related: Phalloplasty

LGBTQ+ poetry
type: Concept
issued: 2019-05-14
modified: 2025-02-23
replaces: poetryLGBTQ
comment: Poetry about LGBTQ+ people or relating to LGBTQ+ issues.
comment: Poesía sobre personas LGBTQ+ o relacionada con temas LGBTQ+.
alternative label: Poetry (LGBTQ)
alternative label: Poesía (LGBTQ)
broader: LGBTQ+ literature
change note: Version 4.2.0
has top concept: Subcultures
in scheme: v3
narrower: Bisexual poetry
narrower: Gay poetry
narrower: Lesbian poetry
narrower: Queer poetry
narrower: Transgender poetry
narrower: Aromantic poetry
narrower: Intersex poetry
narrower: Asexual poetry
narrower: Demisexual poetry
narrower: Megasexual poetry
narrower: Greyromantic poetry
narrower: Non-binary poetry
preferred label: Poesía LGBTQ+
related: LGBTQ+ authors
related: Māhū poetry
related: Two-Spirit poetry

Sexual roles
type: Concept
issued: 2019-05-14
modified: 2025-03-20
replaces: sexualRoles
comment: An erotic identity an individual assumes during sexual play with one or more people; this identity can either be restricted to the bedroom or extended into day-to-day life.
comment: Una identidad erótica que asume una persona durante el juego sexual con una o más personas; esta identidad puede restringirse al ámbito del dormitorio o extenderse a la vida cotidiana.
broader: Role behavior
broader: Sexual preference
change note: Version 4.2.0
has top concept: Role behavior
in scheme: v3
narrower: Bottoms (Sex)
narrower: Butches
narrower: Femmes
narrower: LGBTQ+ dominants
narrower: LGBTQ+ mistresses (BDSM culture)
narrower: Switches (Sex)
narrower: Tops (Sex)
narrower: Vers (Sex)
narrower: Power exchange
narrower: Ky-ky (Gender role)
preferred label: Roles sexuales
related: Handkerchief codes
related: Roleplay
related: Sexual identity
related: Sexuality

Transsexual people
type: Concept
issued: 2019-05-14
modified: 2025-02-23
replaces: transsexualPeople
comment: Individuals who transition from female to male or male to female. Generally refers to individuals who transition their physical bodies to align with their gender identities. Though this term was popular in the 20th century and is still in use today, it has been largely replaced by "transgender people" and "trans people." Some but not all people regard this term as outdated and offensive. Only use to describe people who self-identify as transsexual.
comment: Personas que hacen la transición de mujer a hombre o de hombre a mujer. Generalmente se refiere a personas que hacen la transición de sus cuerpos físicos para alinearse con sus identidades de género. Aunque este término fue popular en el siglo XX y todavía se utiliza hoy en día, ha sido reemplazado en gran medida por "personas transgénero" y "personas trans". Algunas personas, pero no todas, consideran este término obsoleto y ofensivo. Utilícese únicamente para describir a personas que se identifiquen como transexuales.
alternative label: Transexuals
alternative label: Transsexuals
alternative label: Transexuales
broader: Transgender people
change note: Version 4.2.0
has top concept: LGBTQ+ people
in scheme: v3
narrower: FtMs
narrower: MtFs
preferred label: Personas transexuales
related: Cissexual people
related: Gender-affirming surgery
related: Gender identity disorder
related: No hormone identity
related: Non-operative
related: Pansexual people
related: Post-operative
related: Pre-operative
related: Transsexuality
related: Transitioning status
related: Transitioning (Gender)
related: Transsexualism
related: Clocking (Gender)

LGBTQ+ clergy
type: Concept
issued: 2020-12-11
modified: 2025-02-23
replaces: clergyLGBTQ
comment: LGBTQ+ people who are ordained for religious duties, particularly in the Christian Church.
comment: Personas LGBTQ+ que son ordenadas para deberes religiosos, particularmente en la Iglesia cristiana.
alternative label: Clergy (LGBTQ)
alternative label: Clero (LGBTQ)
change note: Version 4.2.0
in scheme: v3
narrower: Bisexual clergy
narrower: Gay clergy
narrower: Lesbian clergy
narrower: Queer clergy
narrower: Transgender clergy
narrower: Intersex clergy
narrower: Asexual clergy
preferred label: Clero LGBTQ+

Aromantic fiction
type: Concept
issued: 2021-11-09
modified: 2025-10-31
comment: Written works describing imagined events or people; use in reference to fictional works focusing on aromantic characters or themes.
comment: Obras escritas que describen eventos o personas imaginadas; utilícese en referencia a obras de ficción que se centran en personajes o temas arrománticos.
alternative label: Aro fiction
alternative label: Ficción aro
broader: LGBTQ+ fiction
change note: Version 4.2.0
has top concept: Subcultures
in scheme: v3
narrower: Aromantic fantasy fiction
narrower: Aromantic horror fiction
narrower: Aromantic mystery and detective fiction
narrower: Aromantic romance fiction
narrower: Aromantic science fiction
preferred label: Ficción arromántica
related: Bisexual fiction
related: Gay fiction
related: LGBTQ+ books
related: Queer fiction
related: Transgender fiction
related: Aromantic authors
related: Intersex fiction
related: Asexual fiction
related: Aromantic people in fandom

Closeted LGBTQ+ people
type: Concept
issued: 2021-12-08
modified: 2025-02-23
comment: LGBTQ+ people who do not identify as such to others.
comment: Personas LGBTQ+ que no se autoidentifican como tales ante los demás.
alternative label: Closeted people (LGBTQ)
alternative label: Personas en el clóset (LGBTQ)
broader: LGBTQ+ people
change note: Version 4.2.0
has top concept: LGBTQ+ people
in scheme: v3
narrower: Closeted bisexual people
narrower: Closeted gay men
narrower: Closeted lesbians
narrower: Closeted transgender people
narrower: Closeted queer people
narrower: Closeted intersex people
narrower: Closeted asexual people
narrower: Closeted non-binary people
preferred label: Personas LGBTQ+ en el clóset
related: Stealth (Transgender)
related: Coming out
related: Down-low
related: Outing (LGBTQ+ culture)
related: Secrecy
related: Closeted Two-Spirit people
related: Beards (Gay culture)

LGBTQ+ Deaf culture
type: Concept
issued: 2022-02-17
modified: 2026-02-23
comment: The community of Deaf LGBTQ+ people who share a cultural and/or linguistic identity.
comment: La comunidad de personas sordas LGBTQ+ que comparten una identidad cultural y/o lingüística.
alternative label: Deaf culture (LGBTQ)
alternative label: Cultura sorda (LGBTQ)
broader: LGBTQ+ communities
change note: Version 4.2.0
has top concept: LGBTQ+ communities
in scheme: v3
narrower: LGBTQ+ hand signs (Language)
preferred label: Cultura sorda LGBTQ+
related: LGBTQ+ disabled people
related: LGBTQ+ hard of hearing people
related: Lesbian hard of hearing people
related: Gay hard of hearing men
related: Bisexual hard of hearing people
related: Transgender hard of hearing people
related: Queer hard of hearing people
related: LGBTQ+ Deaf people
related: Lesbian Deaf people
related: Gay Deaf men
related: Bisexual Deaf people
related: Transgender Deaf people
related: Queer Deaf people
related: Crip

Police interactions with LGBTQ+ people
type: Concept
issued: 2023-01-13
modified: 2026-02-27
comment: Umbrella term including any of various forms of interactions between police and LGBTQ+ individuals or communities.
comment: Término general que incluye cualquiera de las diversas formas de interacción entre la policía y personas o comunidades LGBTQ+.
alternative label: Police treatment of LGBTQ+ people
alternative label: Policing and the LGBTQ+ community
alternative label: Tratamiento policial de personas LGBTQ+
alternative label: Vigilancia y la comunidad LGBTQ+
change note: Version 4.2.0
in scheme: v3
narrower: Arrests of LGBTQ+ people
narrower: Police entrapment of LGBTQ+ people
narrower: Police harassment of LGBTQ+ people
narrower: Police violence toward LGBTQ+ people
narrower: Identification of LGBTQ+ people by police
narrower: Attitudes of LGBTQ+ people toward police
narrower: Performative LGBTQ+ activism by police
preferred label: Interacciones policiales con personas LGBTQ+
related: Sexual offenses laws
related: Sodomy laws
related: LGBTQ+ survivors of hate crimes
related: Police

LGBTQ+ comedians
type: Concept
issued: 2023-06-27
modified: 2025-02-23
comment: LGBTQ+ people who seek to entertain an audience by making them laugh, through jokes, slapstick, employing prop comedy, or other amusing means.
comment: Personas LGBTQ+ que buscan entretener a una audiencia haciéndola reír, a través de bromas, payasadas, empleando comedia de utilería u otros medios divertidos.
alternative label: LGBTQ+ comics (Persons)
alternative label: Comediantes (LGBTQ)
alternative label: Cómicos LGBTQ+
alternative label: Cómicos LGBTQ
change note: Version 4.2.0
in scheme: v3
narrower: Gay comedians
narrower: Lesbian comedians
narrower: Bisexual comedians
narrower: Transgender comedians
narrower: Queer comedians
narrower: Intersex comedians
narrower: Asexual comedians
preferred label: Comediantes LGBTQ+
related: Two-Spirit comedians

LGBTQ+ politicians
type: Concept
issued: 2023-06-28
modified: 2025-02-23
comment: LGBTQ+ people who are candidates for public office, are currently holding public office, or have held political positions. Politicians can be elected by public election or otherwise appointed.
comment: Personas LGBTQ+ que son candidatas a cargos públicos, que actualmente ocupan cargos públicos o que han ocupado cargos políticos. Los políticos pueden ser elegidos mediante elección pública o designados de otro modo.
alternative label: LGBTQ+ public officials
alternative label: Oficiales públicos (LGBTQ)
change note: Version 4.2.0
in scheme: v3
narrower: Gay politicians
narrower: Lesbian politicians
narrower: Bisexual politicians
narrower: Queer politicians
narrower: Transgender politicians
narrower: Intersex politicians
narrower: Asexual politicians
preferred label: Políticos LGBTQ+
related: Two-Spirit politicians

LGBTQ+ teachers
type: Concept
issued: 2024-05-24
modified: 2025-02-23
comment: Teachers who self-identify as LGBTQ+.
alternative label: Teachers (LGBTQ)
broader: LGBTQ+ people
change note: Version 4.2.0
has top concept: LGBTQ+ people
in scheme: v3
narrower: Aromantic teachers
narrower: Asexual teachers
narrower: Bisexual teachers
narrower: Demisexual teachers
narrower: Gay teachers
narrower: Greyromantic teachers
narrower: Intersex teachers
narrower: Lesbian teachers
narrower: Megasexual teachers
narrower: Non-binary teachers
narrower: Queer teachers
narrower: Transgender teachers
related: Māhū teachers
related: Two-Spirit teachers
related: LGBTQ+ librarians

LGBTQ+ archivists
type: Concept
issued: 2024-10-22
modified: 2025-02-23
comment: LGBTQ+ people who assess, curate, manage, process, preserve, steward, and/or provide access to records and archives of enduring historical value.
alternative label: Archivists (LGBTQ+)
broader: LGBTQ+ information professionals
change note: Version 4.2.0
has top concept: LGBTQ+ information professionals
in scheme: v3
narrower: Lesbian archivists
narrower: Gay archivists
narrower: Bisexual archivists
narrower: Transgender archivists
narrower: Queer archivists
narrower: Intersex archivists
narrower: Asexual archivists
narrower: Non-binary archivists
narrower: Aromantic archivists
narrower: Demisexual archivists
narrower: Greyromantic archivists
narrower: Megasexual archivists
related: LGBTQ+ libraries
related: LGBTQ+ special collections
related: Two-Spirit archivists

LGBTQ+ celebrities
type: Concept
issued: 2025-03-20
modified: 2025-04-23
comment: LGBTQ+ people who have achieved fame and broad public recognition due to the attention given to them by mass media.
alternative label: Celebrities (LGBTQ)
alternative label: LGBTQ+ celebs
alternative label: Celebs (LGBTQ)
alternative label: LGBTQ+ famous people
alternative label: Famous LGBTQ+ people
alternative label: Famous people (LGBTQ)
broader: LGBTQ+ people
change note: Version 4.2.0
has top concept: LGBTQ+ people
in scheme: v4
narrower: LGBTQ+ television personalities
narrower: Lesbian celebrities
narrower: Gay celebrities
narrower: Bisexual celebrities
narrower: Transgender celebrities
narrower: Queer celebrities
narrower: Non-binary celebrities
narrower: Intersex celebrities
narrower: Asexual celebrities
narrower: Aromantic celebrities
narrower: Demisexual celebrities
narrower: Greyromantic celebrities
narrower: Megasexual celebrities
related: Two-Spirit celebrities
related: LGBTQ+ people in mass media

Children
type: Concept
issued: 2019-05-14
modified: 2025-02-23
replaces: children
comment: People who have not yet reached the age of adolescence.
comment: Personas entre las edades del nacimiento y la pubertad.
alternative label: Kids
broader: Family members
change note: Version 4.2.0
has top concept: Family members
in scheme: v3
narrower: Boys
narrower: LGBTQ+ children
narrower: Children of LGBTQ+ people
narrower: Girls
narrower: Children of Two-Spirit people
narrower: Cisgender children
narrower: Heterosexual children
narrower: Surro babies
narrower: Test tube babies
narrower: Asexual children
narrower: Turkey baster babies
preferred label: Niños
related: Child custody
related: Children's sexuality
related: Desire to have children
related: Youth

LGBTQ+ children
type: Concept
is replaced by: homoit0000256
issued: 2019-05-14
issued: 2020-06-03
modified: 2025-02-23
modified: 2022-08-15
replaces: childrenLGBTQ
replaces: LGBTQChildrenOfAlcoholics
comment: LGBTQ+ people who have not yet reached the age of adolescence.
comment: Personas menores de 18 años que se autoidentifican como LGBTQ+.
alternative label: Children (LGBTQ)
alternative label: Niños (LGBTQ)
alternative label: LGBTQ children of alcoholics
broader: Children
change note: Version 4.2.0
has top concept: Family members
in scheme: v3
narrower: Bisexual children
narrower: Intersex children
narrower: Queer children
narrower: Sexually abused LGBTQ+ children
narrower: Transgender children
narrower: Non-binary children
narrower: Lesbian children
narrower: Gay children
narrower: Asexual children
preferred label: Niños LGBTQ+
preferred label: LGBTQ+ children of alcoholics
related: Gender creative
related: Gender dysphoria in children
related: LGBTQ+ people in Adult Children of Alcoholics

Erotica
type: Concept
issued: 2019-05-14
modified: 2025-02-23
replaces: erotica
comment: The portrayal of sexuality with high-art aspirations, typically also focusing on feelings and emotions.
comment: La representación de la sexualidad con aspiraciones de alto nivel artístico, que normalmente también se centra en sentimientos y emociones.
change note: Version 4.2.0
in scheme: v3
narrower: LGBTQ+ erotic literature
preferred label: Erótica
related: LGBTQ+ arts
related: Pornography

Gay culture
type: Concept
issued: 2019-05-14
modified: 2025-03-20
replaces: gayCulture
comment: Use to describe cultural experiences shared by members of gay communities or products of gay culture (e.g., art and media created by and for gay men, activism focused on gay issues, slang commonly used in gay communities, etc.).
comment: Utilícese para describir experiencias culturales compartidas por miembros de comunidades gay o productos de la cultura gay (p. ej., arte y medios creados por y para hombres gay, activismo centrado en cuestiones gay, jerga comúnmente utilizada en comunidades gay, etc.).
broader: LGBTQ+ culture
change note: Version 4.2.0
has top concept: Subcultures
in scheme: v3
narrower: Bears (Gay culture)
narrower: Chubs (Gay culture)
narrower: Cubs (Gay culture)
narrower: Gay slang
narrower: Otters (Gay culture)
narrower: Pups (Roleplay)
narrower: Queens (Gay culture)
narrower: Twinks (Gay culture)
narrower: Wolves (Gay culture)
narrower: Beards (Gay culture)
preferred label: Cultura gay
related: Camp (Gay culture)
related: Sexual identity
related: Gym subculture
related: Queer culture
related: Bisexual culture
related: Fairies (Gay culture)

LGBTQ+ fantasy fiction
type: Concept
issued: 2019-05-14
modified: 2025-02-23
replaces: fantasyFictionLGBTQ
comment: Genre that uses magic and other supernatural phenomena as a primary element of plot, theme, and/or setting; use for fantasy fiction focusing on LGBTQ+ characters or themes.
comment: Género que utiliza la magia y otros fenómenos sobrenaturales como elemento principal de la trama, el tema y/o el escenario; utilícese para ficción fantástica que se centre en personajes o temas LGBTQ+.
alternative label: Fantasy fiction (LGBTQ)
broader: LGBTQ+ fiction
change note: Version 4.2.0
has top concept: Subcultures
in scheme: v3
narrower: Lesbian fantasy fiction
narrower: Gay fantasy fiction
narrower: Bisexual fantasy fiction
narrower: Transgender fantasy fiction
narrower: Queer fantasy fiction
narrower: Asexual fantasy fiction
narrower: Aromantic fantasy fiction
narrower: Intersex fantasy fiction
narrower: Demisexual fantasy fiction
narrower: Megasexual fantasy fiction
narrower: Greyromantic fantasy fiction
narrower: Non-binary fantasy fiction
narrower: LGBTQ+ urban fantasy fiction
preferred label: Ficción fantástica LGBTQ+
related: LGBTQ+ science fiction
related: Māhū fantasy fiction
related: Two-Spirit fantasy fiction

LGBTQ+ science fiction
type: Concept
issued: 2019-05-14
modified: 2025-02-23
replaces: scienceFictionLGBTQ
comment: Written literary work about imaginative or futuristic concepts incorporating science, technology, space, time travel, and other speculative elements; use in reference to science fiction focusing on LGBTQ+ characters or themes.
comment: Obras literarias escritas sobre conceptos imaginativos o futuristas que incorporen la ciencia, la tecnología, el espacio, los viajes en el tiempo y otros elementos especulativos; utilícese en referencia a la ciencia ficción centrada en personajes o temas LGBTQ+.
alternative label: Science fiction (LGBTQ)
alternative label: Ciencia ficción (LGBTQ)
broader: LGBTQ+ fiction
change note: Version 4.2.0
has top concept: Subcultures
in scheme: v3
narrower: Lesbian science fiction
narrower: Gay science fiction
narrower: Bisexual science fiction
narrower: Transgender science fiction
narrower: Queer science fiction
narrower: Asexual science fiction
narrower: Demisexual science fiction
narrower: Aromantic science fiction
narrower: Intersex science fiction
narrower: Megasexual science fiction
narrower: Greyromantic science fiction
narrower: Non-binary science fiction
preferred label: Ciencia ficción LGBTQ+
related: LGBTQ+ fantasy fiction
related: Kirk/Spock
related: Māhū science fiction
related: Two-Spirit science fiction

Outing (LGBTQ+ culture)
type: Concept
issued: 2019-05-14
modified: 2025-02-23
replaces: outing
comment: The act of disclosing a person's sexual or gender identity without that person's consent.
comment: El acto de revelar la identidad sexual o de género de una persona sin el consentimiento de esa persona.
alternative label: Outing
alternative label: Sacar del armario
alternative label: Sacar del clóset
broader: LGBTQ+ direct action
change note: Version 4.2.0
has top concept: LGBTQ+ activism
in scheme: v3
preferred label: Outing (cultura LGBTQ+)
related: Baby dykes
related: Baby gays
related: Closeted bisexual people
related: Closeted gay men
related: Closeted lesbians
related: Stealth (Transgender)
related: Coming out
related: Deadnaming
related: Secrecy
related: Closeted LGBTQ+ people
related: Closeted transgender people
related: Closeted queer people
related: Closeted intersex people
related: Closeted Two-Spirit people
related: Identification of LGBTQ+ people by police
related: Closeted asexual people

Polyamory
type: Concept
issued: 2019-05-14
modified: 2026-02-24
replaces: polyamory
comment: Practice of engaging in romantic, sexual, or play relationships with more than one person simultaneously, with the knowledge and consent of all parties involved.
comment: Práctica de entablar relaciones románticas, sexuales o de juego con más de una persona simultáneamente, con el conocimiento y consentimiento de todas las partes involucradas.
broader: Consensual non-monogamy
change note: Version 4.2.0
has top concept: Relationship orientation
in scheme: v3
narrower: Metamours
narrower: Hierarchical non-monogamy
narrower: Paramours
narrower: Throuple
preferred label: Poliamor
related: Consent
related: Group sex
related: Polygamy
related: Sexual identity
related: Polysexuality
related: Anchor partners
related: Compersion
related: Nesting partners
related: NRE (New Relationship Energy)
related: Polyamorous people
related: Polyfidelity
related: Polygamous people

LGBTQ+ publishers
type: Concept
issued: 2019-05-14
modified: 2025-02-23
replaces: publishersLGBTQ
comment: Publishers that publish materials for LGBTQ+ communities or materials addressing LGBTQ+ issues.
comment: Empresas y organizaciones que publican materiales para comunidades LGBTQ+ o que abordan asuntos LGBTQ+.
alternative label: Publishers (LGBTQ)
alternative label: Editoriales (LGBTQ)||
change note: Version 4.2.0
in scheme: v3
narrower: Bisexual publishers
narrower: Gay publishers
narrower: Lesbian publishers
narrower: Queer publishers
narrower: Transgender publishers
narrower: Asexual publishers
narrower: Intersex publishers
preferred label: Editoriales LGBTQ+
related: LGBTQ+ periodicals
related: Two-Spirit publishers

LGBTQ+ radio
type: Concept
issued: 2019-05-14
modified: 2026-02-23
replaces: radioLGBTQ
comment: Auditory content broadcast on the radio (analog or digital) about LGBTQ+ people and/or LGBTQ+ issues.
comment: Contenido auditivo emitido en radio (analógica o digital) sobre personas LGBTQ+ y/o asuntos LGBTQ+.
alternative label: Radio (LGBTQ)
change note: Version 4.2.0
in scheme: v3
narrower: Bisexual radio
narrower: Gay radio
narrower: Lesbian radio
narrower: Queer radio
narrower: Transgender radio
narrower: Asexual radio
narrower: Intersex radio
preferred label: Radio LGBTQ+
related: Two-Spirit radio
related: LGBTQ+ podcasts

Sexual relationships
type: Concept
issued: 2019-05-14
modified: 2025-02-23
replaces: sexualRelationships
comment: Ongoing connections between two or more individuals involving sexual behaviors or activities.
comment: Conexiones continuas entre dos o más personas que involucran comportamientos o actividades sexuales.
broader: Relationship satisfaction
change note: Version 4.2.0
has top concept: Relationship satisfaction
in scheme: v3
narrower: Casual sex
narrower: Love triangles
narrower: Monogamy
narrower: Polygamy
preferred label: Relaciones sexuales
related: Anonymous sex
related: Demisexual people
related: Fuck buddies
related: LGBTQ+ lovers
related: Partner notification
related: Partner preference
related: Sexual preference
related: Megasexuality
related: Megasexual people
related: Relationship orientation
related: Monogamous people
related: Allosexual people

Power exchange
type: Concept
issued: 2023-12-15
modified: 2025-03-20
comment: Consensual exchange of power between two or more people as a feature of their relationship or during erotic activity.
comment: Intercambio consensual de poder entre dos o más personas como característica de su relación o durante una actividad erótica.
alternative label: D & S
alternative label: D and S
alternative label: D&s
alternative label: D/s
alternative label: Dom and sub
alternative label: Dom-sub
alternative label: Dominance and submission
alternative label: Domination and submission
alternative label: M/s
alternative label: Master/slave lifestyle
alternative label: Master/slave
alternative label: Submission and dominance
alternative label: Submission and domination
alternative label: Dominación y sumisión
alternative label: D&S
alternative label: Dom y sub
alternative label: Amo y esclavo
alternative label: Amo/esclavo
alternative label: Estilo de vida amo/esclavo
broader: Sexual roles
change note: Version 4.2.0
has top concept: Role behavior
in scheme: v3
narrower: Total power exchange
preferred label: Intercambio de poder
related: Age play
related: Bottoms (Sex)
related: LGBTQ+ dominatrices
related: BDSM
related: Leather community
related: LGBTQ+ dominants
related: Roleplay
related: LGBTQ+ submissives
related: Tops (Sex)
related: Relationship minorities
related: Mind play
related: Erotic hypnosis
related: Kinky people
related: Consent play
related: Dehumanization (Erotic)

LGBTQ+ cartoonists
type: Concept
issued: 2025-03-13
modified: 2025-03-13
comment: LGBTQ+ people who draw cartoons, comics, or graphic novels.
alternative label: Cartoonists (LGBTQ)
alternative label: LGBTQ+ comics creators
alternative label: Comics creators (LGBTQ)
alternative label: LGBTQ+ cartoon artists
alternative label: Cartoon artists (LGBTQ)
broader: LGBTQ+ artists
change note: Version 4.2.0
has top concept: LGBTQ+ people
in scheme: v4
narrower: Lesbian cartoonists
narrower: Gay cartoonists
narrower: Bisexual cartoonists
narrower: Transgender cartoonists
narrower: Queer cartoonists
narrower: Non-binary cartoonists
narrower: Intersex cartoonists
narrower: Asexual cartoonists
narrower: Aromantic cartoonists
narrower: Demisexual cartoonists
narrower: Greyromantic cartoonists
narrower: Megasexual cartoonists
related: LGBTQ+ cartoons
related: LGBTQ+ comics
related: LGBTQ+ graphic novels
related: Two-Spirit cartoonists

White LGBTQ+ people
type: Concept
issued: 2019-05-14
modified: 2025-02-23
replaces: whitePeopleLGBTQ
comment: LGBTQ+ people who are white.
comment: Personas LGBTQ+ que son blancas.
alternative label: Caucasians (LGBTQ)
alternative label: White people (LGBTQ)
alternative label: Caucasian LGBTQ+ people
alternative label: LGBTQ+ Caucasian people
alternative label: LGBTQ+ white people
alternative label: Personas caucásicas LGBTQ+
alternative label: Caucásicos (LGBTQ+)
alternative label: Personas caucásicas (LGBTQ)
alternative label: Personas caucásicas blancas
alternative label: Personas blancas LGBTQ+
alternative label: Personas blancas (LGBTQ)
change note: Version 4.2.0
in scheme: v3
narrower: White bisexual people
narrower: White gay men
narrower: White lesbians
narrower: White queer people
narrower: White transgender people
narrower: White intersex people
narrower: White asexual people
narrower: White non-binary people
preferred label: Personas LGBTQ+ blancas
related: Social privilege

Cisgender people
type: Concept
issued: 2019-05-14
modified: 2025-02-23
replaces: cisgenderPeople
comment: Individuals whose gender identity matches the gender or sex they were assigned at birth.
comment: Personas cuya identidad de género coincide con el género o sexo que les fue asignado al nacer.
alternative label: Cis people
alternative label: Personas cis
change note: Version 4.2.0
in scheme: v3
narrower: Cisgender men
narrower: Cisgender women
narrower: Cisgender youth
narrower: Cisgender children
preferred label: Personas cisgénero
related: Gender assigned at birth
related: Cissexual people
related: Non-Euro-American gender and sexual identities
related: Gender identity
related: Males
related: Transgender people
related: Females
related: Demigirls
related: Demiboys
related: Cisgender identity

Consent
type: Concept
issued: 2019-05-14
modified: 2025-02-23
replaces: consent
comment: Permission or agreement for a set of actions to occur, particularly in a sexual encounter and/or within a relational dynamic.
comment: Permiso o acuerdo para que ocurra un conjunto de acciones, particularmente en un encuentro sexual y/o dentro de una dinámica relacional.
change note: Version 4.2.0
in scheme: v3
narrower: Age of consent
narrower: Informed consent
preferred label: Consentimiento
related: Castration
related: BDSM
related: LGBTQ+ domestic violence
related: LGBTQ+ sexual abuse
related: LGBTQ+ victims of rape
related: LGBTQ+ victims of sexual abuse
related: Polyamory
related: Polygamy
related: Social privilege
related: Sex (Act)
related: Sexual practices
related: Rape/non-con (Content warning)
related: Underage (Content warning)

Feminists
type: Concept
issued: 2019-05-14
modified: 2025-02-28
replaces: feminists
comment: People who support and advocate for defining, establishing, and defending equal political, economic, and social rights and opportunities for women.
comment: Personas que apoyan y defienden la definición, el establecimiento y la defensa de la igualdad de derechos y oportunidades políticas, económicas y sociales para las mujeres.
change note: Version 4.2.0
in scheme: v3
narrower: Suffragettes
narrower: Lesbian feminists
narrower: Black feminists
narrower: Eco-feminists
narrower: First-wave feminists
narrower: Second-wave feminists
narrower: Third-wave feminists
narrower: Radical feminists
preferred label: Feministas

Intersex people
type: Concept
issued: 2019-05-14
modified: 2025-02-23
replaces: intersexPeople
comment: Individuals born with variations in their genitalia, hormones, internal anatomy, and/or chromosomes that do not fully or exclusively conform to medical or social expectations for males or females. Only use to describe people who describe themselves as intersex.
comment: Personas que nacen con variaciones en sus genitales, hormonas, anatomía interna y/o cromosomas que no se conforman total o exclusivamente a las expectativas médicas o sociales para hombres o mujeres. Utilícese únicamente para describir a personas que se describen como intersex.
alternative label: Hermaphrodites
alternative label: Intersexuals
alternative label: Hermaphroditic people
alternative label: Intersex-identified people
alternative label: Intersexual people
alternative label: Hermafroditas
alternative label: Personas hermafroditas
alternative label: Intersexuales
alternative label: Personas intersexuales
broader: LGBTQ+ people
change note: Version 4.2.0
has top concept: LGBTQ+ people
in scheme: v3
narrower: Intersex children
narrower: Intersex youth
narrower: Chimeras
narrower: Intersex college students
narrower: Pregnant intersex people
preferred label: Personas intersex
related: Androgynos
related: Intersex
related: Intersex variations
related: Intersex genital mutilation
related: Intersex identity
related: Intersex movement
related: Intersex rights
related: Intersex families
related: Intersex parents
related: Children of intersex people
related: Hermaphrodites
related: Persecution of intersex people

Heterosexuals
type: Concept
issued: 2019-05-14
modified: 2025-02-23
replaces: heterosexuals
comment: Individuals who are romantically and sexually attracted to members of the opposite sex or gender.
comment: Personas que se sienten atraídas romántica y sexualmente por miembros del sexo o género opuesto.
alternative label: Heterosexual people
alternative label: Straight people
alternative label: Personas heterosexuales
alternative label: Personas hétero
change note: Version 4.2.0
in scheme: v3
narrower: Allies
narrower: Heterosexual men
narrower: Heterosexual women
narrower: Heterosexual youth
narrower: Heterosexual children
preferred label: Heterosexuales
related: Heterosexual identity
related: Heterosexuality
related: Allosexuality
related: Monosexual people

LGBTQ+ film festivals
type: Concept
issued: 2019-05-14
modified: 2025-02-23
replaces: LGBTQFilmFestivals
comment: Organized presentations of films in a single location, often with prizes awarded in various categories; use in reference to film festivals focusing on films created by LGBTQ+ people or featuring LGBTQ+ characters and themes.
comment: Presentaciones organizadas de películas en un solo lugar, a menudo con premios otorgados en varias categorías; utilícese en referencia a festivales de cine que se centran en películas creadas por personas LGBTQ+ o que presentan personajes y temas LGBTQ+.
alternative label: LGBTQ film festivals
change note: Version 4.2.0
in scheme: v3
narrower: Lesbian film festivals
narrower: Gay film festivals
narrower: Bisexual film festivals
narrower: Transgender film festivals
narrower: Queer film festivals
narrower: Non-binary film festivals
narrower: Intersex film festivals
preferred label: Festivales de cine LGBTQ+
related: LGBTQ+ films
related: LGBTQ+ cinema
related: Two-Spirit film festivals

LGBTQ+ victims of sexual abuse
type: Concept
issued: 2019-05-14
modified: 2025-02-23
replaces: victimsOfSexualAbuseLGBTQ
comment: LGBTQ+ people who have experienced sexual abuse and may or may not have survived; follow the individual's preference for "victims" or "survivors" whenever possible.
comment: Personas LGBTQ+ que han sufrido abuso sexual y pueden o no haber sobrevivido; siga la preferencia de la persona sobre el uso de "víctimas" o "sobrevivientes" siempre que sea posible.
alternative label: Sexual abuse victims (LGBTQ)
alternative label: Sexual violence victims (LGBTQ)
alternative label: Victims of sex crimes (LGBTQ)
alternative label: Victims of sexual abuse (LGBTQ)
broader: LGBTQ+ victims of crime
change note: Version 4.2.0
has top concept: LGBTQ+ people
in scheme: v3
narrower: Bisexual victims of sexual abuse
narrower: Gay victims of sexual abuse
narrower: Lesbian victims of sexual abuse
narrower: LGBTQ+ incest victims
narrower: LGBTQ+ victims of rape
narrower: Queer victims of sexual abuse
narrower: Sexually abused LGBTQ+ children
narrower: LGBTQ+ survivors of sexual abuse
narrower: Transgender victims of sexual abuse
narrower: Asexual victims of sexual abuse
narrower: Intersex victims of sexual abuse
preferred label: Víctimas LGBTQ+ de abuso sexual
related: Anti-LGBTQ+ violence
related: Consent
related: LGBTQ+ domestic violence
related: LGBTQ+ sexual abuse
related: Rape/non-con (Content warning)
related: Two-Spirit victims of sexual abuse

LGBTQ+ libraries
type: Concept
issued: 2019-05-14
modified: 2026-02-26
replaces: librariesLGBTQ
comment: Libraries that hold materials primarily pertaining to LGBTQ+ people or intended for use by LGBTQ+ people.
comment: Bibliotecas que contienen materiales principalmente relacionados con personas LGBTQ+ o destinados a personas LGBTQ+.
alternative label: Libraries (LGBTQ)
alternative label: Bibliotecas (LGBTQ)
broader: LGBTQ+ cultural heritage institutions
change note: Version 4.2.0
has top concept: LGBTQ+ cultural heritage institutions
in scheme: v3
narrower: Bisexual libraries
narrower: Gay libraries
narrower: Lesbian libraries
narrower: Queer libraries
narrower: Transgender libraries
narrower: Women's libraries
narrower: Intersex libraries
narrower: Asexual libraries
narrower: Non-binary libraries
preferred label: Bibliotecas LGBTQ+
related: LGBTQ+ archives
related: LGBTQ+ books
related: LGBTQ+ special collections
related: Two-Spirit libraries
related: LGBTQ+ archivists
related: LGBTQ+ librarians
related: Metadata for LGBTQ+ resources
related: Libraries and LGBTQ+ people

LGBTQ+ dominants
type: Concept
issued: 2019-05-14
modified: 2025-02-23
replaces: mastersLGBTQ
comment: The person who takes on the position of authority or power in a power exchange relationship or kink activity.
comment: La persona que asume la posición de autoridad o poder en una relación de intercambio de poder o actividad kink.
alternative label: Masters (LGBTQ)
alternative label: LGBTQ+ D-types
alternative label: LGBTQ+ Doms
alternative label: LGBTQ+ masters
alternative label: Amos LGBTQ+
alternative label: Amos (LGBTQ+)
broader: Sexual identity
broader: Sexual roles
broader: Relationship minorities
broader: Kinky people
change note: Version 4.2.0
has top concept: Sexual identity
in scheme: v3
narrower: Bisexual dominants
narrower: Gay dominants
narrower: Queer dominants
narrower: Transgender dominants
narrower: Asexual dominants
narrower: Lesbian dominants
preferred label: Dominantes LGBTQ+
related: LGBTQ+ dominatrices
related: Leather community
related: LGBTQ+ mistresses (BDSM culture)
related: Social privilege
related: LGBTQ+ submissives
related: Tops (Sex)
related: Power exchange

LGBTQ+ television
type: Concept
issued: 2019-05-14
modified: 2025-02-23
replaces: televisionLGBTQ
comment: Television shows featuring LGBTQ+ characters or themes.
comment: Programas de televisión con personajes o temas LGBTQ+.
alternative label: Television (LGBTQ)
alternative label: Televisión (LGBTQ)
change note: Version 4.2.0
in scheme: v3
narrower: Bisexual television
narrower: Gay television
narrower: Lesbian television
narrower: Queer television
narrower: Transgender television
narrower: Asexual television
narrower: Intersex television
preferred label: Televisión LGBTQ+
related: LGBTQ+ characters
related: Two-Spirit television
related: Drag television programs

Intersex fiction
type: Concept
issued: 2021-11-09
modified: 2026-02-23
comment: Written works of fiction featuring intersex characters or addressing intersex themes.
comment: Obras escritas de ficción que presentan personajes intersex o abordan temas intersex.
broader: LGBTQ+ fiction
broader: Intersex people in fandom
change note: Version 4.2.0
has top concept: Subcultures
in scheme: v3
narrower: Intersex fantasy fiction
narrower: Intersex horror fiction
narrower: Intersex mystery and detective fiction
narrower: Intersex romance fiction
narrower: Intersex science fiction
narrower: Intersex historical fiction
preferred label: Ficción intersex
related: Bisexual fiction
related: Gay fiction
related: LGBTQ+ books
related: Queer fiction
related: Transgender fiction
related: Intersex authors
related: Aromantic fiction
related: Asexual fiction
related: Greyromantic fiction

Kink accessories
type: Concept
issued: 2023-12-15
modified: 2025-03-20
comment: Items used during kink play or worn as fashionable accessories to indicate participation in the kink or leather communities.
comment: Elementos utilizados durante juegos de kink o empleados como accesorios de moda para indicar la participación en las comunidades de kink o cuero.
alternative label: Bondage gear
alternative label: Bondagewear
alternative label: Fetishwear
alternative label: Leather gear
broader: BDSM
change note: Version 4.2.0
has top concept: Eroticism
in scheme: v3
narrower: Blindfolds
narrower: Enemas
narrower: Corsets
narrower: Harnesses
narrower: Vacuum pumps
narrower: Diapers (Erotic)
narrower: Uniform fetish
narrower: Gags
narrower: Body bags (Erotic)
narrower: Chastity devices
preferred label: Accesorios kink
related: Bondage
related: Leather community
related: Restraints
related: Sex accessories
related: LGBTQ+ fashion
related: Jockstraps
related: Sex swings

LGBTQ+ fashion
type: Concept
issued: 2023-12-18
modified: 2025-04-23
comment: Fashion, clothing, and accessories associated with LGBTQ+ subcultures and expression.
comment: Moda, ropa y accesorios asociados con las subculturas y expresiones LGBTQ+.
change note: Version 4.2.0
in scheme: v3
narrower: Corsets
narrower: Rubber and latex fetish
narrower: Jockstraps
narrower: Gloves (Erotic)
narrower: Gas masks (Erotic)
narrower: Cuffs
narrower: Hoods (Erotic)
narrower: Masks (Erotic)
narrower: PVC (Erotic)
preferred label: Moda LGBTQ+
related: Clothing
related: Gender expression
related: Gender transgression
related: Kink accessories
related: Uniform fetish
related: LGBTQ+ makeup artists
related: Makeup and LGBTQ+ communities
related: LGBTQ+ fashion designers

LGBTQ+ librarians
type: Concept
issued: 2024-10-22
modified: 2026-02-26
comment: LGBTQ+ people, typically with degrees in library science, who work, manage, or assist in a library setting.
alternative label: Librarians (LGBTQ+)
broader: LGBTQ+ information professionals
change note: Version 4.2.0
has top concept: LGBTQ+ information professionals
in scheme: v3
narrower: Lesbian librarians
narrower: Gay librarians
narrower: Bisexual librarians
narrower: Transgender librarians
narrower: Queer librarians
narrower: Non-binary librarians
narrower: Intersex librarians
narrower: Asexual librarians
narrower: Aromantic librarians
narrower: Demisexual librarians
narrower: Greyromantic librarians
narrower: Megasexual librarians
related: LGBTQ+ libraries
related: LGBTQ+ literature
related: LGBTQ+ teachers
related: Two-Spirit librarians
related: Libraries and LGBTQ+ people

LGBTQ+ artists
type: Concept
issued: 2019-05-14
modified: 2025-04-23
replaces: artistsLGBTQ
comment: LGBTQ+ people who practice any of various creative arts.
comment: Artistas que se conocen por ser LGBTQ+.
alternative label: Artists (LGBTQ)
alternative label: Artistas (LGBTQ)
broader: LGBTQ+ people
change note: Version 4.2.0
has top concept: LGBTQ+ people
in scheme: v3
narrower: Bisexual artists
narrower: Gay artists
narrower: Lesbian artists
narrower: Queer artists
narrower: Transgender artists
narrower: Asexual artists
narrower: Intersex artists
narrower: LGBTQ+ photographers
narrower: LGBTQ+ painters
narrower: Greyromantic artists
narrower: Demisexual artists
narrower: Megasexual artists
narrower: Aromantic artists
narrower: LGBTQ+ cartoonists
narrower: LGBTQ+ makeup artists
preferred label: Artistas LGBTQ+
related: LGBTQ+ arts
related: LGBTQ+ cultural heritage institutions
related: Two-Spirit artists

Black LGBTQ+ people
type: Concept
issued: 2019-05-14
modified: 2025-02-23
replaces: blackPeopleLGBTQ
comment: Black people who are also LGBTQ+; do not use for people of color broadly; follow the individual's preference for Black or African American whenever possible.
comment: Personas negras que son LGBTQ+. Utilícese únicamente para personas que seautoidentificancomo negras. Siga la preferencia del individuo para el uso de afroamericanos o negros siempre que sea posible.
alternative label: Black people (LGBTQ)
alternative label: LGBTQ+ Black people
alternative label: Personas negras LGBTQ+
alternative label: Personas negras (LGBTQ)
broader: LGBTQ+ people of color
change note: Version 4.2.0
has top concept: LGBTQ+ people
in scheme: v3
narrower: African American LGBTQ+ people
narrower: Afro-Canadian LGBTQ+ people
narrower: Afro-Caribbean LGBTQ+ people
narrower: Afro-European LGBTQ+ people
narrower: Afro-Latin American LGBTQ+ people
narrower: Black bisexual people
narrower: Black gay men
narrower: Black lesbians
narrower: Black queer people
narrower: Black transgender people
narrower: Blaqueer people
narrower: Black asexual people
narrower: Black intersex people
narrower: Black non-binary people
preferred label: Personas LGBTQ+ negras
related: BIPOC
related: Police harassment of Black LGBTQ+ people
related: Black Lives Matter movement
related: Black Trans Lives Matter movement

Donors
type: Concept
issued: 2019-05-14
modified: 2025-02-23
replaces: donors
comment: Individuals who donate their own biological materials, typically gametes (e.g., sperm or eggs), organs, or blood.
comment: Personas que donan sus propios materiales biológicos, normalmente gametos (p. ej., esperma u óvulos), órganos o sangre.
change note: Version 4.2.0
in scheme: v3
narrower: Egg donors
narrower: LGBTQ+ blood donors
narrower: Sperm donors
narrower: Anonymous donors (Reproduction)
narrower: Known donors (Reproduction)
narrower: Open identity donors (Reproduction)
preferred label: Donantes
related: Biological parenthood
related: Genetic parenthood
related: Conception by LGBTQ+ people
related: LGBTQ+ personal and family law
related: Medical care
related: Donor siblings

Drag
type: Concept
issued: 2019-05-14
modified: 2025-02-23
replaces: drag
comment: A performance genre involving dressing and/or using makeup to produce, emphasize, and/or exaggerate traits associated with a certain gender, which typically (but not always) is not the gender the performer primarily identifies with.
comment: Un tipo de actuación que implica vestirse y/o usar maquillaje para producir, enfatizar y/o exagerar rasgos asociados con un determinado género, que normalmente (pero no siempre) no es el género con el que el artista se identifica principalmente.
broader: Gender expression
change note: Version 4.2.0
has top concept: Gender
in scheme: v3
narrower: Lingerie
narrower: Drag in film
narrower: Drag television programs
related: Camp (Gay culture)
related: Clothing
related: Drab (LGBTQ+ culture)
related: Drag balls
related: Drag bars
related: Drag community
related: Drag kings
related: Drag queens
related: LGBTQ+ arts
related: Voguing
related: Costumes
related: Masquerading
related: Drag performers
related: Drag shows
related: Drag pageants

Gender-affirming surgery
type: Concept
issued: 2019-05-14
modified: 2025-02-23
replaces: genderConfirmingSurgery
comment: Any of various surgeries undertaken to affirm an individual's gender. Most often applied to transgender people, but may also refer to certain procedures undergone by cisgender and intersex people.
comment: Cualquiera de las diversas cirugías realizadas para afirmar el género de una persona. Se aplica con mayor frecuencia a personas transgénero, pero también puede referirse a ciertos procedimientos a los que se someten personas cisgénero e intersex.
alternative label: Gender affirmation surgery
alternative label: Gender confirmation surgery
alternative label: Gender realignment surgery
alternative label: Gender reassignment surgery
alternative label: Sex reassignment surgery
alternative label: SRS
alternative label: Gender confirming surgery
alternative label: Gender-confirming surgery
alternative label: Gender affirming surgery
broader: Medical care
broader: Gender-affirming care
change note: Version 4.2.0
has top concept: Medical care
in scheme: v3
narrower: Bottom surgery
narrower: Neovagina
narrower: Facial gender affirming surgery
narrower: Top surgery
narrower: Feminizing vocal surgery
narrower: Masculinizing vocal surgery
narrower: Neophallus
preferred label: Cirugía de afirmación de género
related: Gender
related: Non-operative
related: Post-operative
related: Pre-operative
related: Transgender people
related: Transsexual people
related: Transitioning status
related: Transitioning (Gender)
related: Transgender health care bans

Harassment
type: Concept
issued: 2019-05-14
modified: 2025-02-23
replaces: harassment
comment: Covers a wide range of behaviors that are intended to disturb or upset. Harassment is often repetitive or occurs across an extended period of time.
comment: Cubre una amplia gama de comportamientos que tienen como objetivo perturbar o alterar. El acoso suele ser repetitivo u ocurrir durante un período prolongado.
change note: Version 4.2.0
in scheme: v3
narrower: Police harassment
narrower: Sexual harassment
preferred label: Acoso
related: Bullying
related: LGBTQ+ discrimination
related: Slurs

LGBTQ+ social processes
type: Concept
issued: 2019-05-14
modified: 2025-02-23
replaces: LGBTQSocialProcesses
comment: Forms of social interaction that occur repeatedly; use to describe the ways in which LGBTQ+ people interact and establish social relationships.
comment: Formas de interacción social que ocurren repetidamente; utilícese para describir las formas en que las personas LGBTQ+ interactúan y establecen relaciones sociales.
alternative label: LGBTQ social processes
alternative label: Procesos sociales LGBTQ
change note: Version 4.2.0
in scheme: v3
narrower: Gay liberation
narrower: Gay-straight alliances
narrower: Gender relations
narrower: Lesbian liberation
narrower: LGBTQ+ emancipation
narrower: LGBTQ+ visibility
preferred label: Procesos sociales LGBTQ+
related: Normalization
related: Sex scandals
related: Sexual reform
related: Sexual revolution
related: Impact of COVID-19 pandemic on LGBTQ+ people

Sex locations
type: Concept
issued: 2019-05-14
modified: 2025-02-23
replaces: sexLocations
comment: Places where people engage in sexual activities, including private and public spaces.
comment: Lugares donde las personas participan en actividades sexuales, incluidos espacios públicos y privados.
alternative label: Locations for sex
alternative label: Ubicaciones para sexo
alternative label: Locaciones para sexo
change note: Version 4.2.0
in scheme: v3
narrower: Dark rooms
narrower: Cottages (Gay culture)
narrower: Gay saunas
narrower: Sex parties
narrower: Tearooms (Gay culture)
narrower: Play spaces
preferred label: Lugares de sexo
related: Anonymous sex
related: LGBTQ+ meeting places
related: Public sex
related: Sex (Act)
related: Sexuality

Marriage
type: Concept
issued: 2019-05-14
modified: 2026-02-24
replaces: marriage
comment: Legal union between two or more people in a personal relationship that may or may not grant certain economic, legal, and social rights.
comment: Unión jurídica entre dos o más personas en una relación personal que puede o no otorgar ciertos derechos económicos, legales y sociales.
broader: Living arrangements
change note: Version 4.2.0
has top concept: Living arrangements
in scheme: v3
narrower: Mixed-orientation marriage
narrower: Common law marriage
narrower: Same-sex marriage
narrower: Heterosexual marriage
narrower: LGBTQ+ divorce
narrower: LGBTQ+ separation
narrower: Marital status
narrower: Marriage certificates
narrower: Marriage licenses
narrower: Women's marriages
narrower: Interracial LGBTQ+ marriage
preferred label: Matrimonio
related: Legal name change
related: Civil unions
related: Domestic partnership contracts
related: Domestic partnerships
related: LGBTQ+ weddings
related: Marriage law
related: Official documentation

Social norms
type: Concept
issued: 2019-05-14
modified: 2025-04-23
replaces: socialNorms
comment: Group-held beliefs about how members of that group should behave in a given context.
comment: Creencias grupales sobre cómo deberían comportarse los miembros de tal grupo en un contexto determinado.
change note: Version 4.2.0
in scheme: v3
narrower: Heteronormativity
narrower: Homonormativity
narrower: Amatonormativity
narrower: Compulsory sexuality
narrower: Mononormativity
narrower: Chrononormativity
narrower: Compulsory heterosexuality
preferred label: Normas sociales
related: Normalization
related: Homonationalism
related: Role behavior

Slurs
type: Concept
issued: 2020-06-03
modified: 2025-02-23
replaces: slurs
comment: Insulting or discriminating remarks, innuendos, or names intended to demoralize a person, typically by disparaging that person's identity or social group. Generally, for a term to be considered a slur, it must be derogatory towards a particular person or group, it must be used to subordinate them within some structure of power relations, and the derogated person or group must be defined by an intrinsic property such as their race, sexual orientation, gender identity, etc. This category includes terms considered slurs at any point in their usage. Therefore, some of these terms may no longer be considered universally derogatory, may be in common usage, or may be selectively reclaimed by certain groups.
comment: Comentarios, insinuaciones o nombres insultantes o discriminatorios destinados a desmoralizar a una persona, generalmente menospreciando su identidad o grupo social. Generalmente, para que un término se considere peyorativo, debe ser despectivo hacia una persona o grupo en particular, debe usarse para subordinarles dentro de alguna estructura de relaciones de poder, y la persona o grupo derogado debe estar definido por una propiedad intrínseca como su raza, orientación sexual, identidad de género, etc. Esta categoría incluye términos considerados insultos en cualquier momento de su uso. Por lo tanto, es posible que algunos de estos términos ya no se consideren universalmente despectivos, pueden ser de uso común o pueden ser reclamados selectivamente por ciertos grupos.
alternative label: Insultos
change note: Version 4.2.0
in scheme: v3
narrower: Agî
narrower: Ali
narrower: Bading
narrower: Bakla
narrower: Bantut
narrower: Berdache
narrower: Bayot
narrower: Chakka
narrower: Dykes
narrower: Faggots
narrower: Khteuy
narrower: Fairies (Gay culture)
preferred label: Términos peyorativos
related: Deadnaming
related: LGBTQ+ discrimination
related: Harassment
related: LGBTQ+ persecutions
related: LGBTQ+ slang
related: Reclaimed terms

LGBTQ+ periodicals
type: Concept
issued: 2022-02-14
modified: 2026-02-23
comment: Publications or serials by or about LGBTQ+ people; use a more specific term if possible.
comment: Publicaciones o series escritas por o sobre personas LGBTQ+; utilícese un término más específico de ser posible.
alternative label: LGBTQ+ serials
alternative label: Periodicals (LGBTQ)
alternative label: Serials (LGBTQ)
change note: Version 4.2.0
in scheme: v3
narrower: AIDS periodicals
narrower: LGBTQ+ magazines
narrower: LGBTQ+ newsletters
narrower: LGBTQ+ newspapers
narrower: LGBTQ+ academic journals
preferred label: Revistas LGBTQ+
related: LGBTQ+ porn magazines
related: LGBTQ+ zines
related: LGBTQ+ publishers

LGBTQ+ students
type: Concept
issued: 2024-09-19
modified: 2025-02-23
comment: LGBTQ+ people who are formally engaged in learning at an educational institution of some kind.
alternative label: Students (LGBTQ)
broader: LGBTQ+ people
change note: Version 4.2.0
has top concept: LGBTQ+ people
in scheme: v3
narrower: LGBTQ+ college students
narrower: Aromantic students
narrower: Asexual students
narrower: Bisexual students
narrower: Demisexual students
narrower: Gay students
narrower: Intersex students
narrower: Greyromantic students
narrower: Lesbian students
narrower: Megasexual students
narrower: Non-binary students
narrower: Queer students
narrower: Transgender students
narrower: LGBTQ+ high school students
narrower: LGBTQ+ middle school students
narrower: LGBTQ+ elementary school students
related: Two-Spirit students
related: LGBTQ+ student organizations

LGBTQ+ bookshops
type: Concept
issued: 2019-05-14
modified: 2025-02-23
replaces: bookshopsLGBTQ
comment: Bookshops that sell materials intended for use by LGBTQ+ people or addressing LGBTQ+ topics.
comment: Librerías que venden materiales destinados a personas LGBTQ+ o que abordan temas LGBTQ+.
alternative label: Bookstores (LGBTQ)
alternative label: Bookshops (LGBTQ)
alternative label: Liberías LGBTQ
alternative label: Tiendas de libros LGBTQ+
alternative label: Tiendas de libros LGBTQ
change note: Version 4.2.0
in scheme: v3
narrower: Bisexual bookshops
narrower: Gay bookshops
narrower: Lesbian bookshops
narrower: Queer bookshops
narrower: Transgender bookshops
narrower: Women's bookshops
narrower: Asexual bookshops
narrower: Intersex bookshops
preferred label: Librerías LGBTQ+
related: LGBTQ+ books
related: LGBTQ+ press
related: Two-Spirit bookshops

Gender studies
type: Concept
issued: 2019-05-14
modified: 2026-02-24
replaces: genderStudies
comment: Interdisciplinary academic field devoted to the study and analysis of gender in a given culture, as well as representations of gender in media and popular culture.
comment: Campo académico interdisciplinario dedicado al estudio y el análisis del género en una cultura determinada, así como de las representaciones de género en los medios y la cultura popular.
change note: Version 4.2.0
in scheme: v3
narrower: Bisexual studies
narrower: Gay studies
narrower: Lesbian studies
narrower: Transgender studies
narrower: Feminist film criticism
preferred label: Estudios de género
related: Gender
related: Queer (Verb)
related: Queer studies
related: Queer theory
related: Sexuality
related: Feminist theory
related: Two-Spirit studies
related: Intersex studies
related: LGBTQ+ studies

LGBTQ+ erotic literature
type: Concept
issued: 2019-05-14
modified: 2025-02-23
replaces: eroticLiteratureLGBTQ
comment: Literary works that have erotic or sexual elements; use in reference to erotic literature focusing on LGBTQ+ characters or themes.
comment: Obras literarias que tengan elementos eróticos o sexuales; utilícese en referencia a literatura erótica centrada en personajes o temas LGBTQ+.
alternative label: Erotic literature (LGBTQ)
alternative label: Literatura erótica (LGBTQ)
broader: Erotica
broader: LGBTQ+ fiction
change note: Version 4.2.0
has top concept: Erotica
in scheme: v3
narrower: Lesbian erotic literature
narrower: Gay erotic literature
narrower: Bisexual erotic literature
narrower: Transgender erotic literature
narrower: Queer erotic literature
narrower: Asexual erotic literature
narrower: Intersex erotic literature
narrower: Demisexual erotic literature
narrower: Aromantic erotic literature
narrower: Megasexual erotic literature
narrower: Greyromantic erotic literature
narrower: Non-binary erotic literature
preferred label: Literatura erótica LGBTQ+
related: Hentai
related: Mpreg
related: Original slash fiction
related: Slash fiction
related: Māhū erotic literature
related: Two-Spirit erotic literature

LGBTQ+ films
type: Concept
issued: 2019-05-14
modified: 2025-02-23
replaces: LGBTQFilms
comment: Series of moving images edited to tell a story or capture an event; use in reference to films focusing on LGBTQ+ characters or themes.
comment: Serie de imágenes en movimiento editadas para contar una historia o capturar un evento; utilícese en referencia a películas centradas en personajes o temas LGBTQ+.
alternative label: LGBTQ films
broader: LGBTQ+ cinema
change note: Version 4.2.0
has top concept: Subcultures
in scheme: v3
narrower: LGBTQ+ home movies
narrower: Lesbian films
narrower: Gay films
narrower: Transgender films
narrower: Queer films
narrower: Bisexual films
narrower: LGBTQ+ erotic films
narrower: Intersex films
narrower: Aromantic films
narrower: Asexual films
narrower: Demisexual films
narrower: LGBTQ+ documentaries
preferred label: Películas LGBTQ+
related: LGBTQ+ porn films
related: LGBTQ+ characters
related: LGBTQ+ arts
related: LGBTQ+ film censorship
related: LGBTQ+ film festivals
related: Actorfic
related: Two-Spirit films

Official documentation
type: Concept
issued: 2019-05-14
modified: 2025-03-20
replaces: officialDocumentation
comment: Legal documents issued by a government or institution to individuals that include identifying information and, typically, grant certain legal or governmental rights and responsibilities (e.g., driver's license, birth certificate, passport).
comment: Documentos legales expedidos por un gobierno o una institución a personas que incluyen información identificativa y, normalmente, conceden ciertos derechos y responsabilidades legales o gubernamentales (por ejemplo, permiso de conducir, certificado de nacimiento, pasaporte).
broader: Legal status
change note: Version 4.2.0
has top concept: Legal status
in scheme: v3
narrower: Birth certificates
narrower: Legal name change
narrower: Civil union documents
narrower: Civil union certificates
narrower: Court orders
narrower: Domestic partnership contracts
narrower: Driver's licenses
narrower: Marriage certificates
narrower: Marriage licenses
narrower: Medical practitioners' statements
narrower: Passports
narrower: Social security cards
preferred label: Documentación oficial
related: Civil unions
related: Domestic partnerships
related: LGBTQ+ immigration rights
related: LGBTQ+ personal and family law
related: Marriage
related: LGBTQ+ immigrants
related: LGBTQ+ asylum seekers

Social privilege
type: Concept
issued: 2019-05-14
modified: 2025-02-23
replaces: socialPrivilege
comment: Special rights or immunities granted to specific people or groups that are used to falsely homogenize or discriminate against other people or groups.
comment: Derechos o inmunidades especiales otorgadas a personas o grupos específicos que se utilizan para homogeneizar o discriminar falsamente a otras personas o grupos.
change note: Version 4.2.0
in scheme: v3
preferred label: Privilegio social
related: Anti-feminism
related: White LGBTQ+ people
related: Consent
related: Dutch boys
related: Fag hags
related: Fag stags
related: Goldilocks (Gay culture)
related: Heterosexual feminism
related: Intersectionality
related: Intimate partner violence
related: LGBTQ+ people of shared ethnic or national identities
related: LGBTQ+ dominants
related: Misogyny
related: LGBTQ+ mistresses (BDSM culture)
related: Radical feminism
related: Tops (Sex)
related: Toxic masculinity
related: White feminism

Roleplay
type: Concept
issued: 2019-05-14
modified: 2025-02-23
replaces: roleplay
comment: Practice in which one or more people take on a different identity or role to fulfill a desire or fantasy.
comment: Práctica en la que una o más personas asumen una identidad o rol diferente para cumplir un deseo o una fantasía.
broader: Sex (Act)
broader: Mind play
change note: Version 4.2.0
has top concept: Sex (Act)
in scheme: v3
narrower: Age play
narrower: Gender swapping
narrower: Pups (Roleplay)
narrower: Medical play
narrower: Animal roleplay
preferred label: Juego de roles
related: Bootblacking
related: Role behavior
related: Sexual identity
related: Sexual roles
related: Furries
related: Fursuits
related: Slash roleplay
related: Power exchange
related: Uniform fetish
related: Rope bondage
related: Edge play
related: Abduction play
related: Consent play

Females
type: Concept
is replaced by: homoit0001509
issued: 2019-05-14
modified: 2022-10-25
modified: 2025-02-23
replaces: females
replaces: women
comment: Adults who self-identify as women and understand their gender in terms of Western conceptions of womanness, femaleness, and/or femininity. The term has typically been defined as adult female humans, though not all women identify with the term "female" depending on the context in which it is used.
comment: Personas adultas que se autoidentifican como mujeres y entienden su género en términos de las concepciones occidentales del ser mujer, lo femenino y/o la feminidad. El término normalmente se ha definido como humanas adultas femeninas, aunque no todas las mujeres se autoidentifican con el término "femenino" según el contexto en el que se utiliza.
broader: Gender identity
change note: Version 4.2.0
has top concept: Gender
in scheme: v3
narrower: Cissexual people
narrower: Trans women
narrower: Amazons
narrower: Bisexual women
narrower: Cisgender women
narrower: Heterosexual women
narrower: Women who have sex with women
narrower: WLW (Women Loving Women)
narrower: Pregnant women
preferred label: Women
preferred label: Mujeres
related: Cisgender people
related: Non-Euro-American gender and sexual identities
related: Feminism
related: Lesbians
related: Gender binaries
related: Males
related: Transgender people
related: Wimmin
related: Womyn
related: Women in fandom

LGBTQ+-focused businesses
type: Concept
issued: 2021-11-02
modified: 2025-02-23
comment: Businesses focusing on LGBTQ+ clientele and products related to LGBTQ+ communities.
comment: Empresas enfocadas en clientela LGBTQ+ y productos relacionados con comunidades LGBTQ+.
change note: Version 4.2.0
in scheme: v3
narrower: Lesbian-focused businesses
narrower: Gay-focused businesses
narrower: Bisexual-focused businesses
narrower: Transgender-focused businesses
narrower: Queer-focused businesses
narrower: Asexual-focused businesses
narrower: Intersex-focused businesses
preferred label: Negocios orientados a personas LGBTQ+
related: LGBTQ+ employment
related: LGBTQ+-owned businesses
related: LGBTQ+ people in the workplace
related: Police raids on LGBTQ+-related establishments
related: Two-Spirit-focused businesses

Asexual fiction
type: Concept
issued: 2021-11-09
modified: 2026-02-23
comment: Written works describing imagined events or people; use in reference to fictional works focusing on asexual characters or themes.
comment: Obras de ficción escritas donde figuran personajes asexuales o se abordan temas asexuales.
alternative label: Ace fiction
alternative label: Ficción ace
broader: LGBTQ+ fiction
change note: Version 4.2.0
has top concept: Subcultures
in scheme: v3
narrower: Asexual fantasy fiction
narrower: Asexual mystery and detective fiction
narrower: Asexual romance fiction
narrower: Asexual science fiction
narrower: Asexual historical fiction
preferred label: Ficción asexual
related: Bisexual characters
related: Bisexual fiction
related: Bisexual literature
related: Gay fiction
related: LGBTQ+ books
related: Queer fiction
related: Transgender fiction
related: Asexual authors
related: Intersex fiction
related: Aromantic fiction
related: Asexual people in fandom
related: Bisexual people in fandom
related: Asexual literature
related: Greyromantic fiction

Romantic orientation
type: Concept
issued: 2022-02-14
modified: 2025-02-23
comment: The direction or nature of an individual's romantic attraction toward others.
comment: La dirección o naturaleza de la atracción romántica de una personas hacia otras.
change note: Version 4.2.0
in scheme: v3
narrower: Aromanticism
narrower: Alloromanticism
narrower: Biromanticism
narrower: Homoromanticism
narrower: Heteroromanticism
narrower: Panromanticism
narrower: Demiromanticism
narrower: Greyromanticism
preferred label: Orientación romántica
related: Sexual orientation
related: Relationship orientation
related: Romantic minorities

LGBTQ+ podcasts
type: Concept
issued: 2026-02-23
modified: 2026-02-23
comment: A recorded series (primarily in audio, but sometimes with a video component) with recurring hosts that feature content about LGBTQ+ people and/or LGBTQ+ issues and that are available digitally for streaming or download. Podcasts are typically episodic and may feature different guests.
alternative label: Podcasts (LGBTQ)
change note: Version 4.2.0
in scheme: v4
narrower: Lesbian podcasts
narrower: Gay podcasts
narrower: Bisexual podcasts
narrower: Transgender podcasts
narrower: Queer podcasts
narrower: Non-binary podcasts
narrower: Asexual podcasts
narrower: Intersex podcasts
related: LGBTQ+ radio
related: LGBTQ+ vlogs
related: Two-Spirit podcasts

LGBTQ+ comics
type: Concept
issued: 2019-05-14
modified: 2025-03-13
replaces: comicsLGBTQ
comment: Works consisting of sequential images often accompanied by text; use in reference to comics focusing on LGBTQ+ characters or themes.
comment: Obras que consisten en imágenes secuenciales, a menudo acompañadas de texto; utilícese en referencia a cómics centrados en personajes o temas LGBTQ+.
alternative label: Comics (LGBTQ)
alternative label: Cómics (LGBTQ)
alternative label: Historietas LGBTQ+
alternative label: Historietas LGBTQ
broader: LGBTQ+ fiction
change note: Version 4.2.0
has top concept: Subcultures
in scheme: v3
narrower: LGBTQ+ cartoons
narrower: LGBTQ+ graphic novels
narrower: LGBTQ+ manga
narrower: Lesbian comics
narrower: Gay comics
narrower: Bisexual comics
narrower: Transgender comics
narrower: Queer comics
narrower: Aromantic comics
narrower: Intersex comics
narrower: Asexual comics
narrower: Demisexual comics
narrower: Megasexual comics
narrower: Greyromantic comics
narrower: Non-binary comics
preferred label: Cómics LGBTQ+
related: Māhū comics
related: Two-Spirit comics
related: LGBTQ+ superheroes
related: LGBTQ+ supervillains
related: LGBTQ+ cartoonists

Two-Spirit literature
type: Concept
issued: 2023-06-27
modified: 2025-04-23
comment: Written literary works about Two-Spirit characters or themes.
comment: Obras literarias escritas sobre la identidad dos espíritus, personajes dos espíritus o temas dos espíritus.
alternative label: 2S literature
alternative label: Two Spirit literature
alternative label: Two Spirited literature
alternative label: Two-Spirited literature
change note: Version 4.2.0
in scheme: v3
narrower: Two-Spirit fiction
narrower: Two-Spirit youth literature
narrower: Two-Spirit children's literature
narrower: Two-Spirit people's writings
narrower: Two-Spirit survival guides
preferred label: Literatura dos espíritus
related: LGBTQ+ literature
related: Two-Spirit authors
related: Two-Spirit people in literature

Erogenous body parts
type: Concept
issued: 2019-05-14
modified: 2025-02-23
replaces: erogenousBodyParts
comment: Areas of the body that are sensitive to sexual stimulation.
comment: Zonas del cuerpo sensibles a la estimulación sexual.
change note: Version 4.2.0
in scheme: v3
narrower: Breast
narrower: Butt
narrower: Clitoris
narrower: Penis
narrower: Testicle
narrower: Vagina
narrower: Nipple
narrower: Chest
narrower: Armpits
preferred label: Partes erógenas del cuerpo
related: Genitals
related: Body part fetishes

LGBTQ+ weddings
type: Concept
issued: 2019-05-14
modified: 2026-02-24
replaces: LGBTQWeddings
comment: Marriage ceremonies and the accompanying festivities; use to describe weddings in which both partners are LGBTQ+.
comment: Ceremonias matrimoniales y las festividades que las acompañan; utilícese para describir bodas en las que ambas personas son LGBTQ+.
alternative label: LGBTQ weddings
alternative label: Weddings (LGBTQ)
alternative label: Bodas LGBTQ
alternative label: Matrimonios LGBTQ
alternative label: Casamientos LGBTQ
change note: Version 4.2.0
in scheme: v3
narrower: Transgender weddings
narrower: Lesbian weddings
narrower: Gay weddings
narrower: Bisexual weddings
narrower: Non-binary weddings
narrower: Queer weddings
narrower: Intersex weddings
narrower: Asexual weddings
preferred label: Bodas LGBTQ+
related: Domestic partnership contracts
related: Marriage
related: Two-Spirit weddings
related: LGBTQ+ brides
related: LGBTQ+ grooms

Role behavior
type: Concept
issued: 2019-05-14
modified: 2025-02-23
replaces: roleBehaviour
comment: Behavior determining one's response to a social situation, as influenced by social norms; internal and external expectations; and social sanctions and rewards.
comment: Comportamiento que determina la respuesta de cada persona a una situación social, influenciado por las normas sociales; expectativas internas y externas; y sanciones y recompensas sociales.
change note: Version 4.2.0
in scheme: v3
narrower: Gender roles
narrower: Sexual roles
preferred label: Comportamiento de rol
preferred label: Role behaviour
related: Butch-femme relationships
related: Roleplay
related: Sexual identity
related: Social norms
related: Furries
related: Fursonas
related: Fursuits
related: Slash roleplay

Interviews with LGBTQ+ people
type: Concept
issued: 2025-02-25
modified: 2026-02-24
comment: Structured conversations in which one participant asks questions and the other(s) provide answers. Use to refer to interviews with LGBTQ+ subjects recorded in print, radio, television, etc.
alternative label: LGBTQ+ interviews
alternative label: Interviews (LGBTQ)
change note: Version 4.2.0
in scheme: v4
narrower: Interviews with gay men
narrower: Interviews with bisexual people
narrower: Interviews with transgender people
narrower: Interviews with intersex people
narrower: Interviews with demisexual people
narrower: Interviews with queer people
narrower: LGBTQ+ street interviews
narrower: Interviews with lesbians
narrower: Interviews with non-binary people
related: Interviews with Two-Spirit people

Queer people
type: Concept
issued: 2019-05-14
modified: 2025-02-23
replaces: queerPeople
comment: Individuals who identify with non-normative gender and/or sexual identities, typically people who are not heterosexual and/or are not cisgender. Only use for people who identify as queer.
comment: Personas que se identifican con identidades sexuales y/o de género no normativas, generalmente personas que no son heterosexuales y/o cisgénero. Utilícese únicamente para personas que se autoidentifiquen como queer.
broader: Bi+ people
broader: LGBTQ+ people
broader: Reclaimed terms
change note: Version 4.2.0
has top concept: LGBTQ+ people
in scheme: v3
narrower: Genderqueer people
narrower: Queer men
narrower: Queer youth
narrower: Queer transgender people
narrower: Queer women
narrower: Closeted queer people
narrower: Indigiqueer people
narrower: Queer college students
preferred label: Personas queer
related: Parents of queer people
related: Persecution of queer people
related: Queer characters
related: Queer families
related: Queer identity
related: Queer parents
related: Queerphobia
related: Genderqueer identity
related: Queer people in fandom
related: Queercrip
related: Culturally queer
related: Queer bodies

Relationship minorities
type: Concept
issued: 2020-12-11
modified: 2025-02-23
replaces: relationshipMinorities
comment: People whose relationship practices differ from those of the dominant culture.
comment: Personas cuyas prácticas relacionales difieren de las de la cultura dominante.
change note: Version 4.2.0
in scheme: v3
narrower: LGBTQ+ dominatrices
narrower: LGBTQ+ dominants
narrower: LGBTQ+ submissives
narrower: Non-monogamous people
narrower: Polyamorous people
narrower: Relationship anarchists
narrower: Polygamous people
preferred label: Relaciones minoritarias
related: Sexual minorities
related: Romantic minorities
related: Power exchange

Gender minorities
type: Concept
issued: 2022-02-14
modified: 2025-02-23
comment: Individuals whose gender identities and practices differ from those of the dominant culture. Use the term "Sexual minorities" for individuals whose sexual identities, orientations, and practices differ from those of the dominant culture.
comment: Personas cuyas identidades y prácticas de género difieren de las de la cultura dominante. Utilícese el término "minorías sexuales" para personas cuyas identidades, orientaciones y prácticas sexuales difieren de las personas de la cultura dominante.
alternative label: Gender variance
alternative label: Gender variant people
alternative label: Non-normative genders
change note: Version 4.2.0
in scheme: v3
narrower: Agender people
narrower: Androgynous people
narrower: Crossdressers
narrower: Demigender people
narrower: Genderfluid people
narrower: Gender non-conforming people
narrower: Genderqueer people
narrower: Pangender people
narrower: Transgender people
narrower: Transvestites
narrower: Trigender people
narrower: Transgenderqueer people
preferred label: Minorías de género
related: Gender
related: Gender diversity
related: Gender identity
related: Gender roles
related: Genderfuck
related: Sexual minorities
related: Gender transgression
related: Romantic minorities

LGBTQ+ characters
type: Concept
issued: 2019-05-14
modified: 2025-02-23
replaces: charactersLGBTQ
comment: Characters in creative works who are LGBTQ+.
comment: Personajes de obras creativas que son LGBTQ+.
alternative label: Characters (LGBTQ)
alternative label: Personajes (LGBTQ)
change note: Version 4.2.0
in scheme: v3
narrower: Bisexual characters
narrower: Gay characters
narrower: Lesbian characters
narrower: Queer characters
narrower: Transgender characters
narrower: Asexual characters
narrower: Intersex characters
narrower: LGBTQ+ superheroes
narrower: LGBTQ+ supervillains
preferred label: Personajes LGBTQ+
related: LGBTQ+ fiction
related: LGBTQ+ films
related: LGBTQ+ television
related: Two-Spirit characters
related: Drag in film

LGBTQ+ family planning
type: Concept
issued: 2019-05-14
modified: 2025-02-23
replaces: LGBTQFamilyPlanning
comment: The practice of determining the shape of a family by LGBTQ+ people.
comment: La práctica de determinar la forma de una familia por parte de personas LGBTQ+.
alternative label: LGBTQ family planning
change note: Version 4.2.0
in scheme: v3
narrower: LGBTQ+ adoption
narrower: Conception by LGBTQ+ people
preferred label: Planificación familiar LGBTQ+
related: Desire to have children
related: Egg donors
related: LGBTQ+ families
related: LGBTQ+ adoptive parenthood
related: LGBTQ+ biological parents
related: LGBTQ+ foster parenthood
related: LGBTQ+ social parenthood
related: Motherhood
related: LGBTQ+ parents
related: Fatherhood
related: Sperm donors

Relationship orientation
type: Concept
issued: 2020-12-11
modified: 2025-02-23
replaces: relationshipOrientation
comment: An individual's preference toward or away from a particular relationship model.
comment: La preferencia de una persona con respecto a un modelo relacional particular.
change note: Version 4.2.0
in scheme: v3
narrower: Monogamy
narrower: Non-monogamy
preferred label: Orientación relacional
related: Cross-cultural relationships
related: Intergenerational relationships
related: Relationship satisfaction
related: Sexual orientation
related: Sexual relationships
related: Compulsory monogamy
related: Romantic orientation
related: Polycules

LGBTQ+ authors
type: Concept
issued: 2021-11-02
modified: 2025-03-13
comment: LGBTQ+ creators of written works.
comment: Creadores de obras escritas que se conocen por ser personas LGBTQ+.
alternative label: Authors (LGBTQ)
alternative label: Autores (LGBTQ)
broader: LGBTQ+ people
change note: Version 4.2.0
has top concept: LGBTQ+ people
in scheme: v3
narrower: Lesbian authors
narrower: Gay authors
narrower: Bisexual authors
narrower: Transgender authors
narrower: Queer authors
narrower: Asexual authors
narrower: Aromantic authors
narrower: Intersex authors
narrower: Demisexual authors
narrower: Megasexual authors
narrower: Greyromantic authors
narrower: LGBTQ+ poets
preferred label: Autores LGBTQ+
related: LGBTQ+ drama
related: LGBTQ+ fiction
related: LGBTQ+ books
related: LGBTQ+ literature
related: LGBTQ+ poetry
related: LGBTQ+ literary criticism
related: LGBTQ+ autobiographies
related: Two-Spirit authors
related: LGBTQ+ fanfiction
related: LGBTQ+ people's writings

LGBTQ+ disabled people
type: Concept
issued: 2022-02-15
modified: 2025-02-23
comment: LGBTQ+ people who are disabled.
comment: Personas LGBTQ+ con discapacidad.
alternative label: Disabled people (LGBTQ)
alternative label: LGBTQ+ people with disabilities
alternative label: LGBTQ+ people with physical disabilities
alternative label: LGBTQ+ people with visual disabilities
alternative label: People with disabilities (LGBTQ)
alternative label: Personas con discapacidades (LGBTQ)
alternative label: Personas LGBTQ+ con discapacidades
alternative label: Personas LGBTQ+ con discapacidades físicas
alternative label: Personas discapacitadas (LGBTQ)
broader: LGBTQ+ people
change note: Version 4.2.0
has top concept: LGBTQ+ people
in scheme: v3
narrower: LGBTQ+ blind people
narrower: Lesbian disabled people
narrower: Gay disabled men
narrower: Bisexual disabled people
narrower: Transgender disabled people
narrower: Queer disabled people
narrower: LGBTQ+ hard of hearing people
narrower: LGBTQ+ Deaf people
narrower: LGBTQ+ wheelchair users
narrower: Non-binary disabled people
narrower: LGBTQ+ neurodivergent people
narrower: Asexual disabled people
narrower: Intersex disabled people
narrower: Demisexual disabled people
narrower: Megasexual disabled people
narrower: Aromantic disabled people
narrower: Greyromantic disabled people
preferred label: Personas LGBTQ+ discapacitadas
related: LGBTQ+ Deaf culture
related: LGBTQ+ people with chronic illnesses
related: Crip
related: LGBTQ+ people who use substances for medical purposes
related: Queercrip
related: Two-Spirit disabled people

Partners
type: Concept
issued: 2022-12-13
modified: 2025-02-23
comment: People who share a romantic, sexual, or play partnership with another person or people.
comment: Personas que comparten una relación romántica, sexual o de juego con otra persona o personas.
change note: Version 4.2.0
in scheme: v3
narrower: LGBTQ+ partners
narrower: Partners of crossdressers
narrower: Primary partners
narrower: Secondary partners
narrower: Anchor partners
narrower: Nesting partners
narrower: Partners of LGBTQ+ people
narrower: Two-Spirit partners
preferred label: Parejas
related: Partner notification
related: Partner preference
related: Partner rights
related: Significant others

LGBTQ+ pride
type: Concept
issued: 2024-10-22
modified: 2025-04-23
comment: The recognition and celebration of LGBTQ+ people and culture, thereby affirming the visibility, dignity, and diversity of LGBTQ+ communities.
alternative label: Pride (LGBTQ)
change note: Version 4.2.0
in scheme: v3
narrower: Gay pride
narrower: Lesbian pride
narrower: Pride Month
narrower: Transgender pride
narrower: Bisexual pride
narrower: Queer pride
narrower: Intersex pride
narrower: Non-binary pride
narrower: Asexual pride
related: LGBTQ+ pride flags
related: No Police at Pride
related: Two-Spirit pride

HIV/AIDS
type: Concept
issued: 2019-05-14
modified: 2025-03-20
replaces: HIVAIDS
comment: Abbreviation for human immunodeficiency virus (HIV) and acquired immunodeficiency syndrome (AIDS).
comment: Abreviación para el virus de inmunodeficiencia humana (VIH) y síndrome de inmunodeficiencia adquirida (SIDA).
alternative label: Acquired immune deficiency syndrome
alternative label: AIDS
alternative label: Acquired immunodeficiency syndrome
alternative label: HIV
alternative label: Human immunodeficiency virus
alternative label: SIDA
alternative label: Síndrome de inmunodeficiencia adquirida
alternative label: VIH
alternative label: Virus de inmunodeficiencia humana
broader: STDs
change note: Version 4.2.0
has top concept: STDs
in scheme: v3
narrower: ARC (AIDS-Related Complex)
narrower: GRID (Gay-Related Immune Deficiency)
preferred label: VIH/SIDA
related: AIDS activists
related: AIDS awareness
related: AIDS information centers
related: AIDS education
related: AIDS memorial quilts
related: AIDS memorials
related: AIDS organizations
related: AIDS periodicals
related: AIDS phobia
related: Red ribbons (AIDS)
related: LGBTQ+ peer support
related: HIV tests
related: HIV-negative people
related: HIV-positive people
related: Seroconversion
related: Serostatus
related: HIV-undetectable people
related: Kaposi's sarcoma
related: Passive immune therapy
related: HAART (Highly Active Antiretroviral Therapy)
related: Bugchasing
related: PEP (HIV)

LGBTQ+ centers
type: Concept
issued: 2019-05-14
modified: 2025-02-23
replaces: LGBTQCentres
comment: Spaces dedicated for use by members of LGBTQ+ communities engaging in various activities, including education, health and wellness services, community support and outreach, etc. Use a more specific term if possible.
comment: Espacios dedicados para el uso de miembros de comunidades LGBTQ+ que participan de diversas actividades, incluidas la educación, los servicios de salud y el bienestar, el apoyo y el alcance comunitario, etc. Utilícese un término más específico de ser posible.
change note: Version 4.2.0
in scheme: v3
narrower: LGBTQ+ community centers
narrower: LGBTQ+ information centers
narrower: LGBTQ+ health care centers
narrower: LGBTQ+ youth centers
preferred label: Centros LGBTQ+
preferred label: LGBTQ+ centres

LGBTQ+ parenthood
type: Concept
issued: 2019-05-14
modified: 2025-02-23
replaces: LGBTQParenthood
comment: The experiences of being an LGBTQ+ parent and the responsibilities involved.
comment: Las experiencias de ser padre LGBTQ+ y las responsabilidades que implica.
alternative label: Parenting
alternative label: LGBTQ parenthood
alternative label: Paternidad LGBTQ+
alternative label: Maternidad LGBTQ+
change note: Version 4.2.0
in scheme: v3
narrower: Adoptive parenthood
narrower: Biological parenthood
narrower: LGBTQ+ adoptive parenthood
narrower: LGBTQ+ adoptive parents
narrower: LGBTQ+ co-parenthood
narrower: LGBTQ+ fatherhood
narrower: LGBTQ+ foster parenthood
narrower: LGBTQ+ motherhood
narrower: LGBTQ+ social parenthood
preferred label: Maternidad y paternidad LGBTQ+
related: Desire to have children
related: LGBTQ+ families
related: Genetic parenthood
related: LGBTQ+ adoption
related: LGBTQ+ biological parents
related: LGBTQ+ foster families
related: Motherhood
related: Parental rights
related: LGBTQ+ parents
related: Fatherhood
related: Queer families

LGBTQ+ persecutions
type: Concept
issued: 2019-05-14
modified: 2025-02-23
replaces: persecutionsLGBTQ
comment: Systematic mistreatment of LGBTQ+ people on the basis of their gender or sexual identities.
comment: Maltrato sistemático a personas LGBTQ+ por su género o identidad sexual.
alternative label: Persecutions (LGBTQ)
alternative label: Persecuciones (LGBTQ)
change note: Version 4.2.0
in scheme: v3
narrower: LGBTQ+ defamation campaigns
narrower: Persecution of bisexual people
narrower: Persecution of gay men
narrower: Persecution of lesbians
narrower: Persecution of queer people
narrower: Persecution of transgender people
narrower: Persecution of intersex people
narrower: Persecution of asexual people
preferred label: Persecuciones LGBTQ+
related: Anti-LGBTQ+ violence
related: Arrests of LGBTQ+ people
related: LGBTQ+ discrimination
related: Gendercide
related: Lavender Scare
related: LGBTQ+ refugees
related: Undocumented LGBTQ+ residents
related: Slurs

LGBTQ+ youth
type: Concept
issued: 2019-05-14
modified: 2025-04-29
replaces: youthLGBTQ
comment: LGBTQ+ people who are between the ages of childhood and adulthood.
comment: Personas LGBTQ+ que se encuentran entre las edades de la niñez y la edad adulta.
alternative label: Adolescents (LGBTQ)
alternative label: Teenagers (LGBTQ)
alternative label: Teens (LGBTQ)
alternative label: Youth (LGBTQ)
alternative label: LGBTQ+ adolescents
alternative label: LGBTQ+ teenagers
alternative label: LGBTQ+ teens
alternative label: Adolescentes LGBTQ+
alternative label: Juventud (LGBTQ)
alternative label: Jóvenes (LGBTQ)
alternative label: Jóvenes LGBTQ+
alternative label: Juventud LGBTQ
alternative label: Adolescentes (LGBTQ)
broader: Youth
change note: Version 4.2.0
has top concept: Youth
in scheme: v3
narrower: Bisexual youth
narrower: Gay and lesbian youth
narrower: Lesbian youth
narrower: LGBTQ+ unhoused youth
narrower: Queer youth
narrower: Transgender youth
narrower: Non-binary youth
narrower: Asexual youth
narrower: Aromantic youth
narrower: Demisexual youth
narrower: Megasexual youth
narrower: Greyromantic youth
narrower: LGBTQ+ youth survivors of bullying
narrower: LGBTQ+ youth victims of bullying
preferred label: Juventud LGBTQ+
related: Heterosexual youth
related: Intersex youth
related: Schools for LGBTQ+ youth
related: LGBTQ+ youth centers
related: LGBTQ+ youth literature
related: Gender creative
related: Gender dysphoria in youth
related: Two-Spirit youth
related: Social work with LGBTQ+ youth

LGBTQ+-owned businesses
type: Concept
issued: 2021-11-02
modified: 2025-02-23
comment: Businesses owned by LGBTQ+ people.
comment: Empresas pertenecientes a personas LGBTQ+.
alternative label: LGBTQ-owned businesses
change note: Version 4.2.0
in scheme: v3
narrower: Lesbian-owned businesses
narrower: Gay-owned businesses
narrower: Bisexual-owned businesses
narrower: Transgender-owned businesses
narrower: Queer-owned businesses
narrower: Asexual-owned businesses
narrower: Intersex-owned businesses
preferred label: Negocios propiedad de personas LGBTQ+
related: LGBTQ+ employment
related: LGBTQ+-focused businesses
related: Lesbian-focused businesses
related: Gay-focused businesses
related: Bisexual-focused businesses
related: Transgender-focused businesses
related: Queer-focused businesses
related: LGBTQ+ people in the workplace
related: Police raids on LGBTQ+-related establishments
related: Two-Spirit-owned businesses

Bisexual people
type: Concept
issued: 2019-05-14
modified: 2025-02-23
replaces: bisexualPeople
comment: Individuals who are romantically and/or sexually attracted to more than one gender and who identify as bisexual; do not use to describe pansexual or polysexual people unless they also use the term bisexual.
comment: Padres y/o madres que son bisexuales.
alternative label: Bisexuals
alternative label: Madres bisexuales
alternative label: Padres bisexuales
broader: Bi+ people
broader: LGBTQ+ people
broader: Sexual minorities
change note: Version 4.2.0
has top concept: LGBTQ+ people
in scheme: v3
narrower: Bisexual children
narrower: Bisexual men
narrower: Bisexual parents
narrower: Bisexual youth
narrower: Bisexual women
narrower: Closeted bisexual people
narrower: Older bisexual people
narrower: Bisexual college students
preferred label: Madres y padres bisexuales
related: Biphobia
related: Bisexual bars
related: Bisexual beaches
related: Bisexual bookshops
related: Bisexual characters
related: Bisexual community
related: Bisexual community centers
related: Bisexual families
related: Bisexual identity
related: Parents of bisexual people
related: Bisexuality
related: Pansexual people
related: Persecution of bisexual people
related: Allosexuality
related: Bisexual people in fandom

LGBTQ+ biographies
type: Concept
issued: 2020-06-03
modified: 2025-02-23
replaces: biographiesLGBTQ
comment: Written accounts of the lives of LGBTQ+ people. For written accounts of LGBTQ+ people's lives written by the subject, use "LGBTQ+ autobiographies."
comment: Relatos escritos de la vida de personas conocidas por ser LGBTQ+.
alternative label: Biographies of authors
alternative label: Biographies (LGBTQ)
alternative label: Biografías (LGBTQ)
alternative label: Biografías de autores LGBTQ
change note: Version 4.2.0
in scheme: v3
narrower: Lesbian biographies
narrower: Gay biographies
narrower: Bisexual biographies
narrower: Transgender biographies
narrower: Queer biographies
narrower: Aromantic biographies
narrower: Asexual biographies
narrower: Demisexual biographies
narrower: Megasexual biographies
narrower: Greyromantic biographies
narrower: Intersex biographies
preferred label: Biografías LGBTQ+
related: LGBTQ+ autobiographies
related: LGBTQ+ history
related: Two-Spirit biographies

LGBTQ+ political groups
type: Concept
issued: 2024-09-19
modified: 2025-02-23
comment: Organized groups centered on political change and action for LGBTQ+ rights that may or may not be aligned with major political parties.
alternative label: Political groups (LGBTQ)
change note: Version 4.2.0
in scheme: v3
narrower: Bisexual political groups
narrower: Queer political groups
narrower: Megasexual political groups
narrower: Demisexual political groups
narrower: Intersex political groups
narrower: Asexual political groups
narrower: Non-binary political groups
narrower: Aromantic political groups
narrower: Transgender political groups
narrower: Greyromantic political groups
narrower: Lesbian political groups
related: Two-Spirit political groups

Gender roles
type: Concept
issued: 2019-05-14
modified: 2025-03-20
replaces: genderRoles
comment: Socially-determined rules or standards for gendered behaviors. Some LGBTQ+ people identify with gender roles that exist outside of the gender binary (e.g., butches, femmes, twinks, bears). Use the term "Gender role stereotypes" to describe widely held but oversimplified or offensive ideas regarding gender roles.
comment: Reglas o estándares socialmente determinados para los comportamientos de género. Algunas personas LGBTQ+ se identifican con roles de género que existen fuera del binario de género (por ejemplo, marimachas, femmes, twinks, osos). Utilícese el término "Estereotipos de roles de género" para describir ideas generalizadas pero demasiado simplificadas u ofensivas sobre los roles de género.
alternative label: Papeles de género
broader: Role behavior
change note: Version 4.2.0
has top concept: Role behavior
in scheme: v3
narrower: Bears (Gay culture)
narrower: Butches
narrower: Cubs (Gay culture)
narrower: Dandies
narrower: Femmes
narrower: Machismo
narrower: Otters (Gay culture)
narrower: Sissies
narrower: Tomboys
narrower: Twinks (Gay culture)
narrower: Wolves (Gay culture)
narrower: Gender role stereotypes
narrower: Ky-ky (Gender role)
preferred label: Roles de género
related: Androgyny
related: Femininities
related: Gender bending
related: Gender binaries
related: Gender expression
related: Gender identity
related: Gender relations
related: Gender swapping
related: Masculinities
related: Gender creative
related: Gender transgression
related: Gender minorities
related: Gender ambiguity

LGBTQ+ parents
type: Concept
issued: 2019-05-14
modified: 2025-02-23
replaces: parentsLGBTQ
comment: LGBTQ+ people who are parents.
comment: Personas LGBTQ+ que son padres y/o madres.
alternative label: Parents (LGBTQ)
alternative label: Padres LGBTQ+
alternative label: Madres LGBTQ+
broader: LGBTQ+ families
broader: Parents
change note: Version 4.2.0
has top concept: LGBTQ+ families
in scheme: v3
narrower: Bisexual parents
narrower: Gay parents
narrower: Lesbian parents
narrower: LGBTQ+ adoptive parents
narrower: LGBTQ+ biological parents
narrower: LGBTQ+ birth parents
narrower: LGBTQ+ co-parents
narrower: LGBTQ+ foster parents
narrower: LGBTQ+ single parents
narrower: Queer parents
narrower: Transgender parents
narrower: Aromantic parents
narrower: Asexual parents
narrower: Intersex parents
narrower: LGBTQ+ fathers
narrower: LGBTQ+ mothers
narrower: Non-binary parents
preferred label: Madres y padres LGBTQ+
related: LGBTQ+ adoption
related: LGBTQ+ adoptive parenthood
related: Conception by LGBTQ+ people
related: LGBTQ+ family planning
related: LGBTQ+ foster families
related: LGBTQ+ parenthood
related: Bothies
related: LGBTQ+ family generations

LGBTQ+ autobiographies
type: Concept
issued: 2021-11-02
modified: 2025-02-23
comment: Accounts of LGBTQ+ peoples' lives written by those people. For written accounts of LGBTQ+ people's lives that were not written by the subject, use "LGBTQ+ biographies."
comment: Relatos de vida de personas escritos por esas mismas personas; utilícese para autobiografías escritas por autores LGBTQ+.
alternative label: Autobiographies (LGBTQ)
alternative label: LGBTQ+ autobios
alternative label: LGBTQ+ memoirs
alternative label: Autobiografías LGBTQ
alternative label: Memorias LGBTQ
alternative label: Memorias LGBTQ+
change note: Version 4.2.0
in scheme: v3
narrower: Lesbian autobiographies
narrower: Gay autobiographies
narrower: Bisexual autobiographies
narrower: Transgender autobiographies
narrower: Queer autobiographies
narrower: Aromantic autobiographies
narrower: Asexual autobiographies
narrower: Demisexual autobiographies
narrower: Megasexual autobiographies
narrower: Greyromantic autobiographies
narrower: Intersex autobiographies
preferred label: Autobiografías LGBTQ+
related: LGBTQ+ biographies
related: LGBTQ+ authors
related: LGBTQ+ history
related: Two-Spirit autobiographies

Indigenous LGBTQ+ people
type: Concept
issued: 2019-05-14
modified: 2025-04-24
replaces: LGBTQIndigenousPeople
comment: LGBTQ+ people who are part of an Indigenous people, or culturally distinct ethnic group whose members are directly descended from the earliest known inhabitants of a particular region and, to some extent, maintain the language and culture of those people. Only use to describe people who identify as Indigenous; use more specific terms whenever possible.
comment: Personas LGBTQ+ que forman parte de un pueblo indígena o grupo étnico culturalmente distinto cuyos miembros descienden directamente de los primeros habitantes conocidos de una región en particular y, hasta cierto punto, mantienen el idioma y la cultura de esas personas. Utilícese únicamente para describir a personas que se autoidentifiquen como indígenas; utilícese términos más específicos siempre que sea posible.
alternative label: Indigenous people (LGBTQ)
alternative label: LGBTQ+ Indigenous people
alternative label: Personas indígenas LGBTQ+
broader: LGBTQ+ people of color
broader: LGBTQ+ people of shared ethnic or national identities
change note: Version 4.2.0
has top concept: LGBTQ+ people
in scheme: v3
narrower: Aboriginal Australian LGBTQ+ people
narrower: Inuit LGBTQ+ people
narrower: Takatāpui
narrower: Papuan LGBTQ+ people
narrower: Native American LGBTQ+ people
narrower: Indigiqueer people
narrower: Kānaka Maoli LGBTQ+ people
narrower: Indigenous lesbians
narrower: Indigenous gay men
narrower: Indigenous bisexual people
narrower: Indigenous transgender people
narrower: Indigenous queer people
narrower: Indigenous intersex people
narrower: Indigenous asexual people
narrower: Palestinian LGBTQ+ people
narrower: Central American Indigenous LGBTQ+ people
narrower: South American Indigenous LGBTQ+ people
narrower: Indigenous non-binary people
narrower: Pacific Islander American LGBTQ+ people
narrower: Two-Spirit people
narrower: Ainu LGBTQ+ people
narrower: Ryukyuan LGBTQ+ people
narrower: Sámi LGBTQ+ people
preferred label: Personas LGBTQ+ indígenas
related: Ritual homosexuality
related: Police harassment of Indigenous LGBTQ+ people
related: Non-Euro-American gender and sexual identities

Living arrangements
type: Concept
issued: 2019-05-14
modified: 2025-02-23
replaces: livingArrangements
comment: Structure or composition of an individual's household or living environment, including the number of household members and their relationships to each other.
comment: Estructura o composición del hogar o entorno de vida de una persona, incluido el número de miembros del hogar y sus relaciones entre sí.
change note: Version 4.2.0
in scheme: v3
narrower: Civil unions
narrower: Domestic partnerships
narrower: Marriage
preferred label: Arreglos de vivienda
related: Domestic partnership contracts

LGBTQ+ literary criticism
type: Concept
issued: 2020-06-03
modified: 2025-02-23
replaces: literaryCriticismLGBTQ
comment: The study, evaluation, and interpretation of literary works focusing on LGBTQ+ characters or themes; can also include interpretation of literature through the lens and frameworks associated with LGBTQ+ studies.
comment: El estudio, la evaluación y la interpretación de obras literarias centradas en personajes o temas LGBTQ+; también puede incluir la interpretación de la literatura a través del lente y los marcos teóricos asociados con los estudios LGBTQ+.
alternative label: Literary criticism (LGBTQ)
alternative label: Crítica literaria LGBTQ
change note: Version 4.2.0
in scheme: v3
narrower: Lesbian literary criticism
narrower: Gay literary criticism
narrower: Bisexual literary criticism
narrower: Transgender literary criticism
narrower: Queer literary criticism
narrower: Aromantic literary criticism
narrower: Asexual literary criticism
narrower: Demisexual literary criticism
narrower: Megasexual literary criticism
narrower: Greyromantic literary criticism
narrower: Intersex literary criticism
preferred label: Crítica literaria LGBTQ+
related: LGBTQ+ literature
related: LGBTQ+ authors
related: Two-Spirit literary criticism
related: LGBTQ+ film criticism
related: Feminist film criticism

Leather community
type: Concept
issued: 2019-05-14
modified: 2025-02-23
replaces: leatherCommunity
comment: An LGBTQ+ subculture that celebrates sexual freedom, kinks and fetishes with its own fashions (especially leather garments), clubs, and events.
comment: Subcultura LGBTQ+ que celebra la libertad sexual, los kinks y los fetiches con su propia moda (especialmente prendas de cuero), clubes y eventos.
alternative label: Leather scene
alternative label: Leather lifestyle
alternative label: Leather
broader: LGBTQ+ communities
broader: Subcultures
change note: Version 4.2.0
has top concept: LGBTQ+ communities
in scheme: v3
narrower: Bootblacking
narrower: Leather daddies
narrower: Leather families
narrower: Leather mommies
narrower: Leathermen
narrower: Leatherwomen
narrower: Pups (Roleplay)
narrower: Pup play
narrower: Leather people
narrower: Leatherboys
narrower: Leathergirls
preferred label: Comunidad leather
related: Kink community
related: LGBTQ+ dominatrices
related: BDSM
related: LGBTQ+ motorcycle clubs
related: LGBTQ+ dominants
related: Rubber and latex community
related: LGBTQ+ submissives
related: Leather bars
related: Power exchange
related: Kink accessories
related: Leather fetish
related: Leather and kink conventions
related: Kinky people
related: Leather and kink clubs
related: Title contests
related: Anti-kink discrimination

Lesbians
type: Concept
issued: 2019-05-14
modified: 2025-04-29
replaces: lesbians
comment: Individuals who self-identify as lesbian and belong to lesbian communities. The term has been predominately used to describe women who are exclusively or primarily romantically and/or sexually attracted to other women. However, not all lesbians are women, and gender non-conforming people who belong to lesbian communities have often identified as lesbian.
comment: Personas que se identifican como lesbianas y pertenecen a comunidades lesbianas. El término se ha utilizado predominantemente para describir a mujeres que se sienten exclusiva o principalmente atraídas romántica y/o sexualmente por otras mujeres. Sin embargo, no todas las lesbianas son mujeres, y las personas disidentes de género que pertenecen a comunidades lésbicas a menudo se han identificado como lesbianas.
alternative label: Gay women
alternative label: Lesbian women
alternative label: Lesbian people
alternative label: Mujeres gay
alternative label: Personas lesbianas
alternative label: Mujeres lesbianas
broader: LGBTQ+ people
broader: Sexual minorities
change note: Version 4.2.0
has top concept: LGBTQ+ people
in scheme: v3
narrower: Baby dykes
narrower: Closeted lesbians
narrower: Lesbian youth
narrower: Lipstick lesbians
narrower: Older lesbians
narrower: Lesbian college students
narrower: Lesbians with breast cancer
preferred label: Lesbianas
related: Amazons
related: Anti-lesbian violence
related: Bois
related: Butches
related: Dykes
related: Fricatrices
related: Lesbian-gay relations
related: Homosexuality
related: Lesbian characters
related: Lesbian identity
related: Lesbianism
related: Parents of lesbians
related: Lesbophobia
related: Persecution of lesbians
related: Queer women
related: Soft butches
related: Stone butches
related: Tribades
related: Females
related: Women who have sex with women
related: Lesbians in fandom

LGBTQ+ websites
type: Concept
issued: 2019-05-14
modified: 2025-02-23
replaces: LGBTQWebsites
comment: Public web pages that primarily address LGBTQ+ communities and issues, as well as web pages intended for use by LGBTQ+ people.
comment: Páginas web públicas que abordan principalmente comunidades y cuestiones LGBTQ+, así como páginas web destinadas a personas LGBTQ+.
alternative label: LGBTQ websites
alternative label: Sitios web LGBTQ
change note: Version 4.2.0
in scheme: v3
narrower: LGBTQ+ dating websites
narrower: Lesbian websites
narrower: Gay websites
narrower: Bisexual websites
narrower: Transgender websites
narrower: Queer websites
narrower: Intersex websites
narrower: Aromantic websites
narrower: Asexual websites
narrower: Demisexual websites
narrower: Greyromantic websites
narrower: Megasexual websites
narrower: Non-binary websites
preferred label: Sitios web LGBTQ+
related: Internet forums
related: LGBTQ+ social media
related: Two-Spirit websites

LGBTQ+ solidarity
type: Concept
issued: 2024-04-16
modified: 2025-02-23
comment: A sense of fellowship and overall unity of purpose, political interest, and/or community sympathies based on shared experiences as LGBTQ+ people.
alternative label: Solidarity (LGBTQ+)
change note: Version 4.2.0
in scheme: v3
narrower: Lesbian solidarity
narrower: Gay solidarity
narrower: Bisexual solidarity
narrower: Transgender solidarity
narrower: Queer solidarity
narrower: Intersex solidarity
narrower: Asexual solidarity
narrower: Aromantic solidarity
narrower: Demisexual solidarity
narrower: Greyromantic solidarity
narrower: Dyke solidarity
narrower: Megasexual solidarity
narrower: Non-binary solidarity
related: LGBTQ+ activism
related: Allies
related: Two-Spirit solidarity

Gay men
type: Concept
issued: 2019-05-14
modified: 2025-02-23
replaces: gayMen
comment: Men who self-identify as gay and belong to gay communities. Predominately used to describe men who are exclusively or primarily romantically and/or sexually attracted to other men. While "gay" is often used as an identifier by people of all genders, this term specifically refers to gay men.
comment: Hombres gay que forman parte de la escena BDSM y asumen el rol de amos en las relaciones sexuales con una dinámica amo/esclavo.
alternative label: Gays
broader: LGBTQ+ people
broader: Males
broader: Sexual minorities
change note: Version 4.2.0
has top concept: LGBTQ+ people
in scheme: v3
narrower: Baby gays
narrower: Bears (Gay culture)
narrower: Clones (Gay culture)
narrower: Closeted gay men
narrower: Gay parents
narrower: Macho men
narrower: Older gay men
narrower: Otters (Gay culture)
narrower: Pups (Roleplay)
narrower: Queens (Gay culture)
narrower: Twinks (Gay culture)
narrower: Wolves (Gay culture)
narrower: Gay college students
preferred label: Amos gay
related: Faggots
related: Gay boys
related: Gay characters
related: Gay community
related: Gay identity
related: Lesbian-gay relations
related: Parents of gay men
related: Gay and lesbian youth
related: Homophobia
related: Homosexuality
related: Men who have sex with men
related: Persecution of gay men
related: Queer men
related: Sea queens
related: Gay men in fandom

Sexual preference
type: Concept
issued: 2019-05-14
modified: 2025-02-23
replaces: sexualPreference
comment: An enduring pattern of sexual attraction towards a certain sex or multiple sexes, as well as characterizations, objects, situational fantasies, or behaviors; generally understood to be either or both biologically determined and culturally and/or sociologically dictated.
comment: Patrón duradero de atracción sexual hacia un sexo determinado o múltiples sexos, así como hacia caracterizaciones, objetos, fantasías situacionales o comportamientos; generalmente se entiende que está determinado tanto biológicamente como cultural y/o sociológicamente.
change note: Version 4.2.0
in scheme: v3
narrower: Sadomasochism
narrower: Demisexual people
narrower: BDSM
narrower: Masochism
narrower: Partner preference
narrower: Pederasts
narrower: Sadism
narrower: Sexual roles
narrower: Polysexuality
narrower: Chasers
preferred label: Preferencias sexuales
related: Casual sex
related: Conversion therapy
related: Pederasty
related: Sexual autonomy
related: Sexual behavior change
related: Sexual diversity
related: Sexual identity
related: Sexual inversion
related: Sexual minorities
related: Sexual orientation
related: Sexual relationships
related: Significant others
related: Situational sexual behavior
related: Virginity
related: Monosexuality
related: Monosexual people
related: Allosexual people
related: Sexual fluidity

LGBTQ+ slang
type: Concept
issued: 2019-05-14
modified: 2026-02-23
replaces: slangLGBTQ
comment: Colloquial or informal language related to LGBTQ+ people or used by LGBTQ+ people.
comment: Lenguaje coloquial o informal relacionado con personas LGBTQ+ o utilizado por personas LGBTQ+.
alternative label: Slang (LGBTQ)
alternative label: Jerga LGBTQ
alternative label: Argot LGBTQ
change note: Version 4.2.0
in scheme: v3
narrower: Bisexual slang
narrower: Gay slang
narrower: Lesbian slang
narrower: Poppers
narrower: Queer slang
narrower: Transgender slang
narrower: Reclaimed terms
narrower: Queerspawn
narrower: Bothies
narrower: Asexual slang
narrower: Intersex slang
narrower: Kiki (Social Gathering)
preferred label: Jerga LGBTQ+
related: Slurs
related: Fandom terminology
related: Slash terminology
related: Two-Spirit slang
related: Lavender linguistics
related: Queer linguistics
related: LGBTQ+ hand signs (Language)

Social movements
type: Concept
issued: 2019-05-14
modified: 2025-02-23
replaces: socialMovements
comment: Organized efforts by groups of people to achieve certain political, social, economic, or cultural goals. Social movements are often intended to carry out, resist, or undo social changes.
comment: Esfuerzos organizados por grupos de personas para lograr ciertos objetivos políticos, sociales, económicos o culturales. Los movimientos sociales a menudo tienen como objetivo llevar a cabo, resistir o deshacer cambios sociales.
change note: Version 4.2.0
in scheme: v3
narrower: Ex-gay movement
narrower: Women's movement
narrower: Men's movement
narrower: LGBTQ+ movement
narrower: Leather and kink activism
narrower: Defund the police movement
narrower: Police abolitionist movement
narrower: Black Lives Matter movement
narrower: Anti-gender movement
preferred label: Movimientos sociales
related: Intersex movement

Theories
type: Concept
issued: 2019-05-14
modified: 2025-04-23
replaces: theories
comment: Systems of ideas intended to explain a particular phenomenon.
comment: Sistemas de ideas destinados a explicar un fenómeno particular.
change note: Version 4.2.0
in scheme: v3
narrower: Essentialism
narrower: Etiology
narrower: Queer theory
narrower: Social constructionism
narrower: Critical race theory
narrower: Feminist theory
narrower: Womanism
narrower: Lavender linguistics
narrower: Queer linguistics
narrower: Decolonial theory
narrower: Compulsory heterosexuality
preferred label: Teorías

LGBTQ+ information professionals
type: Concept
issued: 2024-10-22
modified: 2025-02-23
comment: LGBTQ+ people whose profession involves managing information by collecting, organizing, storing and disseminating it. This can include but is not limited to librarians, archivists, metadata and IT workers, web developers, and chief information officers. Use more specific terms when possible.
alternative label: Information professionals (LGBTQ+)
change note: Version 4.2.0
in scheme: v3
narrower: LGBTQ+ archivists
narrower: LGBTQ+ librarians
related: Information provision
related: LGBTQ+ book censorship
related: Two-Spirit information professionals

Anti-LGBTQ+ violence
type: Concept
issued: 2019-05-14
modified: 2025-02-23
replaces: antiLGBTQViolence
comment: Behavior involving physical force intended to harm or kill LGBTQ+ people on the basis of their identity.
comment: Comportamiento que involucra fuerza física destinada a hacer daño o a matar a personas LGBTQ+ en base a su identidad.
alternative label: Anti-LGBTQ violence
alternative label: Violencia anti-LGBTQ
change note: Version 4.2.0
in scheme: v3
narrower: Anti-bisexual violence
narrower: Anti-gay violence
narrower: Anti-lesbian violence
narrower: Anti-queer violence
narrower: Anti-transgender violence
narrower: Murders of LGBTQ+ people
narrower: LGBTQ+ domestic violence
narrower: Anti-Two-Spirit violence
narrower: Anti-intersex violence
narrower: Police violence toward LGBTQ+ people
narrower: Anti-asexual violence
preferred label: Violencia anti-LGBTQ+
related: LGBTQ+ victims of hate crimes
related: LGBTQ+ victims of rape
related: LGBTQ+ victims of sexual abuse
related: LGBTQ+ persecutions
related: Sexual harassment
related: Sexual violence
related: Survivors of anti-LGBTQ+ violence

LGBTQ+ discrimination
type: Concept
issued: 2019-05-14
modified: 2026-02-26
replaces: discriminationLGBTQ
comment: The unjust or prejudicial treatment of LGBTQ+ people or communities due to their sexual or gender identities; may include the denial of legal rights, employment, and housing.
comment: El trato injusto o perjudicial hacia personas o comunidades LGBTQ+ debido a sus identidades sexuales o de género; puede incluir la negación de derechos legales, empleo y vivienda.
alternative label: Discrimination (LGBTQ)
alternative label: Discriminación (LGBTQ)
change note: Version 4.2.0
in scheme: v3
narrower: Anti-bisexual discrimination
narrower: Anti-gay discrimination
narrower: Anti-lesbian discrimination
narrower: Anti-queer discrimination
narrower: Anti-transgender discrimination
narrower: Anti-Two-Spirit discrimination
narrower: Anti-intersex discrimination
narrower: Anti-asexual discrimination
preferred label: Discriminación LGBTQ+
related: Anti-discrimination law
related: Intolerance towards LGBTQ+ people
related: Harassment
related: Lavender Scare
related: LGBTQ+ persecutions
related: Amatonormativity
related: Compulsory sexuality
related: Mononormativity
related: Slurs
related: Stigma
related: LGBTQ+ criminalization
related: Gentrification
related: Lavender marriages
related: Libraries and LGBTQ+ people

LGBTQ+ fiction
type: Concept
issued: 2019-05-14
modified: 2026-02-23
replaces: fictionLGBTQ
comment: Works of fiction featuring LGBTQ+ characters or themes.
comment: Obras de ficción con personajes o temas LGBTQ+.
alternative label: Fiction (LGBTQ)
broader: LGBTQ+ literature
change note: Version 4.2.0
has top concept: Subcultures
in scheme: v3
narrower: Bisexual fiction
narrower: Gay fiction
narrower: Lesbian fiction
narrower: LGBTQ+ comics
narrower: LGBTQ+ mystery and detective fiction
narrower: LGBTQ+ erotic literature
narrower: LGBTQ+ fantasy fiction
narrower: LGBTQ+ graphic novels
narrower: LGBTQ+ science fiction
narrower: Queer fiction
narrower: Transgender fiction
narrower: LGBTQ+ horror fiction
narrower: LGBTQ+ romance fiction
narrower: LGBTQ+ short stories
narrower: Intersex fiction
narrower: Aromantic fiction
narrower: Asexual fiction
narrower: Demisexual fiction
narrower: Megasexual fiction
narrower: Greyromantic fiction
narrower: Non-binary fiction
narrower: LGBTQ+ historical fiction
preferred label: Ficción LGBTQ+
related: LGBTQ+ characters
related: LGBTQ+ authors
related: Two-Spirit fiction
related: Bury your gays
related: Fanfiction
related: LGBTQ+ fanfiction
related: LGBTQ+ headcanons
related: Original slash fiction
related: Māhū fiction

Legal status
type: Concept
issued: 2019-05-14
modified: 2025-02-23
replaces: legalStatus
comment: The status or standing of an individual or thing within a certain legal jurisdiction, including the individual's or thing's legal rights and privileges; typically used in reference to citizenship or marriage.
comment: El estatus o la posición de una persona o cosa dentro de una determinada jurisdicción legal, incluidos los derechos y privilegios legales de la persona o cosa; normalmente se utiliza en referencia a la ciudadanía o al matrimonio.
alternative label: Status legal
change note: Version 4.2.0
in scheme: v3
narrower: LGBTQ+ immigration rights
narrower: Official documentation
narrower: Parental rights
narrower: Partner rights
narrower: LGBTQ+ people in the military
preferred label: Estatus legal
related: Civil unions
related: Detention of LGBTQ+ people
related: Law
related: LGBTQ+ refugees
related: Marital status
related: Undocumented LGBTQ+ residents

LGBTQ+ arts
type: Concept
issued: 2019-05-14
modified: 2025-04-23
replaces: LGBTQArts
comment: Umbrella term for different forms of creative activity, including visual, material, and performing arts, by LGBTQ+ artists or about LGBTQ+ topics and communities. Use a more specific term if possible.
comment: Término general para diferentes formas de actividad creativa, incluidas las artes visuales, materiales y escénicas, realizadas por artistas LGBTQ+ o sobre temas y comunidades LGBTQ+. Utilícese un término más específico de ser posible.
alternative label: LGBTQ arts
alternative label: Artes LGBTQ
broader: LGBTQ+ culture
change note: Version 4.2.0
has top concept: Subcultures
in scheme: v3
narrower: LGBTQ+ musicals
narrower: LGBTQ+ cinema
narrower: LGBTQ+ erotic art
narrower: Transgender art
narrower: Gay art
narrower: Lesbian art
narrower: Bisexual art
narrower: Queer art
narrower: Intersex art
narrower: Aromantic art
narrower: Asexual art
narrower: Demisexual art
narrower: LGBTQ+ operas
narrower: LGBTQ+ music
narrower: LGBTQ+ video games
preferred label: Artes LGBTQ+
related: LGBTQ+ actors
related: LGBTQ+ artists
related: Drag
related: Erotica
related: LGBTQ+ art censorship
related: LGBTQ+ choruses
related: LGBTQ+ films
related: LGBTQ+ musicians
related: LGBTQ+ plays
related: LGBTQ+ literature
related: Nude photographs
related: Nude art
related: LGBTQ+ theater
related: LGBTQ+ cultural heritage institutions
related: Slash art
related: Two-Spirit art
related: LGBTQ+ people in arts and media

LGBTQ+ clubs and organizations
type: Concept
issued: 2019-05-14
modified: 2025-02-23
replaces: LGBTQClubs
comment: Organized clubs and groups composed primarily of LGBTQ+ people.
comment: Grupos u organizaciones de personas LGBTQ+ dedicadas a un interés o una actividad particular.
alternative label: LGBTQ+ clubs
alternative label: Clubs (LGBTQ)
alternative label: LGBTQ+ organizations
alternative label: Organizations (LGBTQ)
alternative label: Clubs and organizations (LGBTQ)
alternative label: Clubes LGBTQ
change note: Version 4.2.0
in scheme: v3
narrower: LGBTQ+ book clubs
narrower: LGBTQ+ motorcycle clubs
narrower: LGBTQ+ sports clubs
narrower: LGBTQ+ student organizations
narrower: Leather and kink clubs
narrower: LGBTQ+ older people's organizations
narrower: Lesbian organizations
narrower: Gay organizations
narrower: Bisexual organizations
narrower: Transgender organizations
narrower: Queer organizations
narrower: Intersex organizations
narrower: Non-binary organizations
preferred label: Clubes LGBTQ+
related: LGBTQ+ choruses
related: AIDS organizations
related: Organizations for sexual research and sexual reform
related: Two-Spirit organizations

LGBTQ+ phobia
type: Concept
issued: 2019-05-14
modified: 2025-02-23
replaces: LGBTQPhobia
comment: Antagonism or disgust directed towards LGBTQ+ identities or people due to their sexuality or gender, perceived or actual. LGBTQ+ phobia can include denial of the existence of certain LGBTQ+ identities, stereotypes, verbal harassment, and physical violence.
comment: Antagonismo o disgusto dirigido hacia identidades o personas LGBTQ+ debido a su sexualidad o género, percibido o real. La fobia LGBTQ+ puede incluir la negación de la existencia de ciertas identidades LGBTQ+, estereotipos, acoso verbal y violencia física.
alternative label: LGBTQ phobia
alternative label: Fobia LGBTQ
change note: Version 4.2.0
in scheme: v3
narrower: Biphobia
narrower: Genderism
narrower: Homophobia
narrower: Intersexphobia
narrower: Lesbophobia
narrower: Queerphobia
narrower: Transphobia
preferred label: Fobia LGBTQ+
related: AIDS phobia
related: Bullying
related: Anti-Two-Spirit discrimination
related: Internalized oppression

LGBTQ+ literature
type: Concept
issued: 2019-05-14
modified: 2025-04-23
replaces: literatureLGBTQ
comment: Written literary works featuring LGBTQ+ characters and themes.
comment: Obras literarias escritas con personajes y temas LGBTQ+.
alternative label: Literature (LGBTQ)
alternative label: Literatura LGBTQ
broader: LGBTQ+ culture
change note: Version 4.2.0
has top concept: Subcultures
in scheme: v3
narrower: Bisexual literature
narrower: LGBTQ+ drama
narrower: LGBTQ+ fiction
narrower: Gay literature
narrower: Lesbian literature
narrower: LGBTQ+ poetry
narrower: Queer literature
narrower: Transgender literature
narrower: LGBTQ+ youth literature
narrower: Aromantic literature
narrower: Asexual literature
narrower: Demisexual literature
narrower: Megasexual literature
narrower: Greyromantic literature
narrower: Intersex literature
narrower: LGBTQ+ children's literature
narrower: LGBTQ+ essays
narrower: LGBTQ+ people's writings
narrower: LGBTQ+ survival guides
preferred label: Literatura LGBTQ+
related: LGBTQ+ arts
related: LGBTQ+ books
related: LGBTQ+ literary awards
related: LGBTQ+ literary salons
related: LGBTQ+ press
related: Queer (Verb)
related: LGBTQ+ literary criticism
related: LGBTQ+ authors
related: LGBTQ+ cultural heritage institutions
related: Queer coding
related: Two-Spirit literature
related: LGBTQ+ librarians
related: LGBTQ+ people in literature

Health care for LGBTQ+ people
type: Concept
issued: 2019-05-14
modified: 2026-03-05
replaces: healthCareForLGBTQPeople
comment: Organized measures taken for the maintenance or improvement of health via the prevention, diagnosis, treatment, and/or cure of disease, illness, injury, or other conditions; use in reference to health care addressing the particular needs of LGBTQ+ individuals or communities.
comment: Medidas organizadas tomadas para el mantenimiento o la mejora de la salud a través de la prevención, el diagnóstico, el tratamiento y/o la cura de enfermedades, dolencias, lesiones u otras condiciones; utilícese en referencia a la atención médica que aborda las necesidades particulares de personas o comunidades LGBTQ+.
alternative label: Medical care for LGBTQ people
alternative label: Health care for LGBTQ people
alternative label: Asistencia médica para las personas (LGBTQ) ||Cuidado de la salud para las personas LGBTQ
alternative label: Cuidado medico para personas LGBTQ
alternative label: Atención medica para las personas LGBTQ+
change note: Version 4.2.0
in scheme: v3
narrower: LGBTQ+ peer support
narrower: Mental health care for LGBTQ+ people
narrower: Physical health care for LGBTQ+ people
narrower: Terminal care (AIDS)
narrower: Reproductive health care for LGBTQ+ people
narrower: Health care for transgender children and youth
narrower: Gender-affirming care
narrower: Barriers to gender-affirming care
preferred label: Asistencia médica para las personas LGBTQ+
related: AIDS organizations
related: LGBTQ+ health care centers
related: Transgender health care bans
related: Impact of COVID-19 pandemic on LGBTQ+ people
related: Lesbians with breast cancer

LGBTQ+ meeting places
type: Concept
issued: 2019-05-14
modified: 2025-02-23
replaces: LGBTQMeetingPlaces
comment: Physical or online spaces in which LGBTQ+ people meet.
comment: Espacios físicos o en línea en los que se encuentran personas LGBTQ+.
alternative label: LGBTQ meeting places
alternative label: Espacios de reunión LGBTQ+
alternative label: Espacios de encuentro LGBTQ
alternative label: Espacios de reunión LGBTQ
change note: Version 4.2.0
in scheme: v3
narrower: LGBTQ+ bars
narrower: LGBTQ+ beaches
narrower: LGBTQ+ community centers
narrower: LGBTQ+ spaces
preferred label: Espacios de encuentro LGBTQ+
related: Cruising (LGBTQ+ culture)
related: Dating applications
related: LGBTQ+ dating websites
related: Europride
related: LGBTQ+ night life
related: LGBTQ+ social media
related: Sex locations
related: Public sex
related: Fandom conventions
related: Furry conventions
related: Slash conventions

Sexual orientation
type: Concept
issued: 2019-05-14
modified: 2025-02-23
replaces: sexualOrientation
comment: The direction of an individual's sexual attraction towards other individuals of the same, opposite, or multiple sexes; commonly understood to be biologically and physiologically dictated, rather than sociologically determined.
comment: La dirección de la atracción sexual de una persona hacia otras personas del mismo sexo, del sexo opuesto o de múltiples sexos; comúnmente se entiende que está dictaminada por la biología y la fisiología, en lugar de estar determinada sociológicamente.
change note: Version 4.2.0
in scheme: v3
narrower: Asexuality
narrower: Bisexuality
narrower: Demisexuality
narrower: Heterosexuality
narrower: Homosexuality
narrower: Lesbianism
narrower: Sexual function
narrower: Allosexuality
narrower: Monosexuality
narrower: Polysexuality
narrower: Greysexuality
narrower: Megasexuality
narrower: Pansexuality
preferred label: Orientación sexual
related: Conversion therapy
related: Denial of sexual orientation
related: Gaydar
related: Sexual diversity
related: Sexual identity
related: Sexual minorities
related: Sexual preference
related: Relationship orientation
related: Romantic orientation
related: Monosexual people

Feminism
type: Concept
issued: 2019-05-14
modified: 2025-03-20
replaces: feminism
comment: Collection of movements aimed at defining, establishing, and defending equal political, economic, and social rights and equal opportunities for women.
comment: Conjunto de movimientos que buscan definir, establecer y defender la igualdad de derechos políticos, económicos y sociales y la igualdad de oportunidades para las mujeres.
change note: Version 4.2.0
in scheme: v3
narrower: Ecofeminism
narrower: First-wave feminism
narrower: Heterosexual feminism
narrower: Lesbian feminism
narrower: Radical feminism
narrower: Second-wave feminism
narrower: Black feminism
narrower: White feminism
narrower: Transfeminism
narrower: Third-wave feminism
narrower: Sex-positive feminism
narrower: Anti-sex work feminism
narrower: Anti-pornography feminism
preferred label: Feminismo
related: Anti-feminism
related: Women's movement
related: Wimmin
related: Females
related: Womyn
related: Feminist theory
related: Gender equality
related: Trans-exclusionary radical feminists
related: Trans-exclusionary radical feminism

LGBTQ+ theater
type: Concept
issued: 2019-05-14
modified: 2025-03-20
replaces: theatreLGBTQ
comment: Works in the performance arts that focus on LGBTQ+ characters, communities, or issues.
comment: Trabajos en las artes escénicas que se centran en personajes, comunidades o cuestiones LGBTQ+.
change note: Version 4.2.0
in scheme: v3
narrower: Bisexual theater
narrower: Female impersonators
narrower: Gay theater
narrower: Kabuki
narrower: Lesbian theater
narrower: Male impersonators
narrower: Queer theater
narrower: Striptease
narrower: Transgender theater
narrower: Aromantic theater
narrower: Asexual theater
narrower: Demisexual theater
narrower: Megasexual theater
narrower: Greyromantic theater
narrower: Intersex theater
preferred label: Teatro LGBTQ+
preferred label: LGBTQ+ theatre
related: LGBTQ+ drama
related: LGBTQ+ arts
related: LGBTQ+ musicals
related: LGBTQ+ cultural heritage institutions
related: LGBTQ+ special collections
related: Two-Spirit theater

LGBTQ+ history
type: Concept
issued: 2022-11-08
modified: 2026-02-24
comment: Past events or accounts of the past concerning LGBTQ+ people, or people who might be perceived as LGBTQ+ if they were alive today.
comment: Eventos pasados ​​o relatos del pasado relacionados con personas LGBTQ+, o personas que podrían ser percibidas como LGBTQ+ si estuvieran vivas hoy.
alternative label: History (LGBTQ)
alternative label: LGBTQ history
alternative label: Historia (LGBTQ)
alternative label: Historia LGBTQ
change note: Version 4.2.0
in scheme: v3
narrower: Lesbian history
narrower: Gay history
narrower: Bisexual history
narrower: Transgender history
narrower: Queer history
narrower: Intersex history
narrower: Asexual history
narrower: Non-binary history
narrower: Two-Spirit history
narrower: Aromantic history
narrower: Demisexual history
narrower: Megasexual history
narrower: Greyromantic history
preferred label: Historia LGBTQ+
related: LGBTQ+ historical terms
related: LGBTQ+ memorials
related: LGBTQ+ biographies
related: LGBTQ+ autobiographies
related: LGBTQ+ cultural heritage institutions
related: LGBTQ+ History Month
related: LGBTQ+ historians

Sex workers
type: Concept
issued: 2024-10-30
modified: 2025-02-23
comment: People who receive money or goods in exchange for sexual services, performances, or companionship. Use to describe people working across the broad spectrum of sex work, and use more specific terms if possible
alternative label: Prostitutes
alternative label: Hookers
alternative label: Hustlers
alternative label: Pros
change note: Version 4.2.0
in scheme: v3
narrower: LGBTQ+ sex workers
narrower: Phone sex workers
narrower: Strippers
narrower: Women sex workers
narrower: Men sex workers
narrower: Escorts
narrower: Two-Spirit sex workers
narrower: Māhū sex workers
narrower: Cam models
narrower: Sugar babies
narrower: Sex workers of color
narrower: Porn stars
related: Gay for pay
related: Sex work

LGBTQ+ people of shared ethnic or national identities
type: Concept
issued: 2019-05-14
modified: 2026-02-26
replaces: LGBTQEthnicGroups
comment: Umbrella term for groups of LGBTQ+ people who share an ethnic or national identity, including a common nationality, country of citizenship, ancestry, culture, language, ethno-religion, etc. Use more specific terms whenever possible. Do not use to describe migrants or immigrants as a whole.
comment: Grupos de personas que comparten una identidad basada en una nacionalidad, cultura, ascendencia, idioma, religión, etc. en común y que también se autoidentifican como LGBTQ+. No debe utilizarse para describir a personas migrantes.
alternative label: LGBTQ+ people in ethnic groups
alternative label: LGBTQ+ people by ethnicity
alternative label: LGBTQ+ people by nationality
alternative label: LGBTQ+ ethnic people
alternative label: Ethnic LGBTQ+ people
alternative label: Ethnic people (LGBTQ)
broader: LGBTQ+ people
change note: Version 4.2.0
has top concept: LGBTQ+ people
in scheme: v3
narrower: Jewish LGBTQ+ people
narrower: Romani LGBTQ+ people
narrower: Pacific Islander American LGBTQ+ people
narrower: Chicano/a/x LGBTQ+ people
narrower: Arab LGBTQ+ people
narrower: South Asian LGBTQ+ people
narrower: Assamese LGBTQ+ people
narrower: Awadhi LGBTQ+ people
narrower: Bhojpuri LGBTQ+ people
narrower: Bengali LGBTQ+ people
narrower: Bhil LGBTQ+ people
narrower: Chakma LGBTQ+ people
narrower: Kho LGBTQ+ people
narrower: Maldivian LGBTQ+ people
narrower: Dogra LGBTQ+ people
narrower: Garhwali LGBTQ+ people
narrower: Gujarati LGBTQ+ people
narrower: Haryanvi LGBTQ+ people
narrower: Kalash LGBTQ+ people
narrower: Kashmiri LGBTQ+ people
narrower: Konkan LGBTQ+ people
narrower: Kumaoni LGBTQ+ people
narrower: Kutchi LGBTQ+ people
narrower: Armenian LGBTQ+ people
narrower: Belarusian LGBTQ+ people
narrower: Russian LGBTQ+ people
narrower: Ukrainian LGBTQ+ people
narrower: Hispanic LGBTQ+ people
narrower: Indigenous LGBTQ+ people
narrower: Latino/a/x LGBTQ+ people
narrower: Sámi LGBTQ+ people
narrower: Canadian LGBTQ+ people
preferred label: Personas LGBTQ+ en grupos étnicos
related: Intersectionality
related: LGBTQ+ migrants
related: Social privilege
related: Undocumented LGBTQ+ residents

Sexuality
type: Concept
issued: 2019-05-14
modified: 2025-04-24
replaces: sexuality
comment: Term used to describe the ways in which individuals experience and express themselves sexually, including the types of people and practices they are sexually interested in.
comment: Término utilizado para describir las formas en que las personas experimentan y se expresan sexualmente, incluidos los tipos de personas y prácticas que les interesan sexualmente.
change note: Version 4.2.0
in scheme: v3
narrower: Children's sexuality
narrower: Organizations for sexual research and sexual reform
narrower: Women's sexuality
preferred label: Sexualidad
related: Anonymous sex
related: Casual sex
related: Cybersex
related: Eroticism
related: Gender studies
related: Group sex
related: Hypersexuality
related: Libido
related: Sex locations
related: Public sex
related: Seduction
related: Sex accessories
related: Sex (Act)
related: Sex parties
related: Sexology
related: Sexting
related: Sexual abstinence
related: Sexual excitement
related: Sexual autonomy
related: Sexual dysfunction
related: Sexual function
related: Sexual minorities
related: Sexual practices
related: Sexual reform
related: Sexual roles
related: Situational sexual behavior
related: Homoeroticism
related: Passing (Sexuality)
related: Sexual fluidity
related: Sexual studies

LGBTQ+ people of color
type: Concept
issued: 2019-05-14
modified: 2025-02-23
replaces: peopleOfColourLGBTQ
comment: Primarily used in the United States, this term refers to LGBTQ+ people who are not white and who identify as people of color.
comment: Personas LGBTQ+ que no son blancas y que se autoidentifican como personas de color.
broader: LGBTQ+ people
change note: Version 4.2.0
has top concept: LGBTQ+ people
in scheme: v3
narrower: Asian LGBTQ+ people
narrower: Bisexual people of color
narrower: Black LGBTQ+ people
narrower: Gay men of color
narrower: Lesbians of color
narrower: Biracial LGBTQ+ people
narrower: Indigenous LGBTQ+ people
narrower: Multiracial LGBTQ+ people
narrower: Queer people of color
narrower: Transgender people of color
narrower: Pacific Islander American LGBTQ+ people
narrower: Arab LGBTQ+ people
narrower: South Asian LGBTQ+ people
narrower: Assamese LGBTQ+ people
narrower: Awadhi LGBTQ+ people
narrower: Bhojpuri LGBTQ+ people
narrower: Bengali LGBTQ+ people
narrower: Bhil LGBTQ+ people
narrower: Chakma LGBTQ+ people
narrower: Kho LGBTQ+ people
narrower: Maldivian LGBTQ+ people
narrower: Dogra LGBTQ+ people
narrower: Garhwali LGBTQ+ people
narrower: Gujarati LGBTQ+ people
narrower: Haryanvi LGBTQ+ people
narrower: Kalash LGBTQ+ people
narrower: Kashmiri LGBTQ+ people
narrower: Konkan LGBTQ+ people
narrower: Kumaoni LGBTQ+ people
narrower: Kutchi LGBTQ+ people
narrower: Intersex people of color
narrower: Asexual people of color
narrower: Non-binary people of color
preferred label: Personas LGBTQ+ de color
preferred label: LGBTQ+ people of colour
related: BIPOC
related: People of color in fandom
related: QTPOC
related: Sex workers of color

Youth
type: Concept
issued: 2019-05-14
modified: 2025-02-23
replaces: youth
comment: The time period between childhood and adulthood.
comment: El período de tiempo entre la niñez y la edad adulta.
change note: Version 4.2.0
in scheme: v3
narrower: Heterosexual youth
narrower: Intersex youth
narrower: LGBTQ+ youth
narrower: Cisgender youth
narrower: Two-Spirit youth
preferred label: Juventud
related: Children
related: Bishounen

LGBTQ+ employment
type: Concept
issued: 2021-11-02
modified: 2025-02-23
comment: Employment of LGBTQ+ individuals.
comment: El empleo de personas LGBTQ+.
alternative label: Employment (LGBTQ)
change note: Version 4.2.0
in scheme: v3
narrower: Lesbian employment
narrower: Gay employment
narrower: Bisexual employment
narrower: Transgender employment
narrower: Queer employment
narrower: LGBTQ+ people in the workplace
narrower: Intersex employment
narrower: Asexual employment
preferred label: Empleo LGBTQ+
related: LGBTQ+-owned businesses
related: Lesbian-owned businesses
related: Gay-owned businesses
related: Bisexual-owned businesses
related: Transgender-owned businesses
related: Queer-owned businesses
related: LGBTQ+-focused businesses
related: Lesbian-focused businesses
related: Gay-focused businesses
related: Bisexual-focused businesses
related: Transgender-focused businesses
related: Queer-focused businesses
related: LGBTQ+ chefs
related: Two-Spirit employment

LGBTQ+ cultural heritage institutions
type: Concept
issued: 2021-11-23
modified: 2025-02-23
comment: A broad grouping term for galleries, libraries, archives, museums, and special collections (GLAMS) that hold materials primarily pertaining to LGBTQ+ people or intended for use by LGBTQ+ people.
comment: Un término amplio para agrupar a galerías, bibliotecas, archivos, museos y colecciones especiales (GLAMS, por sus siglas en inglés) que contienen materiales principalmente relacionados con personas LGBTQ+ o destinados a ser utilizados por personas LGBTQ+.
alternative label: Cultural heritage institutions (LGBTQ)
alternative label: GLAM (LGBTQ)
alternative label: GLAMS (LGBTQ)
alternative label: LGBTQ+ GLAM
alternative label: LGBTQ+ GLAMS
alternative label: Instituciones de legado cultural (LGBTQ)
change note: Version 4.2.0
in scheme: v3
narrower: LGBTQ+ archives
narrower: LGBTQ+ libraries
narrower: LGBTQ+ museums
narrower: LGBTQ+ special collections
preferred label: Instituciones de legado cultural LGBTQ+
related: LGBTQ+ artists
related: LGBTQ+ arts
related: LGBTQ+ literature
related: LGBTQ+ theater
related: LGBTQ+ culture
related: LGBTQ+ history

Gender identity
type: Concept
issued: 2019-05-14
modified: 2025-02-23
replaces: genderIdentity
comment: A person’s experience of having a particular gender, which may or may not correspond with the gender or sex they were assigned at birth. Not to be used to describe solely women’s experiences or women’s studies.
comment: La experiencia de una persona de tener un género particular, que puede o no corresponder al género o sexo asignado al nacer.
alternative label: Gender-variant identity
alternative label: Identidad de género variable
broader: Gender
change note: Version 4.2.0
has top concept: Gender
in scheme: v3
narrower: Assigned gender
narrower: Bigender identity
narrower: Non-Euro-American gender and sexual identities
narrower: Genderfluid identity
narrower: Males
narrower: Pangender identity
narrower: Transgender identity
narrower: Trigender identity
narrower: Females
narrower: Xenogender identity
narrower: Gender creative
narrower: Transgenderqueer identity
narrower: Non-binary identity
narrower: Genderqueer identity
narrower: Gender non-conforming identity
narrower: Demigender identity
narrower: Cisgender identity
narrower: Agender identity
preferred label: Identidad de género
related: Agender people
related: Cisgender people
related: Demigender people
related: Gender binaries
related: Genderism
related: Gender diversity
related: Gender dysphoria
related: Gender expression
related: Genderfluid people
related: Gender roles
related: Gendercide
related: Misgendering
related: Non-binary people
related: Sexual identity
related: Transgender people
related: Transgenderism
related: Transitioning (Gender)
related: Trans
related: Xenogender people
related: Gender minorities
related: Gender euphoria
related: Gender dysphoria in children
related: Gender dysphoria in youth

Sexual minorities
type: Concept
issued: 2019-05-14
modified: 2025-02-23
replaces: sexualMinorities
comment: People whose sexual practices differ from those of the dominant culture.
comment: Personas cuyas prácticas sexuales difieren de las de la cultura dominante.
change note: Version 4.2.0
in scheme: v3
narrower: Asexual people
narrower: Bisexual people
narrower: Demisexual people
narrower: Gay men
narrower: Lesbians
narrower: Katoey
narrower: Takatāpui
narrower: Tongzhi
narrower: Two-Spirit people
narrower: Greysexual people
narrower: Megasexual people
narrower: Sapphics
narrower: MLM (Men Loving Men)
narrower: WLW (Women Loving Women)
narrower: Kinky people
preferred label: Minorías sexuales
related: Bi+ people
related: Sodomites
related: BDSM
related: Homophiles
related: Homosexuals
related: Inverts
related: LGBTI
related: LGBTQ+ people
related: Men who have sex with men
related: Sexual orientation
related: Sexual preference
related: Sexuality
related: Uranians
related: Women who have sex with women
related: Relationship minorities
related: Gender minorities
related: Romantic minorities

Neopronouns
type: Concept
issued: 2021-07-01
modified: 2026-02-23
replaces: neopronouns
comment: Personal pronouns that are not officially (i.e., in dictionaries, style guides, etc.) recognized by the language that they are used in. Often intended to be gender neutral.
comment: Pronombres personales que no están reconocidos oficialmente (es decir, en diccionarios, guías de estilo, etc.) por el idioma en el que se usan. A menudo pretenden ser neutrales en cuanto al género.
change note: Version 4.2.0
in scheme: v3
narrower: Ae/Aer/Aerself (Pronouns)
narrower: Co/Co/Coself (Pronouns)
narrower: Cy/Cyb/Cyberself (Pronouns)
narrower: E/Em/Emself (Pronouns)
narrower: Ey/Em/Eirself (Pronouns)
narrower: Fe/Fem/Femself (Pronouns)
narrower: Fae/Faer/Faerself (Pronouns)
narrower: Fey/Fem/Femself (Pronouns)
narrower: Hu/Hum/Humself (Pronouns)
narrower: It/It/Itself (Pronouns)
narrower: Jee/Jem/Jemself (Pronouns)
narrower: Kit/Kit/Kitself (Pronouns)
narrower: Ne/Nir/Nemself (Pronouns)
narrower: Ne/Nem/Nis (Pronouns)
narrower: Peh/Pehm/Pehself (Pronouns)
narrower: Per/Per/Perself (Pronouns)
narrower: Sie/Hir/Hirself (Pronouns)
narrower: Se/Ser/Serself (Pronouns)
narrower: Shi/Hir/Hirself (Pronouns)
narrower: Si/Hyr/Hyrself (Pronouns)
narrower: Thon/Thon/Thonself (Pronouns)
narrower: Ve/Ver/Verself (Pronouns)
narrower: Ve/Vem/Verself (Pronouns)
narrower: Voi/Void/Voidself (Pronouns)
narrower: Vi/Ver/Virself (Pronouns)
narrower: Vi/Vim/Virself (Pronouns)
narrower: Xie/Xer/Xerself (Pronouns)
narrower: Xe/Xyr/Xemself (Pronouns)
narrower: Xey/Xem/Xyr (Pronouns)
narrower: Xey/Xem/Xeir (Pronouns)
narrower: Yo/Yo/Yosself (Pronouns)
narrower: Ze/Zir/Zirself (Pronouns)
narrower: Ze/Hir/Hirself (Pronouns)
narrower: Ze/Zem/Zirself (Pronouns)
narrower: Ze/Mer/Zemself (Pronouns)
narrower: Zee/Zed/Zedself (Pronouns)
narrower: Zie/Zir/Zirself (Pronouns)
narrower: Zie/Zem/Zirself (Pronouns)
narrower: Zie/Hir/Hirself (Pronouns)
narrower: Zme/Zmyr/Zmyrself (Pronouns)
preferred label: Neopronombres
related: Pronouns
related: Neopronoun users

LGBTQ+ activism
type: Concept
issued: 2019-05-14
modified: 2026-02-23
replaces: activismLGBTQ
comment: Direct action and organizing to achieve political or social change and acceptance for LGBTQ+ people.
comment: Acción directa y organización para lograr cambio político o social y la aceptación de las personas LGBTQ+.
alternative label: Activism (LGBTQ)
alternative label: Activismo LGBTQ
alternative label: Activismo (LGBTQ)
change note: Version 4.2.0
in scheme: v3
narrower: Bisexual activism
narrower: Gay activism
narrower: Lesbian activism
narrower: LGBTQ+ direct action
narrower: Queer activism
narrower: Transgender activism
narrower: Intersex activism
narrower: Asexual activism
narrower: Non-binary political activism
preferred label: Activismo LGBTQ+
related: LGBTQ+ political activists
related: Allies
related: Gay shame
related: Leather and kink activism
related: Performative LGBTQ+ activism by police
related: Two-Spirit activism
related: LGBTQ+ solidarity
related: LGBTQ+ philanthropy

Transitioning (Gender)
type: Concept
issued: 2019-05-14
modified: 2025-02-23
replaces: transitioningTransgender
comment: The process of changing one's gender presentation to affirm one's internal sense of gender; can include social or medical transition.
comment: El proceso de cambiar la presentación de género para afirmar el sentido propio del género; puede incluir una transición social o médica.
alternative label: Transitioning (Transgender)
alternative label: Transición (Transgénero)
change note: Version 4.2.0
in scheme: v3
narrower: Transitioning status
narrower: Detransitioning
narrower: Retransitioning
narrower: Desistance (Gender)
preferred label: Transición (Género)
related: Assigned gender
related: Birth certificates
related: Driver's licenses
related: Gender-affirming surgery
related: Gender identity
related: Gender markers
related: Bottom surgery
related: Hair removal
related: Medical practitioners' statements
related: Passports
related: Social security cards
related: Transgender people
related: Transsexual people
related: Transsexualism
related: Voice therapy (Gender)
related: Facial gender affirming surgery
related: Facial masculinization surgery
related: Facial feminization surgery
related: Top surgery
related: Chest reconstruction surgery
related: Feminizing vocal surgery
related: Masculinizing vocal surgery
related: Clitoroplasty
related: Labiaplasty
related: Metoidioplasty
related: Scrotoplasty
related: Vaginectomy
related: Tracheal shave
related: Phalloplasty
related: Vaginoplasty
related: Neophallus

Sex industry
type: Concept
issued: 2019-05-14
modified: 2025-02-23
replaces: sexIndustry
comment: Businesses that either directly or indirectly provide sexual services, sex-related products, and/or erotic entertainment.
comment: Empresas que directa o indirectamente ofrecen servicios sexuales, productos relacionados con el sexo y/o entretenimiento erótico.
alternative label: Adult entertainment industry
alternative label: Commercial sex
alternative label: Sex trade
alternative label: Industria del entretenimiento adulto
change note: Version 4.2.0
in scheme: v3
narrower: Sex shops
narrower: Sex cinemas
narrower: Gay saunas
narrower: Peep shows
narrower: Porn industry
narrower: Sex clubs
narrower: Sex tourism
narrower: Sex work
narrower: Erotic massage businesses
narrower: Red light districts
narrower: Pornography
preferred label: Industria sexual

Gender expression
type: Concept
issued: 2019-05-14
modified: 2025-02-23
replaces: genderExpression
comment: Term used to describe the way individuals express their gender identity through their appearance and behaviors, including gestures, movement, dress, and grooming.
comment: Término utilizado para describir la forma en que las personas expresan su identidad de género a través de su apariencia y comportamientos, incluidos gestos, movimientos, vestimenta y arreglo personal.
broader: Gender
change note: Version 4.2.0
has top concept: Gender
in scheme: v3
narrower: Androgyny
narrower: Binding (Chest)
narrower: Clothing
narrower: Crossdressing
narrower: Drab (LGBTQ+ culture)
narrower: Drag
narrower: Femininities
narrower: Eonism
narrower: Gender bending
narrower: Gender blending
narrower: Gender swapping
narrower: Hair removal
narrower: Masculinities
narrower: Packing (Phallus)
narrower: Transvestism
narrower: Tucking (Phallus)
narrower: Voice therapy (Gender)
narrower: Gender creative
narrower: Packers (Phallus)
narrower: Gender transgression
narrower: Transmasculinity
narrower: Transfemininity
narrower: Stand-to-Pee devices
narrower: Gender ambiguity
preferred label: Expresión de género
related: Bears (Gay culture)
related: Butches
related: Cubs (Gay culture)
related: Dandies
related: Femmes
related: Gender diversity
related: Gender dysphoria
related: Gender identity
related: Gender roles
related: Genderfuck
related: Otters (Gay culture)
related: Pups (Roleplay)
related: Queens (Gay culture)
related: Twinks (Gay culture)
related: Wolves (Gay culture)
related: Gender euphoria
related: Gender role stereotypes
related: Gender dysphoria in children
related: Gender dysphoria in youth
related: LGBTQ+ fashion
related: Dollification

Law
type: Concept
issued: 2019-05-14
modified: 2026-02-24
replaces: law
comment: System of rules or conduct recognized and legally enforced within a country or community.
comment: Sistema de reglas o conductas reconocidas y legalmente aplicadas dentro de un país o una comunidad.
alternative label: Legislation
alternative label: Legislación
alternative label: Ley
alternative label: Leyes
change note: Version 4.2.0
in scheme: v3
narrower: Anti-discrimination law
narrower: Court orders
narrower: Criminal law
narrower: LGBTQ+ personal and family law
narrower: Bathroom bans
narrower: LGBTQ+ victims' rights
narrower: Anti-transgender legislation
narrower: Sex work legislation
preferred label: Derecho
related: Legal status
related: LGBTQ+ lobbying
related: Undocumented LGBTQ+ residents
related: LGBTQ+ lawyers

LGBTQ+ communities
type: Concept
issued: 2019-05-14
modified: 2025-03-20
replaces: communitiesLGBTQ
comment: Groups of LGBTQ+ people who share interests or interact regularly, typically living in some proximity.
comment: Grupos de personas LGBTQ+ que comparten intereses o interactúan regularmente y que generalmente viven en cierta proximidad.
alternative label: Communities (LGBTQ)
alternative label: Comunidades (LGBTQ)
change note: Version 4.2.0
in scheme: v3
narrower: Kink community
narrower: Bisexual community
narrower: Drag community
narrower: Gay community
narrower: Leather community
narrower: Lesbian community
narrower: LGBTQ+ communes
narrower: Queer community
narrower: Rubber and latex community
narrower: Transgender community
narrower: LGBTQ+ Deaf culture
narrower: Asexual community
narrower: Intersex community
narrower: LGBTQ+ alumni groups
narrower: LGBTQ+ punk community
preferred label: Comunidades LGBTQ+
related: LGBTQ+ community centers
related: LGBTQ+ neighborhoods
related: Two-Spirit community
related: LGBTQ+ spaces
related: LGBTQ+ survival guides

Intersex variations
type: Concept
issued: 2019-05-14
modified: 2025-02-23
replaces: intersexConditions
comment: Term used to refer to a wide range of variations in sex characteristics. The term "intersex conditions" is a pathologizing term used to mean people born with variations in their physical sex characteristics also known as intersex traits.
comment: Término utilizado para referirse a una amplia gama de variaciones en las características sexuales. El término "condiciones intersex" es un término patologizante que se utiliza para referirse a personas que nacen con variaciones en sus características sexuales físicas, también conocidas como rasgos intersex.
alternative label: Intersex conditions
alternative label: Condiciones intersex
broader: Intersex
broader: Medicalization
change note: Version 4.2.0
has top concept: Sex (Body)
in scheme: v3
narrower: 5-alpha reductase deficiency
narrower: Androgen insensitivity syndrome
narrower: Aphallia
narrower: Clitoromegaly
narrower: Congenital adrenal hyperplasia
narrower: Gonadal dysgenesis
narrower: Hypospadias
narrower: Klinefelter syndrome
narrower: Micropenis
narrower: Mosaicism involving "sex" chromosomes
narrower: Ovo-testes
narrower: Partial androgen insensitivity syndrome
narrower: Progestin induced virilization
narrower: Swyer syndrome
narrower: Turner syndrome
narrower: 17-beta hydroxysteroid dehydrogenase 3 deficiency
narrower: Ambiguous genitalia
narrower: Anorchia
narrower: Aromatase deficiency
narrower: Aromatase excess syndrome
narrower: Bladder exstrophy
narrower: Chimerism
narrower: Cloacal exstrophy
narrower: Complete androgen insensitivity syndrome
narrower: Congenital chordee
narrower: Cryptorchidism
narrower: De la Chapelle syndrome
narrower: Epispadias
narrower: Estrogen insensitivity syndrome
narrower: Follicle-stimulating hormone insensitivity
narrower: Fraser syndrome
narrower: Hyperandrogenism
narrower: Hypogonadism
narrower: Isolated 17,20-lyase deficiency
narrower: Jacobs syndrome
narrower: Kallmann syndrome
narrower: Leydig cell hypoplasia
narrower: Luteinizing hormone insensitivity
narrower: Mayer-Rokitansky-Küster-Hauser syndrome
narrower: Penoscrotal transposition
narrower: Persistent Müllerian duct syndrome
narrower: Polycystic ovary syndrome
narrower: Pseudohermaphroditism
narrower: Sex reversal syndrome
narrower: Trisomy X
narrower: Vaginal atresia
narrower: XXYY syndrome
preferred label: Variaciones intersex
related: Intersex people
related: Sex assigned at birth
related: Assigned X at birth

Europride
type: Concept
is replaced by: homoit0000861
issued: 2019-05-14
modified: 2022-10-04
modified: 2025-02-23
replaces: europride
replaces: LGBTQEvents
replaces: sydneyGayAndLesbianMardiGras
comment: A pan-European international event dedicated to LGBTQ+ pride that is hosted by a different European city each year
comment: Organized public or social occasions for LGBTQ+ people and communities.
comment: Ocasiones públicas o sociales organizadas para personas y comunidades LGBTQ+.
comment: Annual gay pride parade and festival in Sydney, Australia
alternative label: LGBTQ events
broader: Gay pride
change note: Version 4.2.0
has top concept: LGBTQ+ pride
in scheme: v3
narrower: Drag balls
narrower: Halloween (LGBTQ+ culture)
narrower: Eurogames
narrower: Leather and kink conventions
narrower: Title contests
narrower: Drag shows
narrower: Drag pageants
narrower: Lesbian events
narrower: Gay events
narrower: Bisexual events
narrower: Transgender events
narrower: Queer events
narrower: Non-binary events
narrower: Intersex events
narrower: Asexual events
narrower: Aromantic events
narrower: Demisexual events
narrower: Greyromantic events
narrower: Megasexual events
narrower: Pride events
narrower: LGBTQ+ History Month
narrower: LGBTQ+ street fairs
narrower: LGBTQ+ conferences
preferred label: LGBTQ+ events
preferred label: Eventos LGBTQ+
preferred label: Sydney Gay and Lesbian Mardi Gras
related: LGBTQ+ direct action
related: LGBTQ+ meeting places
related: Fandom conventions
related: Furry conventions
related: Slash conventions
related: Two-Spirit events
related: Women's events

LGBTQ+ press
type: Concept
issued: 2019-05-14
modified: 2025-04-29
replaces: pressLGBTQ
comment: Newspapers, magazines, or other publishing outlets aimed at LGBTQ+ audiences and/or operated by LGBTQ+ people.
comment: Periódicos, revistas u otros medios editoriales dirigidos a audiencias LGBTQ+ y/o operados por personas LGBTQ+.
alternative label: Press (LGBTQ)
alternative label: Prensa (LGBTQ)
change note: Version 4.2.0
in scheme: v3
narrower: Bisexual press
narrower: Gay press
narrower: Lesbian press
narrower: LGBTQ+ magazines
narrower: LGBTQ+ porn magazines
narrower: LGBTQ+ zines
narrower: LGBTQ+ newsletters
narrower: LGBTQ+ newspapers
narrower: Queer press
narrower: Transgender press
narrower: Asexual press
narrower: Intersex press
narrower: LGBTQ+ journalism
preferred label: Prensa LGBTQ+
related: AIDS periodicals
related: LGBTQ+ bookshops
related: LGBTQ+ books
related: LGBTQ+ literature
related: Two-Spirit press

BDSM
type: Concept
is replaced by: homoit0000442
issued: 2019-05-14
modified: 2024-02-01
modified: 2022-11-17
modified: 2025-03-20
modified: 2022-08-22
replaces: BDSM
replaces: ephebophilia
replaces: fetishism
replaces: gerontophilia
replaces: hebephilia
comment: Erotic preference and form of personal relationship involving the consensual use of restraint, intense sensory stimulation, and fantasy power roleplay.
comment: Preferencia erótica y forma de relación personal que implica el uso consentido de la restricción, la estimulación sensorial intensa y el juego de roles de poder fantasioso.
comment: Sexual preference for young adults between the ages of 16 and 20
comment: Sexual or erotic acts, objects, and situations that are considered to be unusual within a given society.
comment: Actos, objetos y situaciones eróticas o sexuales que se consideran inusuales en determinadas sociedades.
comment: Refers to a primary or exclusive sexual interest in individuals in the early years of puberty (generally ages 11-14, though onset of puberty may vary)
alternative label: Fetish
alternative label: Fetishism
alternative label: Kink
broader: Sex (Act)
broader: Sexual practices
broader: Sexual preference
broader: Eroticism
change note: Version 4.2.0
has top concept: Sex (Act)
has top concept: Eroticism
in scheme: v3
narrower: Sadomasochism
narrower: Bondage
narrower: Enemas
narrower: Scat play
narrower: Exhibitionism
narrower: Urine play
narrower: Rubber and latex fetish
narrower: Voyeurism
narrower: Body part fetishes
narrower: Chasers
narrower: Wrestling
narrower: Muscle worship
narrower: Impact play
narrower: Temperature play
narrower: Electrical play
narrower: Kink accessories
narrower: Leather fetish
narrower: Medical play
narrower: Mind play
narrower: Orgasm control
narrower: Chastity play
narrower: Piercing play
narrower: Blood play
narrower: Knife play
narrower: Balloon kink
narrower: Inflation (Erotic)
narrower: Shoe fetish
narrower: Tickling
narrower: Foot fetish
narrower: Douching
narrower: Edge play
narrower: Abduction play
narrower: Consent play
narrower: Sensation play
narrower: PVC (Erotic)
narrower: Sensory deprivation (Erotic)
narrower: Dehumanization (Erotic)
preferred label: Ephebophilia
preferred label: Kinks and fetishes
preferred label: Kinks y fetiches
preferred label: Gerontophilia
preferred label: Hebephilia
related: Age play
related: Ballgags
related: Kink community
related: Chest harnesses
related: Consent
related: Handkerchief codes
related: LGBTQ+ dominants
related: LGBTQ+ mistresses (BDSM culture)

LGBTQ+ historical terms
type: Concept
issued: 2019-05-14
modified: 2025-02-23
replaces: LGBTQHistoricalTerms
comment: Historical terms for LGBTQ+ people, identities, and practices that are now considered outdated and/or offensive.
comment: Términos históricos para personas, identidades y prácticas LGBTQ+ que ahora se consideran obsoletos y/u ofensivos.
alternative label: LGBTQ historical terms
alternative label: Términos históricos LGBTQ
change note: Version 4.2.0
in scheme: v3
narrower: Banjees
narrower: Berdache
narrower: Boston marriages
narrower: Sodomites
narrower: Clones (Gay culture)
narrower: Dandies
narrower: Eonism
narrower: Eonist people
narrower: Faggots
narrower: FtMs
narrower: Fricatrices
narrower: Homophiles
narrower: Homosexuals
narrower: Inverts
narrower: MtFs
narrower: Pederasts
narrower: Pederasty
narrower: Sea queens
narrower: Sexual inversion
narrower: Sodomy
narrower: Transvestites
narrower: Tribades
narrower: Uranians
narrower: Uranism
narrower: Tribadism
narrower: Hermaphrodites
narrower: Masquerading
narrower: GRID (Gay-Related Immune Deficiency)
narrower: Fairies (Gay culture)
narrower: Female impersonation shows
narrower: Male impersonation shows
preferred label: Términos históricos LGBTQ+
related: LGBTQ+ history

Medical care
type: Concept
issued: 2019-05-14
modified: 2026-02-24
replaces: medicalCare
comment: Organized measures taken for the maintenance or improvement of health via the prevention, diagnosis, treatment, or cure of disease, illness, injury, or other condition.
comment: Medidas organizadas tomadas para el mantenimiento o la mejora de la salud mediante la prevención, diagnóstico, tratamiento o cura de enfermedades, dolencias, lesiones u otras condiciones.
alternative label: Atención medica
change note: Version 4.2.0
in scheme: v3
narrower: AIDS memorials
narrower: Gender-affirming surgery
narrower: Medicalization
narrower: Therapies
preferred label: Asistencia médica
related: Donors
related: Medical practitioners' statements
related: Informed consent
related: LGBTQ+ medical professionals
related: LGBTQ+ medical doctors

Relationship satisfaction
type: Concept
is replaced by: homoit0001237
issued: 2019-05-14
modified: 2022-10-13
modified: 2025-02-23
replaces: relationshipSatisfaction
replaces: relationshipsLGBTQ
comment: Ongoing connections (romantic, sexual, or platonic) between two or more LGBTQ+ people.
comment: Conexiones continuas (románticas, sexuales o platónicas) entre dos o más personas LGBTQ+.
alternative label: Relationships (LGBTQ)
alternative label: Relaciones (LGBTQ)
change note: Version 4.2.0
in scheme: v3
narrower: Bisexual relationships
narrower: Butch-femme relationships
narrower: LGBTQ+ couples
narrower: Cross-cultural relationships
narrower: Friendships
narrower: Gay relationships
narrower: Heterosociality
narrower: Intergenerational relationships
narrower: Lesbian relationships
narrower: Queer relationships
narrower: Sexual relationships
narrower: Transgender relationships
narrower: Romantic relationships
narrower: Asexual relationships
narrower: Intersex relationships
narrower: Queerplatonic relationships
narrower: LGBTQ+ dating
preferred label: LGBTQ+ relationships
preferred label: Relaciones LGBTQ+
related: Aromantic people
related: Domestic partnerships
related: Being in love
related: LGBTQ+ separation
related: LGBTQ+ partners
related: Significant others
related: Relationship orientation
related: Pairings in fandom
related: Two-Spirit relationships

Two-Spirit people
type: Concept
issued: 2019-05-14
modified: 2026-03-04
replaces: two-spiritPeople
comment: Indigenous people in North America who self-identify as Two-Spirit to reconnect with the multiple gender and sexual roles in Native cultures.
comment: Personas indígenas de Norteamérica que se autoidentifican como dos espíritus para reconectar con los múltiples roles sexuales y de género en las culturas nativas.
alternative label: 2S people
alternative label: Two Spirit people
alternative label: Two Spirited people
alternative label: Two-Spirited people
broader: Non-Euro-American gender and sexual identities
broader: Sexual minorities
change note: Version 4.2.0
has top concept: Gender
in scheme: v3
narrower: Two-Spirit authors
narrower: Two-Spirit families
narrower: Two-Spirit parents
narrower: Two-Spirit chefs
narrower: Closeted Two-Spirit people
narrower: Two-Spirit athletes
narrower: Two-Spirit victims of bullying
narrower: Two-Spirit people in the workplace
narrower: Two-Spirit neurodivergent people
narrower: Two-Spirit artists
narrower: Two-Spirit disabled people
narrower: Two-Spirit comedians
narrower: Two-Spirit partners
narrower: Two-Spirit victims of sexual abuse
narrower: Two-Spirit politicians
narrower: Two-Spirit college students
narrower: Pregnant Two-Spirit people
narrower: Two-Spirit sons
narrower: Two-Spirit teachers
narrower: Two-Spirit academics
narrower: Rural Two-Spirit people
narrower: Two-Spirit students
narrower: Two-Spirit information professionals
narrower: Two-Spirit scientists
narrower: Two-Spirit television personalities
narrower: Two-Spirit victims of crime
narrower: Two-Spirit sex workers
narrower: Two-Spirit celebrities
narrower: Two-Spirit dancers
narrower: Two-Spirit people in arts and media
narrower: Two-Spirit people who use substances
narrower: Two-Spirit people with addictions
narrower: Two-Spirit people practicing sobriety
narrower: Two-Spirit people in recovery
narrower: Two-Spirit people in recovery groups
narrower: Two-Spirit journalists
narrower: Canadian Two-Spirit people
narrower: Two-Spirit brides
narrower: Two-Spirit grooms
narrower: Two-Spirit shepherds
narrower: Two-Spirit law students
narrower: Two-Spirit cattle herders
narrower: Two-Spirit lawyers
narrower: Two-Spirit police officers
narrower: Two-Spirit composers
narrower: Two-Spirit medical professionals
narrower: Two-Spirit medical doctors
narrower: Two-Spirit architects
narrower: Two-Spirit nurses
preferred label: Personas dos espíritus
related: Alyha
related: Berdache
related: Dilbaa
related: Hwame
related: Indigenous LGBTQ+ people
related: Lhamana
related: Nádleehi
related: Native American LGBTQ+ people
related: Niizh manidoowag
related: Ninauposkitzipxpe
related: Quariwarmi
related: Tida wena
related: Winkté
related: Indigiqueer people

Sexual practices
type: Concept
issued: 2019-05-14
modified: 2025-03-20
replaces: sexualPractices
comment: Activities associated with physical and/or mental sexual stimuli, including but not limited to intercourse and sexual pleasure.
comment: Actividades asociadas con estímulos sexuales físicos y/o mentales, que incluyen, entre otros, las relaciones sexuales y el placer sexual.
change note: Version 4.2.0
in scheme: v3
narrower: Anal sex
narrower: Rimming
narrower: Anonymous sex
narrower: Autoerotic asphyxiation
narrower: Anal play
narrower: Fellatio
narrower: Cunnilingus
narrower: Casual sex
narrower: Clitoral sex
narrower: Enemas
narrower: Cottaging (Gay culture)
narrower: Cruising (LGBTQ+ culture)
narrower: Erotic massage
narrower: Exhibitionism
narrower: Fisting
narrower: Frottage
narrower: Getting laid
narrower: Oral sex
narrower: Urine play
narrower: Group sex
narrower: Sexual intercourse
narrower: Kissing
narrower: Manual sex
narrower: Masturbation
narrower: Mud sex
narrower: Mutual masturbation
narrower: Tantric sex
narrower: Nipple play
narrower: Phallic sex
narrower: Phone sex
narrower: Public sex
narrower: Ritual homosexuality
narrower: Rubber and latex fetish
narrower: Safer sex
narrower: Striptease
narrower: Tearoom sex
narrower: Vaginal sex
narrower: Hard swap
narrower: Soft swap
narrower: Body worship
narrower: Breath control
narrower: Douching
narrower: Breast play
narrower: Chest play
narrower: Sensation play
preferred label: Prácticas sexuales
related: Consent
related: BDSM
related: Glory holes
related: Handkerchief codes
related: Sex accessories
related: Sexuality
related: Situational sexual behavior
related: Sodomy
related: Swinging

Eroticism
type: Concept
issued: 2019-05-14
modified: 2025-02-23
replaces: eroticism
comment: The quality of being erotic, or causing sexual attraction, arousal, or desire.
comment: La cualidad de ser erótico, o causar atracción, excitación o deseo sexual.
change note: Version 4.2.0
in scheme: v3
narrower: BDSM
narrower: Homoeroticism
preferred label: Erotismo
related: Physical affection
related: Sexual excitement
related: Sexuality

LGBTQ+ families
type: Concept
issued: 2019-05-14
modified: 2025-03-20
replaces: familiesLGBTQ
comment: Families, whether biological, adoptive, or chosen, in which one or more individuals identify as LGBTQ+.
comment: Familias, ya sean biológicas, adoptivas o elegidas, en las que una o más personas se autoidentifican como LGBTQ+.
alternative label: Families (LGBTQ)
change note: Version 4.2.0
in scheme: v3
narrower: Bisexual families
narrower: Drag families
narrower: Gay families
narrower: Lesbian families
narrower: LGBTQ+ adoptive families
narrower: LGBTQ+ adoptive parents
narrower: LGBTQ+ biological parents
narrower: LGBTQ+ chosen families
narrower: LGBTQ+ foster families
narrower: LGBTQ+ foster parents
narrower: LGBTQ+ parents
narrower: LGBTQ+ partners
narrower: Queer families
narrower: Transgender families
narrower: Aromantic families
narrower: Asexual families
narrower: Intersex families
narrower: LGBTQ+ family generations
preferred label: Familias LGBTQ+
related: LGBTQ+ adoption
related: LGBTQ+ adoptive parenthood
related: LGBTQ+ family planning
related: LGBTQ+ foster parenthood
related: LGBTQ+ parenthood
related: LGBTQ+ social parenthood
related: Siblings
related: Bothies
related: LGBTQ+ children of LGBTQ+ parents
related: Polyamorous families

Transgender people
type: Concept
issued: 2019-05-14
modified: 2026-02-23
replaces: transgenderPeople
comment: Broad term for people who do not conform to their gender assigned at birth. Add more specific terms when possible.
comment: Término amplio para personas que no se ajustan al género asignado al nacer. Agregue términos más específicos cuando sea posible.
alternative label: Trans people
alternative label: Transgendered people
alternative label: Transpeople
alternative label: Trans-people
alternative label: Transgender-identified people
alternative label: Trans-identified people
alternative label: Trans* people
alternative label: Personas trans
alternative label: Personas trans*
broader: LGBTQ+ people
broader: Gender minorities
change note: Version 4.2.0
has top concept: LGBTQ+ people
in scheme: v3
narrower: Agender people
narrower: Androgynous people
narrower: Bigender people
narrower: Demigender people
narrower: FtXs
narrower: Genderfluid people
narrower: MtXs
narrower: Non-binary people
narrower: Older transgender people
narrower: Pangender people
narrower: Third gender people
narrower: Transsexual people
narrower: Transfeminine people
narrower: Transgender children
narrower: Transgender daughters
narrower: Transgender fathers
narrower: Transgender mothers
narrower: Transgender parents
narrower: Transgender sons
narrower: Transgender youth
narrower: Transmasculine people
narrower: Trigender people
narrower: Trans women
narrower: Trans men
narrower: Transgenderqueer people
narrower: Closeted transgender people
narrower: Transgender college students
narrower: Pregnant transgender people
preferred label: Personas transgénero
related: Gender assigned at birth
related: Cisgender people
related: Stealth (Transgender)
related: Crossdressers
related: Hormone therapy (Gender)
related: Non-Euro-American gender and sexual identities
related: Eonist people
related: Gender-affirming surgery
related: Gender diversity
related: Gender identity
related: Gender identity disorder
related: Gender markers
related: Gender non-conforming people
related: Genderqueer people
related: Males
related: No hormone identity
related: Non-operative
related: Parents of transgender people
related: Partners of transgender people
related: Passing (Gender)
related: Persecution of transgender people
related: Post-operative
related: Pre-operative
related: Reading (Gender)
related: Transgender characters
related: Transgender community
related: Transgender community centers
related: Transgender identity
related: Transgender people in the military
related: Transgenderism

Sex accessories
type: Concept
issued: 2019-05-14
modified: 2025-03-20
replaces: sexAccessories
comment: Objects, devices, or articles of clothing used for sexual stimulation or to enhance sexual pleasure and experiences.
comment: Objetos, dispositivos o prendas de vestir utilizadas para la estimulación sexual o para mejorar el placer y las experiencias sexuales.
change note: Version 4.2.0
in scheme: v3
narrower: Anal beads
narrower: Ballgags
narrower: Blindfolds
narrower: Sex dolls
narrower: Butt plugs
narrower: Clit rings
narrower: Cock rings
narrower: Enemas
narrower: Collars
narrower: Condoms
narrower: Dental dams
narrower: Dildo harnesses
narrower: Dildos
narrower: Floggers
narrower: Harnesses
narrower: Latex gloves
narrower: Leashes
narrower: Lingerie
narrower: Lubricants
narrower: Nipple clamps
narrower: Spanking paddles
narrower: Restraints
narrower: Rope play
narrower: Vibrators
narrower: Whips
narrower: Violet wands
narrower: Jockstraps
narrower: Sex swings
narrower: Gloves (Erotic)
narrower: Gas masks (Erotic)
narrower: Body bags (Erotic)
narrower: Clamps (Erotic)
narrower: Clothespins (Erotic)
narrower: Hoods (Erotic)
narrower: Masks (Erotic)
preferred label: Accesorios sexuales
related: Sex shops
related: Sex (Act)
related: Sexual practices
related: Sexuality
related: Kink accessories

Sex (Body)
type: Concept
issued: 2019-05-14
modified: 2025-02-23
replaces: sexBody
comment: The category assigned to an individual to describe their body and its role in sexual reproduction, usually based on external anatomy, but also including chromosomes, gene expression, hormones, and internal and external reproductive/sexual organs. Although sex is often described as binary, it exists as a spectrum with significant variation in the biological attributes that comprise sex and the way it is defined in different cultural contexts.
comment: La categoría asignada a una persona para describir su cuerpo y su papel en la reproducción sexual, generalmente basada en la anatomía externa, pero que también incluye cromosomas, expresión genética, hormonas y órganos reproductivos/sexuales internos y externos. Aunque el sexo a menudo se describe como binario, existe como un espectro con variaciones significativas en los atributos biológicos que lo componen y la forma en que se define en diferentes contextos culturales.
change note: Version 4.2.0
in scheme: v3
narrower: Chromosomes
narrower: Intersex
narrower: Genitals
narrower: Gonads
narrower: Hormones
narrower: Secondary sex characteristics
narrower: Assigned sex
narrower: Endosex
preferred label: Sexo (cuerpo)
related: Gender

Pronouns
type: Concept
issued: 2019-05-14
modified: 2025-02-23
replaces: pronouns
comment: Words used in place of a noun. Typically used in the context of "personal pronouns," or pronouns used to describe people (e.g., she, he, they, ze).
comment: Palabras utilizadas en lugar de un sustantivo. Normalmente se utiliza en el contexto de "pronombres personales" o pronombres utilizados para describir personas (por ejemplo, ella, él, elle, ellxs).
alternative label: Personal pronouns
alternative label: Pronombres personales
change note: Version 4.2.0
in scheme: v3
narrower: Ae/Aer/Aerself (Pronouns)
narrower: Co/Co/Coself (Pronouns)
narrower: Cy/Cyb/Cyberself (Pronouns)
narrower: E/Em/Emself (Pronouns)
narrower: Ey/Em/Eirself (Pronouns)
narrower: Fe/Fem/Femself (Pronouns)
narrower: Fae/Faer/Faerself (Pronouns)
narrower: Fey/Fem/Femself (Pronouns)
narrower: He/Him/Himself (Pronouns)
narrower: Hu/Hum/Humself (Pronouns)
narrower: It/It/Itself (Pronouns)
narrower: Jee/Jem/Jemself (Pronouns)
narrower: Kit/Kit/Kitself (Pronouns)
narrower: Ne/Nir/Nemself (Pronouns)
narrower: Ne/Nem/Nis (Pronouns)
narrower: Peh/Pehm/Pehself (Pronouns)
narrower: Per/Per/Perself (Pronouns)
narrower: Sie/Hir/Hirself (Pronouns)
narrower: Se/Ser/Serself (Pronouns)
narrower: She/Her/Herself (Pronouns)
narrower: Shi/Hir/Hirself (Pronouns)
narrower: Si/Hyr/Hyrself (Pronouns)
narrower: They/Them/Themselves (Pronouns)
narrower: They/Them/Themself (Pronouns)
narrower: Thon/Thon/Thonself (Pronouns)
narrower: Ve/Ver/Verself (Pronouns)
narrower: Ve/Vem/Verself (Pronouns)
narrower: Voi/Void/Voidself (Pronouns)
narrower: Vi/Ver/Virself (Pronouns)
narrower: Vi/Vim/Virself (Pronouns)
narrower: Xie/Xer/Xerself (Pronouns)
narrower: Xe/Xyr/Xemself (Pronouns)
narrower: Xey/Xem/Xyr (Pronouns)
narrower: Xey/Xem/Xeir (Pronouns)
narrower: Yo/Yo/Yosself (Pronouns)
narrower: Ze/Zir/Zirself (Pronouns)
narrower: Ze/Hir/Hirself (Pronouns)
narrower: Ze/Zem/Zirself (Pronouns)
narrower: Ze/Mer/Zemself (Pronouns)
narrower: Zee/Zed/Zedself (Pronouns)
narrower: Zie/Zir/Zirself (Pronouns)
narrower: Zie/Zem/Zirself (Pronouns)
narrower: Zie/Hir/Hirself (Pronouns)
narrower: Zme/Zmyr/Zmyrself (Pronouns)
preferred label: Pronombres
related: Misgendering
related: Neopronouns
related: Gender-neutral language

Sexual identity
type: Concept
issued: 2019-05-14
modified: 2025-03-20
replaces: sexualIdentity
comment: How an individual understands their identity in relation to their romantic or sexual attraction to other people.
comment: Cómo una persona entiende su identidad en relación con su atracción romántica o sexual hacia otras personas.
change note: Version 4.2.0
in scheme: v3
narrower: Banjees
narrower: Bears (Gay culture)
narrower: Bisexual identity
narrower: Bottoms (Sex)
narrower: Butches
narrower: Chubs (Gay culture)
narrower: Dandies
narrower: Demisexual people
narrower: Femmes
narrower: Gay identity
narrower: Heterosexual identity
narrower: Lesbian identity
narrower: LGBTQ+ dominants
narrower: LGBTQ+ mistresses (BDSM culture)
narrower: Otters (Gay culture)
narrower: Pederasts
narrower: Pups (Roleplay)
narrower: Queer identity
narrower: Same-gender-loving
narrower: LGBTQ+ submissives
narrower: Soft butches
narrower: Stone butches
narrower: Switches (Sex)
narrower: Tops (Sex)
narrower: Twinks (Gay culture)
narrower: Wolves (Gay culture)
narrower: Polysexuality
narrower: Megasexuality
narrower: Vers (Sex)
narrower: Pansexuality
narrower: Sapphic identity
narrower: Kinky people
narrower: Ky-ky (Gender role)
preferred label: Identidad sexual
related: Sadomasochism
related: Ball culture
related: Essentialism
related: Butch-femme relationships
related: Cross-cultural relationships
related: Non-Euro-American gender and sexual identities
related: Decadence
related: Lesbian culture
related: BDSM
related: Fuck buddies
related: Gay culture
related: Gender identity
related: Intergenerational relationships
related: Masochism
related: Monogamy
related: Partner preference
related: Polyamory
related: Polygamy
related: Role behavior
related: Roleplay
related: Sadism
related: Sexual diversity
related: Sexual orientation
related: Sexual preference
related: Sexual roles
related: Transgender culture
related: Monosexuality
related: Passing (Sexuality)
related: Monosexual people

Non-Euro-American gender and sexual identities
type: Concept
is replaced by: homoit0000322
issued: 2019-05-14
modified: 2025-04-23
modified: 2022-11-10
replaces: nonEuroAmericanGenderAndSexualIdentities
replaces: namban
comment: Broad term describing gender and sexual identities specific to regions outside of North America and Europe.
comment: Término amplio que describe identidades sexuales y de género específicas a regiones fuera de Norteamérica y Europa.
alternative label: Culturally-specific gender identities
alternative label: Identidades de género culturalmente específicas ||
broader: Gender identity
change note: Version 4.2.0
has top concept: Gender
in scheme: v3
narrower: Acault
narrower: Agî
narrower: Akava'ine
narrower: Ali
narrower: Alyha
narrower: Androgynos
narrower: Aravani
narrower: Ashtime
narrower: Aylonit
narrower: Bading
narrower: Bakla
narrower: Bantut
narrower: Bayot
narrower: Binabae
narrower: Bissu
narrower: Biza'ah
narrower: Brotherboys
narrower: Burrnesha
narrower: Calabai
narrower: Calalai
narrower: Eunuchs
narrower: Chakka
narrower: Dee
narrower: Dhurani
narrower: Dilbaa
narrower: Fa'afafine
narrower: Fa'afatama
narrower: Fakaleitī
narrower: Femminiello
narrower: Galli
narrower: Güevedoce
narrower: Hemaneh
narrower: Hijras
narrower: Hwame
narrower: Jankha
narrower: Jogappa
narrower: Katoey
narrower: Khusra
narrower: Khwaja sira
narrower: Kinnar
narrower: Köçek
narrower: Kothis
narrower: Khteuy
narrower: Lakin-on
narrower: Takatāpui
narrower: Lhamana
narrower: Māhū
narrower: Mak nyahs
narrower: Mangaiko
narrower: Mashoga
narrower: Metis
narrower: Mukhannathun
narrower: Muxe
narrower: Nádleehi
narrower: Niizh manidoowag
narrower: Ninauposkitzipxpe
narrower: Palao'ana
narrower: Pangender people
narrower: Quariwarmi
narrower: Sak veng
narrower: Sekhet
narrower: Sekrata
narrower: Shiv-Shakthis
narrower: Sistergirls
narrower: Skoptsy

LGBTQ+ African religions
type: Concept
is replaced by: homoit0000928
issued: 2019-05-14
modified: 2022-08-15
modified: 2022-11-17
modified: 2025-02-23
replaces: LGBTQAfricanReligions
replaces: LGBTQNativeAmericanReligions
replaces: LGBTQAsianReligions
replaces: LGBTQReligions
comment: LGBTQ+ people who belong to a religion or hold religious beliefs. For LGBTQ+ people who hold spiritual beliefs or engage in spiritual practices but do not belong to an organized religion, use the term "LGBTQ+ spiritual people."
comment: Personas LGBTQ+ que pertenecen a una religión o tienen creencias religiosas. Para las personas LGBTQ+ que tienen creencias espirituales o sostienen prácticas espirituales pero que no pertenecen a una religión organizada, utilícese el término "personas espirituales LGBTQ+".
alternative label: LGBTQ African religions
alternative label: LGBTQ American Indian religions
alternative label: LGBTQ Native American religions
alternative label: LGBTQ Asian religions
alternative label: LGBTQ+ religions
alternative label: Religiones LGBTQ+
change note: Version 4.2.0
in scheme: v3
narrower: LGBTQ+ Buddhists
narrower: LGBTQ+ Confucianists
narrower: Gay Muslims
narrower: LGBTQ+ Hindus
narrower: LGBTQ+ Shintoists
narrower: LGBTQ+ Taoists
narrower: LGBTQ+ Muslims
narrower: LGBTQ+ Christians
narrower: Jewish LGBTQ+ people
narrower: LGBTQ+ shamans
narrower: LGBTQ+ Pagans
narrower: LGBTQ+ Unitarian Universalists
preferred label: LGBTQ+ Native American religions
preferred label: LGBTQ+ Asian religions
preferred label: LGBTQ+ religious people
preferred label: Personas religiosas LGBTQ+
related: Native American LGBTQ+ people
related: LGBTQ+ atheists
related: LGBTQ+ spiritual people
related: Queer theology
related: LGBTQ+-affirming religious services

Sex (Act)
type: Concept
issued: 2019-05-14
modified: 2025-03-20
replaces: sexAct
comment: The act of engaging in a physical and/or mental interaction with another person or object with the specific intent to elicit sexual arousal or climax.
comment: El acto de participar en una interacción física y/o mental con otra persona u objeto con la intención específica de provocar excitación sexual o clímax.
change note: Version 4.2.0
in scheme: v3
narrower: Anal sex
narrower: Rimming
narrower: Autoerotic asphyxiation
narrower: Anal play
narrower: Fellatio
narrower: Cunnilingus
narrower: Clitoral sex
narrower: Enemas
narrower: Cottaging (Gay culture)
narrower: Cruising (LGBTQ+ culture)
narrower: Erotic massage
narrower: Frottage
narrower: Fucking
narrower: Getting laid
narrower: Oral sex
narrower: Urine play
narrower: Sexual intercourse
narrower: Kissing
narrower: Manual sex
narrower: Masturbation
narrower: Mud sex
narrower: Mutual masturbation
narrower: Tantric sex
narrower: Nipple play
narrower: Phallic sex
narrower: Phone sex
narrower: Roleplay
narrower: Rubber and latex fetish
narrower: Safer sex
narrower: Voyeurism
narrower: Sexting
narrower: Sexual abstinence
narrower: Strap-on sex
narrower: Vaginal sex
narrower: Scissoring
narrower: Tribadism
narrower: Chemsex
narrower: Orgasm control
narrower: Douching
narrower: Breast play
narrower: Chest play
preferred label: Sexo (acto)
related: Consent
related: BDSM
related: Handkerchief codes
related: Libido
related: Sex locations
related: Sex accessories
related: Sexual excitement
related: Sexual function
related: Sexuality
related: Situational sexual behavior
related: Sodomy
related: Yiff

Family members
type: Concept
issued: 2019-05-14
modified: 2025-02-23
replaces: familyMembers
comment: A group of people in kinship through adoption, biology, or choice.
comment: Un grupo de personas en parentesco por adopción, biología o elección.
alternative label: Familiares
alternative label: Miembros de la familia
change note: Version 4.2.0
in scheme: v3
narrower: Children
narrower: Fathers
narrower: Grandchildren
narrower: Grandparents
narrower: Mothers
narrower: Siblings
narrower: Piblings
narrower: Niblings
narrower: Daughters
narrower: Sons
narrower: LGBTQ+ family members
narrower: Family members of LGBTQ+ people
narrower: Parents
preferred label: Membros de familia

Gender
type: Concept
issued: 2019-05-14
modified: 2025-02-23
replaces: gender
comment: A socially constructed system that gives meaning to masculinity and femininity and that unevenly distributes power and opportunity according to cultural interpretations of sex. As an element of personal identity, a gender is developed through the interaction of social roles and expectations, one’s response to those expectations, one’s physiology, and one’s internal sense of self. Gender is culturally specific, meaning that different cultures have different understandings of what gender means and how many genders should be recognized.
comment: Un sistema socialmente construido que da significado a la masculinidad y la feminidad y que distribuye de manera desigual el poder y las oportunidades según las interpretaciones culturales del sexo. Como elemento de identidad personal, el género se desarrolla a través de la interacción de roles y expectativas sociales, la respuesta de una persona a esas expectativas, la fisiología y el sentido interno de la propia persona. El género es culturalmente específico, lo que significa que diferentes culturas tienen diferentes interpretaciones de lo que significa el género y cuántos géneros deben reconocerse.
change note: Version 4.2.0
in scheme: v3
narrower: Assigned gender
narrower: Gender expression
narrower: Gender identity
narrower: Neurogender
preferred label: Género
related: Stealth (Transgender)
related: Gender-affirming surgery
related: Gender binaries
related: Genderism
related: Gender diversity
related: Gender relations
related: Gender segregation
related: Gender studies
related: Gendercide
related: Passing (Gender)
related: Sex (Body)
related: Transgenderism
related: Gender transgression
related: Gender minorities
related: Gender ambiguity

Subcultures
type: Concept
issued: 2019-05-14
modified: 2025-02-23
replaces: subcultures
comment: Groups of people belonging to cultures that differentiate them from the larger culture to which they belong. Subcultures develop their own norms and values regarding cultural, political, and sexual matters.
comment: Grupos de personas pertenecientes a culturas que las diferencian de la cultura más amplia a la que pertenecen. Las subculturas desarrollan sus propias normas y valores en materia cultural, política y sexual.
change note: Version 4.2.0
in scheme: v3
narrower: Ball culture
narrower: Dandyism
narrower: Decadence
narrower: Leather community
narrower: Rubber and latex community
narrower: Gym subculture
narrower: LGBTQ+ culture
narrower: Fandom
narrower: Furry culture
preferred label: Subculturas

LGBTQ+ people
type: Concept
issued: 2019-05-14
modified: 2026-03-03
replaces: LGBTQPeople
comment: Self-identified lesbians, gay men, bisexual people, transgender people, queer people, and other sexual and gender minorities.
comment: Personas que se identifican como lesbianas, gay, bisexuales, transgénero, queer y/o otras minorías sexuales y de género.
alternative label: Gay people
alternative label: LGBTQ people
alternative label: People (LGBTQ)
change note: Version 4.2.0
in scheme: v3
narrower: LGBTQ+ political activists
narrower: LGBTQ+ actors
narrower: LGBTQ+ artists
narrower: LGBTQ+ atheists
narrower: Bi+ people
narrower: Bisexual people
narrower: LGBTQ+ victims of crime
narrower: LGBTQ+ daughters
narrower: LGBTQ+ people who use substances
narrower: LGBTQ+ older people
narrower: Gay men
narrower: Lesbians
narrower: Intersex people
narrower: LGBTQ+ people of shared ethnic or national identities
narrower: LGBTQ+ veterans
narrower: LGBTQ+ unhoused people
narrower: LGBTQ+ incarcerated people
narrower: LGBTQ+ lovers
narrower: LGBTQ+ migrants
narrower: LGBTQ+ musicians
narrower: LGBTQ+ refugees
narrower: LGBTQ+ victims of war
narrower: Men who have sex with men
narrower: Pansexual people
narrower: Queer people
narrower: LGBTQ+ sons
narrower: LGBTQ+ survivors of war
narrower: Transgender people
narrower: Undocumented LGBTQ+ residents
narrower: Women who have sex with women
narrower: LGBTQ+ people in recovery
narrower: LGBTQ+ people with addictions
narrower: LGBTQ+ chefs
narrower: Closeted LGBTQ+ people
narrower: LGBTQ+ immigrants
narrower: LGBTQ+ asylum seekers
narrower: LGBTQ+ disabled people
narrower: LGBTQ+ people with chronic illnesses
narrower: Polysexual people
narrower: LGBTQ+ athletes
narrower: LGBTQ+ victims of bullying
narrower: LGBTQ+ people in fandom
narrower: Substance abuse
narrower: LGBTQ+ people in Adult Children of Alcoholics
narrower: Sobriety
narrower: Sapphics
narrower: MLM (Men Loving Men)
narrower: WLW (Women Loving Women)
narrower: Adopted LGBTQ+ people
narrower: LGBTQ+ siblings
narrower: LGBTQ+ grandchildren
narrower: LGBTQ+ grandparents
narrower: LGBTQ+ family members
narrower: LGBTQ+ children of LGBTQ+ parents
narrower: LGBTQ+ teachers
narrower: LGBTQ+ academics
narrower: Rural LGBTQ+ people
narrower: LGBTQ+ students
narrower: LGBTQ+ people of color
narrower: LGBTQ+ scientists
narrower: LGBTQ+ television personalities
narrower: LGBTQ+ philanthropists
narrower: LGBTQ+ punks
narrower: Uranic people
narrower: Neptunic people
narrower: Saturnic people
narrower: LGBTQ+ sex workers
narrower: LGBTQ+ authors
narrower: LGBTQ+ celebrities